"molecule_id","AMW","C.","H.","Me","Mi","Mp","Mv","MW","N.","nAB","nAT","nB","nBM","nBO","nBR","nBT","nC","nCL","nCsp","nCsp2","nCsp3","nDB","nF","nH","nHet","nHM","nI","nN","nO","nP","nS","nSK","nTB","nX","O.","RBF","RBN","SCBO","Se","Si","Sp","Sv","X.","pXC50"
{1 9.335,2 43.2,3 40.9,4 1.013,5 1.12,6 0.725,7 0.682,8 410.75,9 6.8,10 17,11 44,13 17,14 28,16 46,17 19,18 3,20 15,21 4,24 18,25 7,26 3,28 3,29 1,32 26,34 3,35 2.3,36 0.152,37 7,38 36.5,39 44.556,40 49.273,41 31.898,42 30.003,43 6.8,44 8.523}
{0 CHEMBL161864,1 10.573,2 43.2,3 43.2,4 1.001,5 1.116,6 0.728,7 0.672,8 465.21,9 6.8,10 17,11 44,13 17,14 27,15 2,16 46,17 19,20 15,21 4,24 19,25 6,26 2,28 3,29 1,32 25,34 2,35 2.3,36 0.152,37 7,38 35.5,39 44.043,40 49.124,41 32.029,42 29.571,43 4.5,44 8.523}
{0 CHEMBL180289,1 10.192,2 39.1,3 41.3,4 1.012,5 1.125,6 0.727,7 0.676,8 468.84,9 10.9,10 16,11 46,13 16,14 30,15 1,16 49,17 18,18 1,20 12,21 6,24 19,25 9,26 3,28 5,29 1,31 1,32 27,34 2,35 2.2,36 0.122,37 6,38 38,39 46.534,40 51.728,41 33.432,42 31.076,43 4.3,44 8.523}
{0 CHEMBL180309,1 10.047,2 39.6,3 45.8,4 1.001,5 1.126,6 0.704,7 0.648,8 482.25,9 8.3,10 16,11 48,13 16,14 28,15 2,16 50,17 19,20 13,21 6,24 22,25 7,26 2,28 4,29 1,32 26,34 2,35 2.1,36 0.18,37 9,38 36,39 48.029,40 54.038,41 33.796,42 31.119,43 4.2,44 7.77}
{0 CHEMBL181335,1 9.093,2 38.3,3 42.6,4 1.016,5 1.127,6 0.705,7 0.662,8 427.39,9 8.5,10 16,11 47,13 16,14 29,16 49,17 18,18 2,20 12,21 6,24 20,25 9,26 3,28 4,29 2,31 1,32 27,34 2,35 4.3,36 0.184,37 9,38 37,39 47.738,40 52.957,41 33.148,42 31.099,43 4.3,44 8.523}
{0 CHEMBL181496,1 10.039,2 38.3,3 42.6,4 1.014,5 1.125,6 0.716,7 0.666,8 471.84,9 8.5,10 16,11 47,13 16,14 29,15 1,16 49,17 18,18 1,20 12,21 6,24 20,25 9,26 3,28 4,29 2,31 1,32 27,34 2,35 4.3,36 0.184,37 9,38 37,39 47.643,40 52.854,41 33.642,42 31.296,43 4.3,44 8.523}
{0 CHEMBL181657,1 9.18,2 44.2,3 41.9,4 1.005,5 1.118,6 0.731,7 0.681,8 394.75,9 7,10 17,11 43,13 17,14 27,16 45,17 19,18 3,20 15,21 4,24 18,25 6,26 3,28 3,32 25,34 3,36 0.156,37 7,38 35.5,39 43.229,40 48.064,41 31.443,42 29.288,43 7,44 7}
{0 CHEMBL182064,1 9.797,2 38.5,3 46.2,4 0.996,5 1.125,6 0.719,7 0.646,8 509.46,9 9.6,10 16,11 52,13 16,14 31,16 55,17 20,20 12,21 8,24 24,25 8,26 2,27 1,28 5,29 1,31 1,32 28,34 1,35 1.9,36 0.127,37 7,38 39,39 51.818,40 58.494,41 37.404,42 33.594,43 1.9,44 8.523}
{0 CHEMBL182225,1 10.44,2 39.1,3 43.5,4 1.003,5 1.13,6 0.714,7 0.661,8 480.24,9 13,10 16,11 46,13 16,14 29,15 2,16 49,17 18,20 12,21 6,24 20,25 8,26 2,28 6,32 26,34 2,36 0.122,37 6,38 37,39 46.138,40 51.995,41 32.83,42 30.393,43 4.3,44 7.959}
{0 CHEMBL182263,1 10.688,2 41.5,3 43.9,4 0.998,5 1.122,6 0.727,7 0.667,8 438.19,9 9.8,10 16,11 41,13 16,14 25,15 2,16 43,17 17,20 13,21 4,24 18,25 6,26 2,28 4,32 23,34 2,36 0.163,37 7,38 33,39 40.934,40 45.998,41 29.819,42 27.35,43 4.9,44 7.538}
{0 CHEMBL182304,1 9.106,2 44.4,3 42.2,4 1.008,5 1.115,6 0.726,7 0.678,8 409.76,9 4.4,10 17,11 45,13 17,14 28,16 47,17 20,18 3,20 16,21 4,24 19,25 6,26 3,28 2,29 1,32 26,34 3,35 2.2,36 0.149,37 7,38 36.5,39 45.338,40 50.19,41 32.654,42 30.508,43 6.7,44 5.745}
{0 CHEMBL182414,1 10.205,2 40,3 44,4 1.007,5 1.125,6 0.705,7 0.657,8 510.26,9 8,10 17,11 50,13 17,14 30,15 2,16 52,17 20,20 14,21 6,24 22,25 8,26 2,28 4,29 2,32 28,34 2,35 4,36 0.173,37 9,38 38.5,39 50.356,40 56.247,41 35.25,42 32.834,43 4,44 8.013}
{0 CHEMBL182604,1 10.368,2 38.6,3 45.5,4 1.003,5 1.128,6 0.705,7 0.65,8 456.21,9 9.1,10 12,11 44,13 12,14 26,15 2,16 46,17 17,20 10,21 7,24 20,25 7,26 2,28 4,29 1,32 24,34 2,35 2.3,36 0.152,37 7,38 32,39 44.145,40 49.623,41 31.035,42 28.592,43 4.5,44 6.237}
{0 CHEMBL182650,1 10.505,2 40.5,3 45.2,4 1.001,5 1.122,6 0.715,7 0.656,8 441.19,9 7.1,10 12,11 42,13 13,14 24,15 2,16 43,17 17,20 13,21 4,22 1,24 19,25 6,26 2,28 3,29 1,32 23,34 2,35 2.4,36 0.163,37 7,38 31,39 42.043,40 47.124,41 30.029,42 27.571,43 4.8,44 6.481}
{0 CHEMBL182767,1 10.985,2 38.3,3 42.6,4 1.012,5 1.122,6 0.726,7 0.67,8 516.29,9 8.5,10 16,11 47,13 16,14 29,15 2,16 49,17 18,20 12,21 6,24 20,25 9,26 3,28 4,29 2,31 1,32 27,34 2,35 4.3,36 0.184,37 9,38 37,39 47.549,40 52.752,41 34.137,42 31.494,43 4.3,44 8.31}
{0 CHEMBL182821,1 9.162,2 38.5,3 48.1,4 0.991,5 1.132,6 0.698,7 0.629,8 476.41,9 11.5,10 16,11 52,13 16,14 30,16 55,17 20,20 12,21 8,24 25,25 7,26 1,27 1,28 6,32 27,34 1,36 0.127,37 7,38 38,39 51.516,40 58.862,41 36.307,42 32.713,43 1.9,44 7.745}
{0 CHEMBL182960,1 10.979,2 40,3 42.5,4 1.004,5 1.127,6 0.727,7 0.671,8 439.18,9 12.5,10 16,11 40,13 16,14 25,15 2,16 42,17 16,20 12,21 4,24 17,25 7,26 2,28 5,32 23,34 2,36 0.167,37 7,38 33,39 40.152,40 45.081,41 29.063,42 26.845,43 5,44 8.301}
{0 CHEMBL183022,1 8.427,2 40,3 44,4 1.011,5 1.129,6 0.685,7 0.649,8 421.36,9 8,10 17,11 50,13 17,14 30,16 52,17 20,18 2,20 14,21 6,24 22,25 8,26 2,28 4,29 2,32 28,34 2,35 4,36 0.173,37 9,38 38.5,39 50.545,40 56.452,41 34.262,42 32.438,43 4,44 8.523}
{0 CHEMBL183110,1 8.97,2 39.6,3 49.1,4 0.987,5 1.128,6 0.699,7 0.627,8 475.42,9 9.4,10 16,11 53,13 16,14 30,16 56,17 21,20 13,21 8,24 26,25 6,26 1,27 1,28 5,32 27,34 1,36 0.125,37 7,38 38,39 52.298,40 59.779,41 37.063,42 33.219,43 1.9,44 7.796}
{0 CHEMBL185486,1 8.334,2 38.5,3 48.1,4 1,5 1.131,6 0.667,7 0.622,8 433.39,9 7.7,10 16,11 52,13 16,14 29,15 1,16 54,17 20,20 13,21 7,24 25,25 7,26 1,28 4,29 2,32 27,34 1,35 3.8,36 0.185,37 10,38 37,39 52.011,40 58.821,41 34.66,42 32.335,43 1.9,44 7.77}
{0 CHEMBL185520,1 10.749,2 44.2,3 41.9,4 0.998,5 1.116,6 0.74,7 0.683,8 462.21,9 9.3,10 16,11 43,13 17,14 27,15 2,16 45,17 19,19 1,20 14,21 4,24 18,25 6,26 2,28 4,32 25,33 1,34 2,36 0.156,37 7,38 37,39 42.934,40 47.998,41 31.819,42 29.35,43 4.7,44 7.268}
{0 CHEMBL2096779,1 10.44,2 39.1,3 43.5,4 1.003,5 1.13,6 0.714,7 0.661,8 480.24,9 13,10 16,11 46,13 16,14 29,15 2,16 49,17 18,20 12,21 6,24 20,25 8,26 2,28 6,32 26,34 2,36 0.122,37 6,38 37,39 46.138,40 51.995,41 32.83,42 30.393,43 4.3,44 8.201}
{0 CHEMBL359723,1 9.575,2 44.2,3 39.5,4 1.018,5 1.116,6 0.729,7 0.691,8 411.73,9 4.7,10 12,11 43,13 14,14 28,16 45,17 19,18 3,20 15,21 4,22 2,24 17,25 7,26 3,28 2,29 2,32 26,34 3,35 4.7,36 0.156,37 7,38 36,39 43.782,40 47.984,41 31.347,42 29.696,43 7,44 6}
{0 CHEMBL359928,1 11.806,2 40,3 40,4 1.011,5 1.118,6 0.754,7 0.693,8 472.23,9 10,10 16,11 40,13 16,14 26,15 2,16 42,17 16,20 12,21 4,24 16,25 8,26 3,28 4,29 1,31 1,32 24,34 2,35 2.5,36 0.167,37 7,38 34,39 40.454,40 44.712,41 30.159,42 27.726,43 5,44 8.409}
{0 CHEMBL360130,1 9.316,2 40,3 44,4 1.009,5 1.127,6 0.695,7 0.653,8 465.81,9 8,10 17,11 50,13 17,14 30,15 1,16 52,17 20,18 1,20 14,21 6,24 22,25 8,26 2,28 4,29 2,32 28,34 2,35 4,36 0.173,37 9,38 38.5,39 50.451,40 56.35,41 34.756,42 32.636,43 4,44 8.523}
{0 CHEMBL360789,1 9.148,2 44.2,3 41.9,4 1.005,5 1.11,6 0.737,7 0.682,8 393.36,9 4.7,10 17,11 43,13 17,14 27,16 45,17 19,18 2,20 15,21 4,24 18,25 6,26 3,28 2,29 1,31 1,32 25,34 2,35 2.3,36 0.156,37 7,38 35.5,39 43.207,40 47.751,41 31.682,42 29.341,43 4.7,44 6.167}
{0 CHEMBL361649,1 10.197,2 40.4,3 44.7,4 0.998,5 1.126,6 0.715,7 0.657,8 479.25,9 10.6,10 16,11 47,13 16,14 29,15 2,16 50,17 19,20 13,21 6,24 21,25 7,26 2,28 5,32 26,34 2,36 0.12,37 6,38 37,39 46.92,40 52.912,41 33.586,42 30.899,43 4.3,44 7.886}
{0 CHEMBL361747,1 11.806,2 40,3 40,4 1.011,5 1.118,6 0.754,7 0.693,8 472.23,9 10,10 16,11 40,13 16,14 26,15 2,16 42,17 16,20 12,21 4,24 16,25 8,26 3,28 4,29 1,31 1,32 24,34 2,35 2.5,36 0.167,37 7,38 34,39 40.454,40 44.712,41 30.159,42 27.726,43 5,44 6.824}
{0 CHEMBL361759,1 10.473,2 42.6,3 42.6,4 1.003,5 1.12,6 0.724,7 0.672,8 492.24,9 8.5,10 18,11 47,13 18,14 29,15 2,16 49,17 20,20 16,21 4,24 20,25 7,26 2,28 4,29 1,32 27,34 2,35 2.1,36 0.163,37 8,38 38,39 47.145,40 52.623,41 34.035,42 31.592,43 4.3,44 6}
{0 CHEMBL361788,1 11.158,2 39.1,3 41.3,4 1.01,5 1.122,6 0.738,7 0.68,8 513.29,9 10.9,10 16,11 46,13 16,14 30,15 2,16 49,17 18,20 12,21 6,24 19,25 9,26 3,28 5,29 1,31 1,32 27,34 2,35 2.2,36 0.122,37 6,38 38,39 46.44,40 51.626,41 33.927,42 31.274,43 4.3,44 7.886}
{0 CHEMBL362023,1 9.165,2 37.3,3 45.1,4 1.01,5 1.128,6 0.686,7 0.641,8 467.43,9 7.8,10 16,11 51,13 16,14 30,15 1,16 53,17 19,20 12,21 7,24 23,25 9,26 2,28 4,29 3,31 1,32 28,34 1,35 5.9,36 0.189,37 10,38 38,39 51.531,40 57.535,41 35,42 32.71,43 2,44 8.481}
{0 CHEMBL368020,1 8.544,2 38.9,3 46.3,4 1.006,5 1.13,6 0.669,7 0.631,8 461.4,9 7.4,10 17,11 54,13 17,14 31,15 1,16 56,17 21,20 14,21 7,24 25,25 8,26 1,28 4,29 3,32 29,34 1,35 5.6,36 0.179,37 10,38 39.5,39 54.338,40 61.03,41 36.114,42 34.05,43 1.9,44 8.155}
{0 CHEMBL368690,1 8.774,2 44.2,3 41.9,4 1.011,5 1.117,6 0.709,7 0.671,8 377.29,9 4.7,10 17,11 43,13 17,14 27,16 45,17 19,18 2,20 15,21 4,24 18,25 6,26 2,28 2,29 2,32 25,34 2,35 4.7,36 0.156,37 7,38 35.5,39 43.458,40 48.04,41 30.489,42 28.869,43 4.7,44 7.42}
{0 CHEMBL368875,1 11.494,2 41.5,3 41.5,4 1.006,5 1.113,6 0.754,7 0.689,8 471.24,9 7.3,10 16,11 41,13 16,14 26,15 2,16 43,17 17,20 13,21 4,24 17,25 7,26 3,28 3,29 1,31 1,32 24,34 2,35 2.4,36 0.163,37 7,38 34,39 41.236,40 45.629,41 30.915,42 28.231,43 4.9,44 8.208}
{0 CHEMBL369122,1 8.195,2 39.6,3 45.8,4 1.005,5 1.13,6 0.683,7 0.64,8 393.35,9 8.3,10 16,11 48,13 16,14 28,16 50,17 19,18 2,20 13,21 6,24 22,25 7,26 2,28 4,29 1,32 26,34 2,35 2.1,36 0.18,37 9,38 36,39 48.218,40 54.243,41 32.807,42 30.723,43 4.2,44 8.523}
{0 CHEMBL369342,1 11.494,2 41.5,3 41.5,4 1.006,5 1.113,6 0.754,7 0.689,8 471.24,9 7.3,10 16,11 41,13 16,14 26,15 2,16 43,17 17,20 13,21 4,24 17,25 7,26 3,28 3,29 1,31 1,32 24,34 2,35 2.4,36 0.163,37 7,38 34,39 41.236,40 45.629,41 30.915,42 28.231,43 4.9,44 8.398}
{0 CHEMBL424799,1 9.121,2 39.6,3 45.8,4 1.003,5 1.128,6 0.694,7 0.644,8 437.8,9 8.3,10 16,11 48,13 16,14 28,15 1,16 50,17 19,18 1,20 13,21 6,24 22,25 7,26 2,28 4,29 1,32 26,34 2,35 2.1,36 0.18,37 9,38 36,39 48.123,40 54.14,41 33.302,42 30.921,43 4.2,44 8.42}
{0 CHEMBL425169,1 10.842,2 41.9,3 41.9,4 1.006,5 1.121,6 0.727,7 0.676,8 466.2,9 9.3,10 17,11 43,13 17,14 27,15 2,16 45,17 18,20 14,21 4,24 18,25 7,26 2,28 4,29 1,32 25,34 2,35 2.3,36 0.156,37 7,38 35.5,39 43.262,40 48.207,41 31.273,42 29.065,43 4.7,44 8.092}
{0 CHEMBL425706,1 9.153,2 40,3 47.3,4 0.993,5 1.127,6 0.7,7 0.635,8 503.43,9 9.1,10 17,11 55,13 17,14 32,16 58,17 22,20 14,21 8,24 26,25 7,26 1,27 1,28 5,29 1,32 29,34 1,35 1.8,36 0.121,37 7,38 40.5,39 54.625,40 61.989,41 38.517,42 34.933,43 1.8,44 7.77}
{0 CHEMBL426613,1 9.445,2 40.8,3 42.9,4 1.007,5 1.127,6 0.705,7 0.662,8 462.81,9 10.2,10 17,11 49,13 17,14 31,15 1,16 52,17 20,18 1,20 14,21 6,24 21,25 8,26 2,28 5,29 1,32 28,34 2,35 2,36 0.115,37 6,38 39.5,39 49.342,40 55.223,41 34.546,42 32.416,43 4.1,44 8.086}
