{
  "data_set_description": {
    "collection_date": "November 2013",
    "creator": "Dr Jeremy Besnard, Dr Ivan Olier, Dr Noureddin Sadawi, Dr Larisa Soldatova, Dr Crina Grosan, Prof Ross King, Dr Richard Bickerton, Prof Andrew Hopkins and Dr Willem van Hoorn",
    "default_target_attribute": "pXC50",
    "description": "This dataset contains QSAR data (from ChEMBL version 17) showing activity values (unit is pseudo-pCI50) of several compounds on drug target ChEMBL_ID: CHEMBL5344 (TID: 101156), and it has 25 rows and 43 features (not including molecule IDs and class feature: molecule_id and pXC50). The features represent Basic Molecular Descriptors which were generated from SMILES strings.  Missing value imputation was applied to this dataset (By choosing the Median).",
    "description_version": "1",
    "file_id": "3690721",
    "format": "ARFF",
    "id": "40188",
    "licence": "Public",
    "md5_checksum": "e685ab2e8300a93cf5ea3b553d5d8373",
    "minio_url": "https://data.openml.org/datasets/0004/40188/dataset_40188.pq",
    "name": "QSAR-DATASET-FOR-DRUG-TARGET-CHEMBL5344",
    "original_data_url": "https://www.ebi.ac.uk/chembl/target/inspect/CHEMBL5344",
    "parquet_url": "https://data.openml.org/datasets/0004/40188/dataset_40188.pq",
    "processing_date": "2018-10-04 06:55:42",
    "row_id_attribute": "molecule_id",
    "status": "deactivated",
    "tag": [
      "MetaQSAR",
      "study_13"
    ],
    "upload_date": "2016-07-16T10:35:25",
    "url": "https://api.openml.org/data/v1/download/3690721/QSAR-DATASET-FOR-DRUG-TARGET-CHEMBL5344.arff",
    "version": "12",
    "visibility": "public"
  }
}