"molecule_id","FCFP4_1024b1","FCFP4_1024b10","FCFP4_1024b100","FCFP4_1024b1000","FCFP4_1024b1001","FCFP4_1024b1002","FCFP4_1024b1003","FCFP4_1024b1004","FCFP4_1024b1005","FCFP4_1024b1006","FCFP4_1024b1007","FCFP4_1024b1008","FCFP4_1024b1009","FCFP4_1024b101","FCFP4_1024b1010","FCFP4_1024b1011","FCFP4_1024b1012","FCFP4_1024b1013","FCFP4_1024b1014","FCFP4_1024b1015","FCFP4_1024b1016","FCFP4_1024b1017","FCFP4_1024b1018","FCFP4_1024b1019","FCFP4_1024b102","FCFP4_1024b1020","FCFP4_1024b1021","FCFP4_1024b1022","FCFP4_1024b1023","FCFP4_1024b1024","FCFP4_1024b103","FCFP4_1024b104","FCFP4_1024b105","FCFP4_1024b106","FCFP4_1024b107","FCFP4_1024b108","FCFP4_1024b109","FCFP4_1024b11","FCFP4_1024b110","FCFP4_1024b111","FCFP4_1024b112","FCFP4_1024b113","FCFP4_1024b114","FCFP4_1024b115","FCFP4_1024b116","FCFP4_1024b117","FCFP4_1024b118","FCFP4_1024b119","FCFP4_1024b12","FCFP4_1024b120","FCFP4_1024b121","FCFP4_1024b122","FCFP4_1024b123","FCFP4_1024b124","FCFP4_1024b125","FCFP4_1024b126","FCFP4_1024b127","FCFP4_1024b128","FCFP4_1024b129","FCFP4_1024b13","FCFP4_1024b130","FCFP4_1024b131","FCFP4_1024b132","FCFP4_1024b133","FCFP4_1024b134","FCFP4_1024b135","FCFP4_1024b136","FCFP4_1024b137","FCFP4_1024b138","FCFP4_1024b139","FCFP4_1024b14","FCFP4_1024b140","FCFP4_1024b141","FCFP4_1024b142","FCFP4_1024b143","FCFP4_1024b144","FCFP4_1024b145","FCFP4_1024b146","FCFP4_1024b147","FCFP4_1024b148","FCFP4_1024b149","FCFP4_1024b15","FCFP4_1024b150","FCFP4_1024b151","FCFP4_1024b152","FCFP4_1024b153","FCFP4_1024b154","FCFP4_1024b155","FCFP4_1024b156","FCFP4_1024b157","FCFP4_1024b158","FCFP4_1024b159","FCFP4_1024b16","FCFP4_1024b160","FCFP4_1024b161","FCFP4_1024b162","FCFP4_1024b163","FCFP4_1024b164","FCFP4_1024b165","FCFP4_1024b166","FCFP4_1024b167","FCFP4_1024b168","pXC50"
{1 1,72 1,103 4.854}
{0 CHEMBL1766584,1 1,2 1,68 1,72 1,103 4}
{0 CHEMBL1766585,1 1,50 1,64 1,72 1,103 4}
{0 CHEMBL1766586,1 1,50 1,64 1,68 1,72 1,103 4}
{0 CHEMBL1766587,1 1,2 1,35 1,36 1,85 1,103 5.056}
{0 CHEMBL1766588,1 1,2 1,24 1,35 1,36 1,85 1,103 4.824}
{0 CHEMBL1766589,1 1,2 1,35 1,36 1,85 1,103 4.699}
{0 CHEMBL1766590,1 1,2 1,35 1,70 1,85 1,103 4}
{0 CHEMBL1766591,1 1,35 1,81 1,103 5.678}
{0 CHEMBL1766592,1 1,26 1,103 5.745}
{0 CHEMBL1766593,1 1,2 1,4 1,33 1,68 1,98 1,103 4.745}
{0 CHEMBL1766594,1 1,24 1,35 1,103 4}
{0 CHEMBL1766595,1 1,2 1,24 1,50 1,53 1,70 1,75 1,103 4}
{0 CHEMBL1766599,1 1,24 1,72 1,103 4.95}
{0 CHEMBL1766600,1 1,72 1,103 4.071}
{0 CHEMBL1766601,1 1,72 1,103 4.798}
{0 CHEMBL1766602,1 1,72 1,103 4.743}
{0 CHEMBL1766603,1 1,3 1,72 1,103 4.552}
{0 CHEMBL1766605,1 1,72 1,103 5.033}
{0 CHEMBL1766606,1 1,49 1,72 1,103 5.211}
{0 CHEMBL1766607,1 1,24 1,49 1,72 1,103 5.089}
{0 CHEMBL1766608,1 1,24 1,49 1,72 1,103 5.109}
{0 CHEMBL1766609,1 1,24 1,49 1,72 1,103 5.404}
{0 CHEMBL1766713,1 1,72 1,103 5.158}
{0 CHEMBL1766714,1 1,24 1,49 1,70 1,72 1,103 5.109}
{0 CHEMBL1766716,1 1,72 1,103 4.921}
{0 CHEMBL1766717,1 1,72 1,103 5.109}
{0 CHEMBL1766718,1 1,72 1,103 5.532}
{0 CHEMBL1766719,1 1,2 1,72 1,103 5.206}
{0 CHEMBL1766720,1 1,72 1,103 4.847}
{0 CHEMBL1766721,1 1,24 1,72 1,103 4.101}
{0 CHEMBL1766723,1 1,58 1,72 1,103 5.158}
{0 CHEMBL1766724,1 1,72 1,103 5.153}
{0 CHEMBL1766726,1 1,2 1,68 1,72 1,103 4.251}
{0 CHEMBL1766727,1 1,70 1,72 1,103 5.547}
{0 CHEMBL1766729,1 1,2 1,49 1,68 1,72 1,103 4.552}
{0 CHEMBL1766730,1 1,2 1,49 1,70 1,72 1,103 5.211}
{0 CHEMBL1766735,1 1,49 1,72 1,103 4.965}
{0 CHEMBL1766736,1 1,49 1,72 1,103 5.306}
