{
  "data_features": {
    "feature": [
      {
        "data_type": "nominal",
        "index": "0",
        "is_ignore": "false",
        "is_row_identifier": "true",
        "is_target": "false",
        "name": "molecule_id",
        "nominal_value": [
          "CHEMBL100480",
          "CHEMBL100940",
          "CHEMBL101396",
          "CHEMBL102092",
          "CHEMBL102160",
          "CHEMBL102497",
          "CHEMBL104042",
          "CHEMBL104310",
          "CHEMBL104376",
          "CHEMBL104436",
          "CHEMBL104559",
          "CHEMBL104842",
          "CHEMBL104950",
          "CHEMBL105665",
          "CHEMBL106027",
          "CHEMBL106085",
          "CHEMBL106166",
          "CHEMBL106853",
          "CHEMBL106910",
          "CHEMBL107386",
          "CHEMBL107398",
          "CHEMBL1076724",
          "CHEMBL1076725",
          "CHEMBL1076726",
          "CHEMBL1076736",
          "CHEMBL1076737",
          "CHEMBL107754",
          "CHEMBL1082323",
          "CHEMBL1082400",
          "CHEMBL1082638",
          "CHEMBL1082639",
          "CHEMBL1082640",
          "CHEMBL1082709",
          "CHEMBL1082968",
          "CHEMBL1082969",
          "CHEMBL1082970",
          "CHEMBL1082971",
          "CHEMBL1083953",
          "CHEMBL1084185",
          "CHEMBL1084186",
          "CHEMBL1084187",
          "CHEMBL108640",
          "CHEMBL108808",
          "CHEMBL1089542",
          "CHEMBL1089543",
          "CHEMBL1089546",
          "CHEMBL1089873",
          "CHEMBL109203",
          "CHEMBL109204",
          "CHEMBL109327",
          "CHEMBL109390",
          "CHEMBL1094879",
          "CHEMBL1095519",
          "CHEMBL109554",
          "CHEMBL109818",
          "CHEMBL10986",
          "CHEMBL111028",
          "CHEMBL112708",
          "CHEMBL113782",
          "CHEMBL115007",
          "CHEMBL115730",
          "CHEMBL1165548",
          "CHEMBL1169580",
          "CHEMBL1169584",
          "CHEMBL1169585",
          "CHEMBL117070",
          "CHEMBL1172245",
          "CHEMBL1172247",
          "CHEMBL1172248",
          "CHEMBL1172249",
          "CHEMBL1172251",
          "CHEMBL1172252",
          "CHEMBL1172253",
          "CHEMBL1172428",
          "CHEMBL1172429",
          "CHEMBL119332",
          "CHEMBL119692",
          "CHEMBL1201894",
          "CHEMBL1202425",
          "CHEMBL1202427",
          "CHEMBL1202428",
          "CHEMBL1202429",
          "CHEMBL1202430",
          "CHEMBL1202432",
          "CHEMBL1202433",
          "CHEMBL1213987",
          "CHEMBL1213988",
          "CHEMBL1213989",
          "CHEMBL1213990",
          "CHEMBL1213991",
          "CHEMBL1214049",
          "CHEMBL1214076",
          "CHEMBL1214117",
          "CHEMBL122321",
          "CHEMBL1223773",
          "CHEMBL1223774",
          "CHEMBL1223831",
          "CHEMBL1223832",
          "CHEMBL1223833",
          "CHEMBL1223834",
          "CHEMBL1223889",
          "CHEMBL1223890",
          "CHEMBL122981",
          "CHEMBL123631",
          "CHEMBL124015",
          "CHEMBL124283",
          "CHEMBL124435",
          "CHEMBL124870",
          "CHEMBL124941",
          "CHEMBL125060",
          "CHEMBL1253632",
          "CHEMBL1253633",
          "CHEMBL1253634",
          "CHEMBL1253635",
          "CHEMBL1253636",
          "CHEMBL1253637",
          "CHEMBL1254974",
          "CHEMBL1255058",
          "CHEMBL125564",
          "CHEMBL1256748",
          "CHEMBL125754",
          "CHEMBL126282",
          "CHEMBL127378",
          "CHEMBL127391",
          "CHEMBL127463",
          "CHEMBL127619",
          "CHEMBL127711",
          "CHEMBL127828",
          "CHEMBL127968",
          "CHEMBL127969",
          "CHEMBL128444",
          "CHEMBL128542",
          "CHEMBL128631",
          "CHEMBL128766",
          "CHEMBL128796",
          "CHEMBL128912",
          "CHEMBL129815",
          "CHEMBL130125",
          "CHEMBL130272",
          "CHEMBL130714",
          "CHEMBL131034",
          "CHEMBL131328",
          "CHEMBL132164",
          "CHEMBL132420",
          "CHEMBL132897",
          "CHEMBL133719",
          "CHEMBL133815",
          "CHEMBL134652",
          "CHEMBL13470",
          "CHEMBL136515",
          "CHEMBL136646",
          "CHEMBL13786",
          "CHEMBL138547",
          "CHEMBL13894",
          "CHEMBL140044",
          "CHEMBL140145",
          "CHEMBL140278",
          "CHEMBL14036",
          "CHEMBL140855",
          "CHEMBL14094",
          "CHEMBL1415",
          "CHEMBL1416",
          "CHEMBL1417",
          "CHEMBL1418",
          "CHEMBL14204",
          "CHEMBL142171",
          "CHEMBL14230",
          "CHEMBL143416",
          "CHEMBL143592",
          "CHEMBL143815",
          "CHEMBL143939",
          "CHEMBL148843",
          "CHEMBL149611",
          "CHEMBL150052",
          "CHEMBL150508",
          "CHEMBL150609",
          "CHEMBL151243",
          "CHEMBL151341",
          "CHEMBL152299",
          "CHEMBL152327",
          "CHEMBL152351",
          "CHEMBL152381",
          "CHEMBL152498",
          "CHEMBL153466",
          "CHEMBL153648",
          "CHEMBL154255",
          "CHEMBL154510",
          "CHEMBL15595",
          "CHEMBL157301",
          "CHEMBL157302",
          "CHEMBL157313",
          "CHEMBL158920",
          "CHEMBL159391",
          "CHEMBL159618",
          "CHEMBL160677",
          "CHEMBL160924",
          "CHEMBL162048",
          "CHEMBL162267",
          "CHEMBL162564",
          "CHEMBL1628243",
          "CHEMBL1628270",
          "CHEMBL163064",
          "CHEMBL163322",
          "CHEMBL163334",
          "CHEMBL163747",
          "CHEMBL163769",
          "CHEMBL163808",
          "CHEMBL164062",
          "CHEMBL164355",
          "CHEMBL164577",
          "CHEMBL1649938",
          "CHEMBL1649939",
          "CHEMBL1649940",
          "CHEMBL1649941",
          "CHEMBL1649942",
          "CHEMBL1649943",
          "CHEMBL1649944",
          "CHEMBL1649945",
          "CHEMBL1649946",
          "CHEMBL1649947",
          "CHEMBL1649948",
          "CHEMBL165410",
          "CHEMBL165832",
          "CHEMBL166551",
          "CHEMBL166853",
          "CHEMBL1672468",
          "CHEMBL1672469",
          "CHEMBL1672470",
          "CHEMBL1672471",
          "CHEMBL1672472",
          "CHEMBL1672473",
          "CHEMBL1672474",
          "CHEMBL1672475",
          "CHEMBL1672476",
          "CHEMBL1672477",
          "CHEMBL1672478",
          "CHEMBL1672479",
          "CHEMBL1672480",
          "CHEMBL1672481",
          "CHEMBL1672482",
          "CHEMBL1672483",
          "CHEMBL1672484",
          "CHEMBL1672485",
          "CHEMBL1672486",
          "CHEMBL1672487",
          "CHEMBL1672488",
          "CHEMBL1672489",
          "CHEMBL1672490",
          "CHEMBL1672491",
          "CHEMBL1672492",
          "CHEMBL1672493",
          "CHEMBL1672494",
          "CHEMBL167836",
          "CHEMBL168110",
          "CHEMBL168392",
          "CHEMBL168409",
          "CHEMBL168625",
          "CHEMBL168723",
          "CHEMBL168913",
          "CHEMBL168968",
          "CHEMBL169030",
          "CHEMBL169345",
          "CHEMBL169346",
          "CHEMBL169366",
          "CHEMBL169367",
          "CHEMBL169439",
          "CHEMBL169536",
          "CHEMBL169587",
          "CHEMBL169670",
          "CHEMBL169703",
          "CHEMBL169860",
          "CHEMBL170384",
          "CHEMBL170399",
          "CHEMBL172235",
          "CHEMBL172493",
          "CHEMBL172529",
          "CHEMBL173319",
          "CHEMBL173749",
          "CHEMBL173874",
          "CHEMBL173884",
          "CHEMBL174263",
          "CHEMBL175770",
          "CHEMBL176537",
          "CHEMBL1766204",
          "CHEMBL1766205",
          "CHEMBL1766206",
          "CHEMBL1766207",
          "CHEMBL1766208",
          "CHEMBL177194",
          "CHEMBL1782140",
          "CHEMBL1782141",
          "CHEMBL1782985",
          "CHEMBL1782987",
          "CHEMBL1790503",
          "CHEMBL1791447",
          "CHEMBL179246",
          "CHEMBL1797514",
          "CHEMBL1797515",
          "CHEMBL1797516",
          "CHEMBL1797517",
          "CHEMBL1797518",
          "CHEMBL1797684",
          "CHEMBL1797685",
          "CHEMBL1797686",
          "CHEMBL1797687",
          "CHEMBL1797688",
          "CHEMBL1797689",
          "CHEMBL179946",
          "CHEMBL180286",
          "CHEMBL180594",
          "CHEMBL180777",
          "CHEMBL1808384",
          "CHEMBL182720",
          "CHEMBL183278",
          "CHEMBL1834250",
          "CHEMBL1835843",
          "CHEMBL1835844",
          "CHEMBL184009",
          "CHEMBL184875",
          "CHEMBL185199",
          "CHEMBL185261",
          "CHEMBL185359",
          "CHEMBL186457",
          "CHEMBL186527",
          "CHEMBL188558",
          "CHEMBL189511",
          "CHEMBL19019",
          "CHEMBL190543",
          "CHEMBL1907787",
          "CHEMBL1907788",
          "CHEMBL1908334",
          "CHEMBL191751",
          "CHEMBL1917701",
          "CHEMBL1917702",
          "CHEMBL1917711",
          "CHEMBL1917712",
          "CHEMBL196774",
          "CHEMBL197183",
          "CHEMBL197185",
          "CHEMBL198646",
          "CHEMBL198800",
          "CHEMBL198909",
          "CHEMBL19982",
          "CHEMBL200129",
          "CHEMBL200199",
          "CHEMBL200890",
          "CHEMBL2016680",
          "CHEMBL2021605",
          "CHEMBL2028967",
          "CHEMBL2028968",
          "CHEMBL2028969",
          "CHEMBL2028970",
          "CHEMBL2028971",
          "CHEMBL2028972",
          "CHEMBL2028997",
          "CHEMBL2048250",
          "CHEMBL204996",
          "CHEMBL205049",
          "CHEMBL205306",
          "CHEMBL205388",
          "CHEMBL206974",
          "CHEMBL20750",
          "CHEMBL207661",
          "CHEMBL20775",
          "CHEMBL2079569",
          "CHEMBL2079638",
          "CHEMBL208454",
          "CHEMBL208479",
          "CHEMBL208683",
          "CHEMBL208916",
          "CHEMBL2092986",
          "CHEMBL2096700",
          "CHEMBL2096701",
          "CHEMBL2096702",
          "CHEMBL2096704",
          "CHEMBL2096783",
          "CHEMBL2096784",
          "CHEMBL2096785",
          "CHEMBL2096786",
          "CHEMBL2096787",
          "CHEMBL209751",
          "CHEMBL2107292",
          "CHEMBL2110199",
          "CHEMBL2110315",
          "CHEMBL2111529",
          "CHEMBL2111843",
          "CHEMBL2111856",
          "CHEMBL2111857",
          "CHEMBL2111881",
          "CHEMBL2111882",
          "CHEMBL2111911",
          "CHEMBL2111912",
          "CHEMBL2111913",
          "CHEMBL2111914",
          "CHEMBL2111916",
          "CHEMBL2111933",
          "CHEMBL2111934",
          "CHEMBL2111935",
          "CHEMBL2111936",
          "CHEMBL2112652",
          "CHEMBL2112688",
          "CHEMBL2112689",
          "CHEMBL2112729",
          "CHEMBL2112730",
          "CHEMBL2112732",
          "CHEMBL2112736",
          "CHEMBL2112740",
          "CHEMBL2113281",
          "CHEMBL2113646",
          "CHEMBL2113654",
          "CHEMBL2113664",
          "CHEMBL2113670",
          "CHEMBL2113675",
          "CHEMBL211374",
          "CHEMBL2114223",
          "CHEMBL2114225",
          "CHEMBL2114226",
          "CHEMBL2114257",
          "CHEMBL2114291",
          "CHEMBL2114292",
          "CHEMBL2114293",
          "CHEMBL2114294",
          "CHEMBL2114295",
          "CHEMBL2114296",
          "CHEMBL2115042",
          "CHEMBL2115043",
          "CHEMBL2115270",
          "CHEMBL2115271",
          "CHEMBL2115272",
          "CHEMBL2115273",
          "CHEMBL211543",
          "CHEMBL2115466",
          "CHEMBL211576",
          "CHEMBL212172",
          "CHEMBL213069",
          "CHEMBL213228",
          "CHEMBL21361",
          "CHEMBL213737",
          "CHEMBL214022",
          "CHEMBL214040",
          "CHEMBL214581",
          "CHEMBL214708",
          "CHEMBL215595",
          "CHEMBL215809",
          "CHEMBL21603",
          "CHEMBL216182",
          "CHEMBL21623",
          "CHEMBL216251",
          "CHEMBL216351",
          "CHEMBL2163910",
          "CHEMBL2163911",
          "CHEMBL2163912",
          "CHEMBL2163913",
          "CHEMBL2163914",
          "CHEMBL2163915",
          "CHEMBL2163916",
          "CHEMBL2163917",
          "CHEMBL2163918",
          "CHEMBL2163919",
          "CHEMBL2163920",
          "CHEMBL2163921",
          "CHEMBL2163922",
          "CHEMBL216640",
          "CHEMBL216899",
          "CHEMBL216940",
          "CHEMBL217049",
          "CHEMBL2171846",
          "CHEMBL2171847",
          "CHEMBL2171853",
          "CHEMBL217395",
          "CHEMBL217597",
          "CHEMBL217644",
          "CHEMBL2179258",
          "CHEMBL2179259",
          "CHEMBL2179260",
          "CHEMBL2179261",
          "CHEMBL2179262",
          "CHEMBL2179263",
          "CHEMBL2179264",
          "CHEMBL217957",
          "CHEMBL2181192",
          "CHEMBL2181193",
          "CHEMBL2181194",
          "CHEMBL2181195",
          "CHEMBL2181196",
          "CHEMBL2181197",
          "CHEMBL2181198",
          "CHEMBL2181199",
          "CHEMBL2181200",
          "CHEMBL2181201",
          "CHEMBL2181202",
          "CHEMBL218327",
          "CHEMBL218600",
          "CHEMBL218651",
          "CHEMBL218763",
          "CHEMBL21893",
          "CHEMBL219108",
          "CHEMBL219407",
          "CHEMBL21970",
          "CHEMBL220219",
          "CHEMBL220327",
          "CHEMBL220333",
          "CHEMBL22054",
          "CHEMBL2207677",
          "CHEMBL2207678",
          "CHEMBL2207679",
          "CHEMBL2207680",
          "CHEMBL2207681",
          "CHEMBL22211",
          "CHEMBL22220",
          "CHEMBL222830",
          "CHEMBL22321",
          "CHEMBL223244",
          "CHEMBL224151",
          "CHEMBL22458",
          "CHEMBL225479",
          "CHEMBL22569",
          "CHEMBL228409",
          "CHEMBL228503",
          "CHEMBL228512",
          "CHEMBL228516",
          "CHEMBL229280",
          "CHEMBL229440",
          "CHEMBL229441",
          "CHEMBL23016",
          "CHEMBL2305067",
          "CHEMBL2310843",
          "CHEMBL2311022",
          "CHEMBL2311023",
          "CHEMBL2311024",
          "CHEMBL2311025",
          "CHEMBL23133",
          "CHEMBL232303",
          "CHEMBL2323574",
          "CHEMBL2323575",
          "CHEMBL2323577",
          "CHEMBL232514",
          "CHEMBL232812",
          "CHEMBL232813",
          "CHEMBL232815",
          "CHEMBL23295",
          "CHEMBL23325",
          "CHEMBL2334768",
          "CHEMBL2334769",
          "CHEMBL2334770",
          "CHEMBL2334771",
          "CHEMBL2334772",
          "CHEMBL2334773",
          "CHEMBL2334774",
          "CHEMBL2334775",
          "CHEMBL2334776",
          "CHEMBL2335120",
          "CHEMBL23362",
          "CHEMBL2338735",
          "CHEMBL2338736",
          "CHEMBL2338743",
          "CHEMBL2338754",
          "CHEMBL2338755",
          "CHEMBL235743",
          "CHEMBL236253",
          "CHEMBL236460",
          "CHEMBL236461",
          "CHEMBL236462",
          "CHEMBL236662",
          "CHEMBL236663",
          "CHEMBL236868",
          "CHEMBL237074",
          "CHEMBL23777",
          "CHEMBL23836",
          "CHEMBL24059",
          "CHEMBL241010",
          "CHEMBL242077",
          "CHEMBL243189",
          "CHEMBL243724",
          "CHEMBL244265",
          "CHEMBL25386",
          "CHEMBL25493",
          "CHEMBL257661",
          "CHEMBL258458",
          "CHEMBL258704",
          "CHEMBL259917",
          "CHEMBL260120",
          "CHEMBL260127",
          "CHEMBL261390",
          "CHEMBL261608",
          "CHEMBL261905",
          "CHEMBL262172",
          "CHEMBL262312",
          "CHEMBL262490",
          "CHEMBL262840",
          "CHEMBL262963",
          "CHEMBL263031",
          "CHEMBL263187",
          "CHEMBL263366",
          "CHEMBL263509",
          "CHEMBL263619",
          "CHEMBL264481",
          "CHEMBL264733",
          "CHEMBL265241",
          "CHEMBL265387",
          "CHEMBL26575",
          "CHEMBL265824",
          "CHEMBL266035",
          "CHEMBL266122",
          "CHEMBL266399",
          "CHEMBL266479",
          "CHEMBL26648",
          "CHEMBL266669",
          "CHEMBL266845",
          "CHEMBL267027",
          "CHEMBL267211",
          "CHEMBL267413",
          "CHEMBL267495",
          "CHEMBL268105",
          "CHEMBL26861",
          "CHEMBL268622",
          "CHEMBL268874",
          "CHEMBL269119",
          "CHEMBL269502",
          "CHEMBL269713",
          "CHEMBL269842",
          "CHEMBL270984",
          "CHEMBL271619",
          "CHEMBL272665",
          "CHEMBL274012",
          "CHEMBL274204",
          "CHEMBL274875",
          "CHEMBL275025",
          "CHEMBL275050",
          "CHEMBL277132",
          "CHEMBL277202",
          "CHEMBL278789",
          "CHEMBL279065",
          "CHEMBL279430",
          "CHEMBL279449",
          "CHEMBL279968",
          "CHEMBL280178",
          "CHEMBL280274",
          "CHEMBL280649",
          "CHEMBL280848",
          "CHEMBL280958",
          "CHEMBL281140",
          "CHEMBL281634",
          "CHEMBL281786",
          "CHEMBL282107",
          "CHEMBL282244",
          "CHEMBL282518",
          "CHEMBL283009",
          "CHEMBL283287",
          "CHEMBL283330",
          "CHEMBL283552",
          "CHEMBL283802",
          "CHEMBL284060",
          "CHEMBL284522",
          "CHEMBL284621",
          "CHEMBL285052",
          "CHEMBL285083",
          "CHEMBL285250",
          "CHEMBL285390",
          "CHEMBL285391",
          "CHEMBL285410",
          "CHEMBL285563",
          "CHEMBL285658",
          "CHEMBL286368",
          "CHEMBL286585",
          "CHEMBL286629",
          "CHEMBL286867",
          "CHEMBL287471",
          "CHEMBL287527",
          "CHEMBL287750",
          "CHEMBL288317",
          "CHEMBL288622",
          "CHEMBL289006",
          "CHEMBL289156",
          "CHEMBL289355",
          "CHEMBL289537",
          "CHEMBL290005",
          "CHEMBL290301",
          "CHEMBL290421",
          "CHEMBL290737",
          "CHEMBL29078",
          "CHEMBL290968",
          "CHEMBL291056",
          "CHEMBL291078",
          "CHEMBL291468",
          "CHEMBL291751",
          "CHEMBL291973",
          "CHEMBL292521",
          "CHEMBL293103",
          "CHEMBL293485",
          "CHEMBL293951",
          "CHEMBL294134",
          "CHEMBL294616",
          "CHEMBL294982",
          "CHEMBL295076",
          "CHEMBL295237",
          "CHEMBL295295",
          "CHEMBL295402",
          "CHEMBL296230",
          "CHEMBL296282",
          "CHEMBL296304",
          "CHEMBL296328",
          "CHEMBL296603",
          "CHEMBL296693",
          "CHEMBL296698",
          "CHEMBL296749",
          "CHEMBL296782",
          "CHEMBL296922",
          "CHEMBL297059",
          "CHEMBL297281",
          "CHEMBL297292",
          "CHEMBL297428",
          "CHEMBL297467",
          "CHEMBL297525",
          "CHEMBL297565",
          "CHEMBL297567",
          "CHEMBL297756",
          "CHEMBL297839",
          "CHEMBL297998",
          "CHEMBL298027",
          "CHEMBL298446",
          "CHEMBL298571",
          "CHEMBL298590",
          "CHEMBL298610",
          "CHEMBL298688",
          "CHEMBL299027",
          "CHEMBL299031",
          "CHEMBL299114",
          "CHEMBL299132",
          "CHEMBL299138",
          "CHEMBL299189",
          "CHEMBL299220",
          "CHEMBL299709",
          "CHEMBL299772",
          "CHEMBL299950",
          "CHEMBL300023",
          "CHEMBL300033",
          "CHEMBL300662",
          "CHEMBL300689",
          "CHEMBL300831",
          "CHEMBL300832",
          "CHEMBL300877",
          "CHEMBL301160",
          "CHEMBL301248",
          "CHEMBL301524",
          "CHEMBL301804",
          "CHEMBL301835",
          "CHEMBL302277",
          "CHEMBL302408",
          "CHEMBL302454",
          "CHEMBL303418",
          "CHEMBL303513",
          "CHEMBL303855",
          "CHEMBL304431",
          "CHEMBL306016",
          "CHEMBL307133",
          "CHEMBL307235",
          "CHEMBL307323",
          "CHEMBL307919",
          "CHEMBL308813",
          "CHEMBL310636",
          "CHEMBL310785",
          "CHEMBL311912",
          "CHEMBL314294",
          "CHEMBL315225",
          "CHEMBL315603",
          "CHEMBL316446",
          "CHEMBL317030",
          "CHEMBL317269",
          "CHEMBL317956",
          "CHEMBL318395",
          "CHEMBL318636",
          "CHEMBL318723",
          "CHEMBL319236",
          "CHEMBL319536",
          "CHEMBL319835",
          "CHEMBL321289",
          "CHEMBL321570",
          "CHEMBL321711",
          "CHEMBL32202",
          "CHEMBL322195",
          "CHEMBL322300",
          "CHEMBL322796",
          "CHEMBL323216",
          "CHEMBL323281",
          "CHEMBL324390",
          "CHEMBL324418",
          "CHEMBL324681",
          "CHEMBL324988",
          "CHEMBL326516",
          "CHEMBL326684",
          "CHEMBL327309",
          "CHEMBL327490",
          "CHEMBL327576",
          "CHEMBL327885",
          "CHEMBL327935",
          "CHEMBL328115",
          "CHEMBL328135",
          "CHEMBL328236",
          "CHEMBL328269",
          "CHEMBL329020",
          "CHEMBL329114",
          "CHEMBL329343",
          "CHEMBL329453",
          "CHEMBL330339",
          "CHEMBL33040",
          "CHEMBL330449",
          "CHEMBL33047",
          "CHEMBL330991",
          "CHEMBL331043",
          "CHEMBL331325",
          "CHEMBL331360",
          "CHEMBL332017",
          "CHEMBL332927",
          "CHEMBL333064",
          "CHEMBL333357",
          "CHEMBL333959",
          "CHEMBL333965",
          "CHEMBL334715",
          "CHEMBL334898",
          "CHEMBL334970",
          "CHEMBL33584",
          "CHEMBL335936",
          "CHEMBL336019",
          "CHEMBL336381",
          "CHEMBL336657",
          "CHEMBL337139",
          "CHEMBL337265",
          "CHEMBL33757",
          "CHEMBL337841",
          "CHEMBL337898",
          "CHEMBL338125",
          "CHEMBL338307",
          "CHEMBL338466",
          "CHEMBL338661",
          "CHEMBL338773",
          "CHEMBL338985",
          "CHEMBL339002",
          "CHEMBL339020",
          "CHEMBL339089",
          "CHEMBL339552",
          "CHEMBL340001",
          "CHEMBL340032",
          "CHEMBL341480",
          "CHEMBL341500",
          "CHEMBL341529",
          "CHEMBL342682",
          "CHEMBL342879",
          "CHEMBL343167",
          "CHEMBL343342",
          "CHEMBL34339",
          "CHEMBL344000",
          "CHEMBL34405",
          "CHEMBL344420",
          "CHEMBL344885",
          "CHEMBL345208",
          "CHEMBL346165",
          "CHEMBL346625",
          "CHEMBL346813",
          "CHEMBL347674",
          "CHEMBL347712",
          "CHEMBL34773",
          "CHEMBL348011",
          "CHEMBL349177",
          "CHEMBL349636",
          "CHEMBL349738",
          "CHEMBL349841",
          "CHEMBL349940",
          "CHEMBL350384",
          "CHEMBL350434",
          "CHEMBL350601",
          "CHEMBL350742",
          "CHEMBL351078",
          "CHEMBL351181",
          "CHEMBL351466",
          "CHEMBL352224",
          "CHEMBL352365",
          "CHEMBL352827",
          "CHEMBL352965",
          "CHEMBL353303",
          "CHEMBL353736",
          "CHEMBL353876",
          "CHEMBL353930",
          "CHEMBL353938",
          "CHEMBL353979",
          "CHEMBL354172",
          "CHEMBL354322",
          "CHEMBL354392",
          "CHEMBL354548",
          "CHEMBL354966",
          "CHEMBL355141",
          "CHEMBL355178",
          "CHEMBL355188",
          "CHEMBL355296",
          "CHEMBL355403",
          "CHEMBL356587",
          "CHEMBL359088",
          "CHEMBL359786",
          "CHEMBL361033",
          "CHEMBL361274",
          "CHEMBL361381",
          "CHEMBL361598",
          "CHEMBL361922",
          "CHEMBL362002",
          "CHEMBL362514",
          "CHEMBL363142",
          "CHEMBL365762",
          "CHEMBL366311",
          "CHEMBL366520",
          "CHEMBL367068",
          "CHEMBL367290",
          "CHEMBL367497",
          "CHEMBL367635",
          "CHEMBL367962",
          "CHEMBL36812",
          "CHEMBL368421",
          "CHEMBL36845",
          "CHEMBL36850",
          "CHEMBL368522",
          "CHEMBL368600",
          "CHEMBL370197",
          "CHEMBL370398",
          "CHEMBL370399",
          "CHEMBL370701",
          "CHEMBL37158",
          "CHEMBL371856",
          "CHEMBL372130",
          "CHEMBL372787",
          "CHEMBL373192",
          "CHEMBL373572",
          "CHEMBL373668",
          "CHEMBL373796",
          "CHEMBL374268",
          "CHEMBL37475",
          "CHEMBL374818",
          "CHEMBL375025",
          "CHEMBL375068",
          "CHEMBL375274",
          "CHEMBL375359",
          "CHEMBL375412",
          "CHEMBL376061",
          "CHEMBL377069",
          "CHEMBL377392",
          "CHEMBL377733",
          "CHEMBL377960",
          "CHEMBL378082",
          "CHEMBL378753",
          "CHEMBL379405",
          "CHEMBL379928",
          "CHEMBL380590",
          "CHEMBL38139",
          "CHEMBL381874",
          "CHEMBL382051",
          "CHEMBL382349",
          "CHEMBL383458",
          "CHEMBL384250",
          "CHEMBL384485",
          "CHEMBL384497",
          "CHEMBL384566",
          "CHEMBL384584",
          "CHEMBL384750",
          "CHEMBL385048",
          "CHEMBL38521",
          "CHEMBL385233",
          "CHEMBL385448",
          "CHEMBL385617",
          "CHEMBL385736",
          "CHEMBL385759",
          "CHEMBL38576",
          "CHEMBL385779",
          "CHEMBL38578",
          "CHEMBL386170",
          "CHEMBL386186",
          "CHEMBL386212",
          "CHEMBL386309",
          "CHEMBL386618",
          "CHEMBL386722",
          "CHEMBL38678",
          "CHEMBL38680",
          "CHEMBL386887",
          "CHEMBL387083",
          "CHEMBL387159",
          "CHEMBL387392",
          "CHEMBL387437",
          "CHEMBL38745",
          "CHEMBL388320",
          "CHEMBL38874",
          "CHEMBL388800",
          "CHEMBL38888",
          "CHEMBL389023",
          "CHEMBL389651",
          "CHEMBL389652",
          "CHEMBL389948",
          "CHEMBL389949",
          "CHEMBL390173",
          "CHEMBL390271",
          "CHEMBL390480",
          "CHEMBL390689",
          "CHEMBL39104",
          "CHEMBL39192",
          "CHEMBL392057",
          "CHEMBL39211",
          "CHEMBL392185",
          "CHEMBL392469",
          "CHEMBL392828",
          "CHEMBL395304",
          "CHEMBL39562",
          "CHEMBL396422",
          "CHEMBL396423",
          "CHEMBL396424",
          "CHEMBL39647",
          "CHEMBL396506",
          "CHEMBL397176",
          "CHEMBL397177",
          "CHEMBL397357",
          "CHEMBL39739",
          "CHEMBL397705",
          "CHEMBL399708",
          "CHEMBL401093",
          "CHEMBL404929",
          "CHEMBL40504",
          "CHEMBL405102",
          "CHEMBL405190",
          "CHEMBL405192",
          "CHEMBL405309",
          "CHEMBL405410",
          "CHEMBL405618",
          "CHEMBL405738",
          "CHEMBL406030",
          "CHEMBL406034",
          "CHEMBL406272",
          "CHEMBL40674",
          "CHEMBL406899",
          "CHEMBL406968",
          "CHEMBL407057",
          "CHEMBL407076",
          "CHEMBL407124",
          "CHEMBL407198",
          "CHEMBL407303",
          "CHEMBL407529",
          "CHEMBL407685",
          "CHEMBL407693",
          "CHEMBL407957",
          "CHEMBL408024",
          "CHEMBL408330",
          "CHEMBL408360",
          "CHEMBL408497",
          "CHEMBL408557",
          "CHEMBL408601",
          "CHEMBL408680",
          "CHEMBL408832",
          "CHEMBL408889",
          "CHEMBL408975",
          "CHEMBL409225",
          "CHEMBL409336",
          "CHEMBL409373",
          "CHEMBL409793",
          "CHEMBL409806",
          "CHEMBL409974",
          "CHEMBL410611",
          "CHEMBL410616",
          "CHEMBL410909",
          "CHEMBL411196",
          "CHEMBL411335",
          "CHEMBL411338",
          "CHEMBL411557",
          "CHEMBL411772",
          "CHEMBL411781",
          "CHEMBL412324",
          "CHEMBL412325",
          "CHEMBL412331",
          "CHEMBL412364",
          "CHEMBL412377",
          "CHEMBL412413",
          "CHEMBL412482",
          "CHEMBL412580",
          "CHEMBL412591",
          "CHEMBL412600",
          "CHEMBL412769",
          "CHEMBL412789",
          "CHEMBL412792",
          "CHEMBL412922",
          "CHEMBL412923",
          "CHEMBL412924",
          "CHEMBL413011",
          "CHEMBL413160",
          "CHEMBL413228",
          "CHEMBL413370",
          "CHEMBL413530",
          "CHEMBL413644",
          "CHEMBL413676",
          "CHEMBL413703",
          "CHEMBL413874",
          "CHEMBL413892",
          "CHEMBL414064",
          "CHEMBL414068",
          "CHEMBL414087",
          "CHEMBL414251",
          "CHEMBL414494",
          "CHEMBL414502",
          "CHEMBL414554",
          "CHEMBL414684",
          "CHEMBL414713",
          "CHEMBL41478",
          "CHEMBL414921",
          "CHEMBL415224",
          "CHEMBL415330",
          "CHEMBL415339",
          "CHEMBL415406",
          "CHEMBL415410",
          "CHEMBL415551",
          "CHEMBL415782",
          "CHEMBL415795",
          "CHEMBL416609",
          "CHEMBL417160",
          "CHEMBL417535",
          "CHEMBL417861",
          "CHEMBL418105",
          "CHEMBL419414",
          "CHEMBL419511",
          "CHEMBL420606",
          "CHEMBL420903",
          "CHEMBL420995",
          "CHEMBL421232",
          "CHEMBL422258",
          "CHEMBL422547",
          "CHEMBL422560",
          "CHEMBL422563",
          "CHEMBL422567",
          "CHEMBL423341",
          "CHEMBL423406",
          "CHEMBL423903",
          "CHEMBL424400",
          "CHEMBL424569",
          "CHEMBL425279",
          "CHEMBL425806",
          "CHEMBL426320",
          "CHEMBL426345",
          "CHEMBL426363",
          "CHEMBL426750",
          "CHEMBL427214",
          "CHEMBL428803",
          "CHEMBL429020",
          "CHEMBL429103",
          "CHEMBL430299",
          "CHEMBL430475",
          "CHEMBL430550",
          "CHEMBL430833",
          "CHEMBL430950",
          "CHEMBL431156",
          "CHEMBL432045",
          "CHEMBL432117",
          "CHEMBL432120",
          "CHEMBL432238",
          "CHEMBL432873",
          "CHEMBL433228",
          "CHEMBL433272",
          "CHEMBL433508",
          "CHEMBL433626",
          "CHEMBL433849",
          "CHEMBL433951",
          "CHEMBL434559",
          "CHEMBL434616",
          "CHEMBL434867",
          "CHEMBL435391",
          "CHEMBL435898",
          "CHEMBL436039",
          "CHEMBL436063",
          "CHEMBL43637",
          "CHEMBL436590",
          "CHEMBL436911",
          "CHEMBL437242",
          "CHEMBL437272",
          "CHEMBL437372",
          "CHEMBL437682",
          "CHEMBL437865",
          "CHEMBL438034",
          "CHEMBL438215",
          "CHEMBL438223",
          "CHEMBL438274",
          "CHEMBL438389",
          "CHEMBL438681",
          "CHEMBL438739",
          "CHEMBL438750",
          "CHEMBL438819",
          "CHEMBL439019",
          "CHEMBL439171",
          "CHEMBL439716",
          "CHEMBL439898",
          "CHEMBL440123",
          "CHEMBL440196",
          "CHEMBL440694",
          "CHEMBL440765",
          "CHEMBL440881",
          "CHEMBL44172",
          "CHEMBL441765",
          "CHEMBL441776",
          "CHEMBL441889",
          "CHEMBL441939",
          "CHEMBL442129",
          "CHEMBL442483",
          "CHEMBL442577",
          "CHEMBL442709",
          "CHEMBL443003",
          "CHEMBL443068",
          "CHEMBL443311",
          "CHEMBL444626",
          "CHEMBL446336",
          "CHEMBL447782",
          "CHEMBL448998",
          "CHEMBL449224",
          "CHEMBL449801",
          "CHEMBL45308",
          "CHEMBL45344",
          "CHEMBL454035",
          "CHEMBL458208",
          "CHEMBL458417",
          "CHEMBL458631",
          "CHEMBL459280",
          "CHEMBL459281",
          "CHEMBL459746",
          "CHEMBL461229",
          "CHEMBL46320",
          "CHEMBL46399",
          "CHEMBL464071",
          "CHEMBL46540",
          "CHEMBL468469",
          "CHEMBL469027",
          "CHEMBL469046",
          "CHEMBL47029",
          "CHEMBL47034",
          "CHEMBL47156",
          "CHEMBL473136",
          "CHEMBL473206",
          "CHEMBL474296",
          "CHEMBL474497",
          "CHEMBL474641",
          "CHEMBL47488",
          "CHEMBL47512",
          "CHEMBL47545",
          "CHEMBL476540",
          "CHEMBL477154",
          "CHEMBL48157",
          "CHEMBL48241",
          "CHEMBL48390",
          "CHEMBL48420",
          "CHEMBL485576",
          "CHEMBL485605",
          "CHEMBL48816",
          "CHEMBL48936",
          "CHEMBL48974",
          "CHEMBL49029",
          "CHEMBL490418",
          "CHEMBL49106",
          "CHEMBL49143",
          "CHEMBL49269",
          "CHEMBL49318",
          "CHEMBL49507",
          "CHEMBL49581",
          "CHEMBL49681",
          "CHEMBL50098",
          "CHEMBL501451",
          "CHEMBL50284",
          "CHEMBL50386",
          "CHEMBL504916",
          "CHEMBL505011",
          "CHEMBL50594",
          "CHEMBL506616",
          "CHEMBL506761",
          "CHEMBL506821",
          "CHEMBL507214",
          "CHEMBL507340",
          "CHEMBL507442",
          "CHEMBL511691",
          "CHEMBL511773",
          "CHEMBL51204",
          "CHEMBL514366",
          "CHEMBL514693",
          "CHEMBL514927",
          "CHEMBL517166",
          "CHEMBL51838",
          "CHEMBL51865",
          "CHEMBL52028",
          "CHEMBL520557",
          "CHEMBL52399",
          "CHEMBL52451",
          "CHEMBL52860",
          "CHEMBL52996",
          "CHEMBL534684",
          "CHEMBL535130",
          "CHEMBL535133",
          "CHEMBL535581",
          "CHEMBL535801",
          "CHEMBL535803",
          "CHEMBL536937",
          "CHEMBL536939",
          "CHEMBL537165",
          "CHEMBL537169",
          "CHEMBL537615",
          "CHEMBL537616",
          "CHEMBL538131",
          "CHEMBL538308",
          "CHEMBL538309",
          "CHEMBL538384",
          "CHEMBL538456",
          "CHEMBL538457",
          "CHEMBL538699",
          "CHEMBL539193",
          "CHEMBL539228",
          "CHEMBL539246",
          "CHEMBL539386",
          "CHEMBL539582",
          "CHEMBL53963",
          "CHEMBL540295",
          "CHEMBL540296",
          "CHEMBL540302",
          "CHEMBL540724",
          "CHEMBL540972",
          "CHEMBL541619",
          "CHEMBL542069",
          "CHEMBL542149",
          "CHEMBL542267",
          "CHEMBL542403",
          "CHEMBL542564",
          "CHEMBL543329",
          "CHEMBL543331",
          "CHEMBL543563",
          "CHEMBL543809",
          "CHEMBL544276",
          "CHEMBL544684",
          "CHEMBL544960",
          "CHEMBL545208",
          "CHEMBL545265",
          "CHEMBL545269",
          "CHEMBL545481",
          "CHEMBL55033",
          "CHEMBL551207",
          "CHEMBL551937",
          "CHEMBL552133",
          "CHEMBL55248",
          "CHEMBL553062",
          "CHEMBL553114",
          "CHEMBL553221",
          "CHEMBL553461",
          "CHEMBL553782",
          "CHEMBL55392",
          "CHEMBL553991",
          "CHEMBL554212",
          "CHEMBL55434",
          "CHEMBL554426",
          "CHEMBL554625",
          "CHEMBL554838",
          "CHEMBL55485",
          "CHEMBL554885",
          "CHEMBL555206",
          "CHEMBL555386",
          "CHEMBL555430",
          "CHEMBL555504",
          "CHEMBL55551",
          "CHEMBL555852",
          "CHEMBL556063",
          "CHEMBL556230",
          "CHEMBL556537",
          "CHEMBL556547",
          "CHEMBL556802",
          "CHEMBL556814",
          "CHEMBL556957",
          "CHEMBL557027",
          "CHEMBL557188",
          "CHEMBL557243",
          "CHEMBL557346",
          "CHEMBL557426",
          "CHEMBL55851",
          "CHEMBL558596",
          "CHEMBL558597",
          "CHEMBL558608",
          "CHEMBL558979",
          "CHEMBL559088",
          "CHEMBL559214",
          "CHEMBL559217",
          "CHEMBL55948",
          "CHEMBL56165",
          "CHEMBL56208",
          "CHEMBL56246",
          "CHEMBL563304",
          "CHEMBL56357",
          "CHEMBL563719",
          "CHEMBL564083",
          "CHEMBL56585",
          "CHEMBL56695",
          "CHEMBL567175",
          "CHEMBL568473",
          "CHEMBL571492",
          "CHEMBL573214",
          "CHEMBL57628",
          "CHEMBL58362",
          "CHEMBL584993",
          "CHEMBL58646",
          "CHEMBL592",
          "CHEMBL59314",
          "CHEMBL595972",
          "CHEMBL596",
          "CHEMBL598939",
          "CHEMBL598940",
          "CHEMBL599323",
          "CHEMBL599533",
          "CHEMBL60377",
          "CHEMBL604522",
          "CHEMBL604733",
          "CHEMBL604939",
          "CHEMBL60533",
          "CHEMBL606601",
          "CHEMBL606602",
          "CHEMBL606603",
          "CHEMBL606644",
          "CHEMBL606872",
          "CHEMBL607",
          "CHEMBL607048",
          "CHEMBL607319",
          "CHEMBL607320",
          "CHEMBL607321",
          "CHEMBL607322",
          "CHEMBL607339",
          "CHEMBL607351",
          "CHEMBL607393",
          "CHEMBL607395",
          "CHEMBL607396",
          "CHEMBL607401",
          "CHEMBL607402",
          "CHEMBL607403",
          "CHEMBL607404",
          "CHEMBL607405",
          "CHEMBL607406",
          "CHEMBL607407",
          "CHEMBL607479",
          "CHEMBL607480",
          "CHEMBL607481",
          "CHEMBL607482",
          "CHEMBL607483",
          "CHEMBL60869",
          "CHEMBL609744",
          "CHEMBL610001",
          "CHEMBL610002",
          "CHEMBL610005",
          "CHEMBL610009",
          "CHEMBL610015",
          "CHEMBL610016",
          "CHEMBL610261",
          "CHEMBL610262",
          "CHEMBL610268",
          "CHEMBL610526",
          "CHEMBL610529",
          "CHEMBL610538",
          "CHEMBL610539",
          "CHEMBL610547",
          "CHEMBL610549",
          "CHEMBL610798",
          "CHEMBL611139",
          "CHEMBL611159",
          "CHEMBL611160",
          "CHEMBL611400",
          "CHEMBL611431",
          "CHEMBL611432",
          "CHEMBL611434",
          "CHEMBL611435",
          "CHEMBL611437",
          "CHEMBL611685",
          "CHEMBL611687",
          "CHEMBL611688",
          "CHEMBL611925",
          "CHEMBL611926",
          "CHEMBL61630",
          "CHEMBL63235",
          "CHEMBL634",
          "CHEMBL63407",
          "CHEMBL63972",
          "CHEMBL64949",
          "CHEMBL65047",
          "CHEMBL65348",
          "CHEMBL65894",
          "CHEMBL66009",
          "CHEMBL66039",
          "CHEMBL66706",
          "CHEMBL67378",
          "CHEMBL68177",
          "CHEMBL688",
          "CHEMBL70",
          "CHEMBL70311",
          "CHEMBL70586",
          "CHEMBL71294",
          "CHEMBL72786",
          "CHEMBL72850",
          "CHEMBL73131",
          "CHEMBL73226",
          "CHEMBL74010",
          "CHEMBL76023",
          "CHEMBL78796",
          "CHEMBL78932",
          "CHEMBL79470",
          "CHEMBL80",
          "CHEMBL80434",
          "CHEMBL80531",
          "CHEMBL82576",
          "CHEMBL841",
          "CHEMBL84484",
          "CHEMBL85089",
          "CHEMBL85457",
          "CHEMBL87010",
          "CHEMBL87247",
          "CHEMBL88168",
          "CHEMBL88393",
          "CHEMBL89307",
          "CHEMBL90305",
          "CHEMBL90463",
          "CHEMBL90567",
          "CHEMBL90667",
          "CHEMBL91231",
          "CHEMBL91936",
          "CHEMBL92088",
          "CHEMBL92153",
          "CHEMBL92349",
          "CHEMBL92575",
          "CHEMBL92707",
          "CHEMBL92774",
          "CHEMBL93041",
          "CHEMBL93731",
          "CHEMBL93891",
          "CHEMBL94320",
          "CHEMBL94734",
          "CHEMBL94792",
          "CHEMBL95001",
          "CHEMBL95654",
          "CHEMBL95726",
          "CHEMBL963",
          "CHEMBL96785",
          "CHEMBL97051",
          "CHEMBL97246",
          "CHEMBL97363",
          "CHEMBL97392",
          "CHEMBL97590",
          "CHEMBL98014"
        ],
        "number_of_missing_values": "0"
      },
      {
        "data_type": "numeric",
        "index": "1",
        "is_ignore": "false",
        "is_row_identifier": "false",
        "is_target": "false",
        "name": "SM12_EA.ri.",
        "number_of_missing_values": "0"
      },
      {
        "data_type": "numeric",
        "index": "2",
        "is_ignore": "false",
        "is_row_identifier": "false",
        "is_target": "false",
        "name": "SM13_EA.ri.",
        "number_of_missing_values": "0"
      },
      {
        "data_type": "numeric",
        "index": "3",
        "is_ignore": "false",
        "is_row_identifier": "false",
        "is_target": "false",
        "name": "D.Dtr08",
        "number_of_missing_values": "0"
      },
      {
        "data_type": "numeric",
        "index": "4",
        "is_ignore": "false",
        "is_row_identifier": "false",
        "is_target": "false",
        "name": "nR08",
        "number_of_missing_values": "0"
      },
      {
        "data_type": "numeric",
        "index": "5",
        "is_ignore": "false",
        "is_row_identifier": "false",
        "is_target": "false",
        "name": "SpDiam_AEA.ed.",
        "number_of_missing_values": "0"
      },
      {
        "data_type": "numeric",
        "index": "6",
        "is_ignore": "false",
        "is_row_identifier": "false",
        "is_target": "false",
        "name": "SM06_EA.ed.",
        "number_of_missing_values": "0"
      },
      {
        "data_type": "numeric",
        "index": "7",
        "is_ignore": "false",
        "is_row_identifier": "false",
        "is_target": "false",
        "name": "SM12_AEA.ed.",
        "number_of_missing_values": "0"
      },
      {
        "data_type": "numeric",
        "index": "8",
        "is_ignore": "false",
        "is_row_identifier": "false",
        "is_target": "false",
        "name": "NNRS",
        "number_of_missing_values": "0"
      },
      {
        "data_type": "numeric",
        "index": "9",
        "is_ignore": "false",
        "is_row_identifier": "false",
        "is_target": "false",
        "name": "N.",
        "number_of_missing_values": "0"
      },
      {
        "data_type": "numeric",
        "index": "10",
        "is_ignore": "false",
        "is_row_identifier": "false",
        "is_target": "false",
        "name": "Rbrid",
        "number_of_missing_values": "0"
      },
      {
        "data_type": "numeric",
        "index": "11",
        "is_ignore": "false",
        "is_row_identifier": "false",
        "is_target": "false",
        "name": "CATS2D_04_LL",
        "number_of_missing_values": "0"
      },
      {
        "data_type": "numeric",
        "index": "12",
        "is_ignore": "false",
        "is_row_identifier": "false",
        "is_target": "false",
        "name": "SM09_EA.ri.",
        "number_of_missing_values": "0"
      },
      {
        "data_type": "numeric",
        "index": "13",
        "is_ignore": "false",
        "is_row_identifier": "false",
        "is_target": "false",
        "name": "PW5",
        "number_of_missing_values": "0"
      },
      {
        "data_type": "numeric",
        "index": "14",
        "is_ignore": "false",
        "is_row_identifier": "false",
        "is_target": "false",
        "name": "SM10_EA",
        "number_of_missing_values": "0"
      },
      {
        "data_type": "numeric",
        "index": "15",
        "is_ignore": "false",
        "is_row_identifier": "false",
        "is_target": "false",
        "name": "SM11_EA",
        "number_of_missing_values": "0"
      },
      {
        "data_type": "numeric",
        "index": "16",
        "is_ignore": "false",
        "is_row_identifier": "false",
        "is_target": "false",
        "name": "SM10_AEA.ed.",
        "number_of_missing_values": "0"
      },
      {
        "data_type": "numeric",
        "index": "17",
        "is_ignore": "false",
        "is_row_identifier": "false",
        "is_target": "false",
        "name": "SM09_EA",
        "number_of_missing_values": "0"
      },
      {
        "data_type": "numeric",
        "index": "18",
        "is_ignore": "false",
        "is_row_identifier": "false",
        "is_target": "false",
        "name": "SM09_AEA.ed.",
        "number_of_missing_values": "0"
      },
      {
        "data_type": "numeric",
        "index": "19",
        "is_ignore": "false",
        "is_row_identifier": "false",
        "is_target": "false",
        "name": "SM08_AEA.ed.",
        "number_of_missing_values": "0"
      },
      {
        "data_type": "numeric",
        "index": "20",
        "is_ignore": "false",
        "is_row_identifier": "false",
        "is_target": "false",
        "name": "SM04_EA.ed.",
        "number_of_missing_values": "0"
      },
      {
        "data_type": "numeric",
        "index": "21",
        "is_ignore": "false",
        "is_row_identifier": "false",
        "is_target": "false",
        "name": "S3K",
        "number_of_missing_values": "0"
      },
      {
        "data_type": "numeric",
        "index": "22",
        "is_ignore": "false",
        "is_row_identifier": "false",
        "is_target": "false",
        "name": "SM08_EA",
        "number_of_missing_values": "0"
      },
      {
        "data_type": "numeric",
        "index": "23",
        "is_ignore": "false",
        "is_row_identifier": "false",
        "is_target": "false",
        "name": "SM07_AEA.ed.",
        "number_of_missing_values": "0"
      },
      {
        "data_type": "numeric",
        "index": "24",
        "is_ignore": "false",
        "is_row_identifier": "false",
        "is_target": "false",
        "name": "SM03_EA.ed.",
        "number_of_missing_values": "0"
      },
      {
        "data_type": "numeric",
        "index": "25",
        "is_ignore": "false",
        "is_row_identifier": "false",
        "is_target": "false",
        "name": "CATS2D_05_LL",
        "number_of_missing_values": "0"
      },
      {
        "data_type": "numeric",
        "index": "26",
        "is_ignore": "false",
        "is_row_identifier": "false",
        "is_target": "false",
        "name": "nCIR",
        "number_of_missing_values": "0"
      },
      {
        "data_type": "numeric",
        "index": "27",
        "is_ignore": "false",
        "is_row_identifier": "false",
        "is_target": "false",
        "name": "PHI",
        "number_of_missing_values": "0"
      },
      {
        "data_type": "numeric",
        "index": "28",
        "is_ignore": "false",
        "is_row_identifier": "false",
        "is_target": "false",
        "name": "SpMax1_Bh.i.",
        "number_of_missing_values": "0"
      },
      {
        "data_type": "numeric",
        "index": "29",
        "is_ignore": "false",
        "is_row_identifier": "false",
        "is_target": "false",
        "name": "GNar",
        "number_of_missing_values": "0"
      },
      {
        "data_type": "numeric",
        "index": "30",
        "is_ignore": "false",
        "is_row_identifier": "false",
        "is_target": "false",
        "name": "SRW03",
        "number_of_missing_values": "0"
      },
      {
        "data_type": "numeric",
        "index": "31",
        "is_ignore": "false",
        "is_row_identifier": "false",
        "is_target": "false",
        "name": "D.Dtr03",
        "number_of_missing_values": "0"
      },
      {
        "data_type": "numeric",
        "index": "32",
        "is_ignore": "false",
        "is_row_identifier": "false",
        "is_target": "false",
        "name": "D.Dtr12",
        "number_of_missing_values": "0"
      },
      {
        "data_type": "numeric",
        "index": "33",
        "is_ignore": "false",
        "is_row_identifier": "false",
        "is_target": "false",
        "name": "SM07_EA",
        "number_of_missing_values": "0"
      },
      {
        "data_type": "numeric",
        "index": "34",
        "is_ignore": "false",
        "is_row_identifier": "false",
        "is_target": "false",
        "name": "nR03",
        "number_of_missing_values": "0"
      },
      {
        "data_type": "numeric",
        "index": "35",
        "is_ignore": "false",
        "is_row_identifier": "false",
        "is_target": "false",
        "name": "SpMAD_EA.ed.",
        "number_of_missing_values": "0"
      },
      {
        "data_type": "numeric",
        "index": "36",
        "is_ignore": "false",
        "is_row_identifier": "false",
        "is_target": "false",
        "name": "X4A",
        "number_of_missing_values": "0"
      },
      {
        "data_type": "numeric",
        "index": "37",
        "is_ignore": "false",
        "is_row_identifier": "false",
        "is_target": "false",
        "name": "SpMAD_AEA.bo.",
        "number_of_missing_values": "0"
      },
      {
        "data_type": "numeric",
        "index": "38",
        "is_ignore": "false",
        "is_row_identifier": "false",
        "is_target": "false",
        "name": "X3A",
        "number_of_missing_values": "0"
      },
      {
        "data_type": "numeric",
        "index": "39",
        "is_ignore": "false",
        "is_row_identifier": "false",
        "is_target": "false",
        "name": "nR12",
        "number_of_missing_values": "0"
      },
      {
        "data_type": "numeric",
        "index": "40",
        "is_ignore": "false",
        "is_row_identifier": "false",
        "is_target": "false",
        "name": "SpMAD_EA.ri.",
        "number_of_missing_values": "0"
      },
      {
        "data_type": "numeric",
        "index": "41",
        "is_ignore": "false",
        "is_row_identifier": "false",
        "is_target": "false",
        "name": "O.059",
        "number_of_missing_values": "0"
      },
      {
        "data_type": "numeric",
        "index": "42",
        "is_ignore": "false",
        "is_row_identifier": "false",
        "is_target": "false",
        "name": "nROR",
        "number_of_missing_values": "0"
      },
      {
        "data_type": "numeric",
        "index": "43",
        "is_ignore": "false",
        "is_row_identifier": "false",
        "is_target": "false",
        "name": "PW2",
        "number_of_missing_values": "0"
      },
      {
        "data_type": "numeric",
        "index": "44",
        "is_ignore": "false",
        "is_row_identifier": "false",
        "is_target": "false",
        "name": "X2A",
        "number_of_missing_values": "0"
      },
      {
        "data_type": "numeric",
        "index": "45",
        "is_ignore": "false",
        "is_row_identifier": "false",
        "is_target": "false",
        "name": "CIC3",
        "number_of_missing_values": "0"
      },
      {
        "data_type": "numeric",
        "index": "46",
        "is_ignore": "false",
        "is_row_identifier": "false",
        "is_target": "false",
        "name": "SM05_EA.dm.",
        "number_of_missing_values": "0"
      },
      {
        "data_type": "numeric",
        "index": "47",
        "is_ignore": "false",
        "is_row_identifier": "false",
        "is_target": "false",
        "name": "P_VSA_e_3",
        "number_of_missing_values": "0"
      },
      {
        "data_type": "numeric",
        "index": "48",
        "is_ignore": "false",
        "is_row_identifier": "false",
        "is_target": "false",
        "name": "Eig01_AEA.ri.",
        "number_of_missing_values": "0"
      },
      {
        "data_type": "numeric",
        "index": "49",
        "is_ignore": "false",
        "is_row_identifier": "false",
        "is_target": "false",
        "name": "SpMax_AEA.ri.",
        "number_of_missing_values": "0"
      },
      {
        "data_type": "numeric",
        "index": "50",
        "is_ignore": "false",
        "is_row_identifier": "false",
        "is_target": "false",
        "name": "Eig01_EA.ed.",
        "number_of_missing_values": "0"
      },
      {
        "data_type": "numeric",
        "index": "51",
        "is_ignore": "false",
        "is_row_identifier": "false",
        "is_target": "false",
        "name": "SM10_AEA.dm.",
        "number_of_missing_values": "0"
      },
      {
        "data_type": "numeric",
        "index": "52",
        "is_ignore": "false",
        "is_row_identifier": "false",
        "is_target": "false",
        "name": "SpMax_EA.ed.",
        "number_of_missing_values": "0"
      },
      {
        "data_type": "numeric",
        "index": "53",
        "is_ignore": "false",
        "is_row_identifier": "false",
        "is_target": "false",
        "name": "P_VSA_i_4",
        "number_of_missing_values": "0"
      },
      {
        "data_type": "numeric",
        "index": "54",
        "is_ignore": "false",
        "is_row_identifier": "false",
        "is_target": "false",
        "name": "Eig01_EA",
        "number_of_missing_values": "0"
      },
      {
        "data_type": "numeric",
        "index": "55",
        "is_ignore": "false",
        "is_row_identifier": "false",
        "is_target": "false",
        "name": "SM09_AEA.bo.",
        "number_of_missing_values": "0"
      },
      {
        "data_type": "numeric",
        "index": "56",
        "is_ignore": "false",
        "is_row_identifier": "false",
        "is_target": "false",
        "name": "SpDiam_EA",
        "number_of_missing_values": "0"
      },
      {
        "data_type": "numeric",
        "index": "57",
        "is_ignore": "false",
        "is_row_identifier": "false",
        "is_target": "false",
        "name": "SpMax_EA",
        "number_of_missing_values": "0"
      },
      {
        "data_type": "numeric",
        "index": "58",
        "is_ignore": "false",
        "is_row_identifier": "false",
        "is_target": "false",
        "name": "BIC3",
        "number_of_missing_values": "0"
      },
      {
        "data_type": "numeric",
        "index": "59",
        "is_ignore": "false",
        "is_row_identifier": "false",
        "is_target": "false",
        "name": "nCrq",
        "number_of_missing_values": "0"
      },
      {
        "data_type": "numeric",
        "index": "60",
        "is_ignore": "false",
        "is_row_identifier": "false",
        "is_target": "false",
        "name": "X1A",
        "number_of_missing_values": "0"
      },
      {
        "data_type": "numeric",
        "index": "61",
        "is_ignore": "false",
        "is_row_identifier": "false",
        "is_target": "false",
        "name": "Eig01_EA.ri.",
        "number_of_missing_values": "0"
      },
      {
        "data_type": "numeric",
        "index": "62",
        "is_ignore": "false",
        "is_row_identifier": "false",
        "is_target": "false",
        "name": "SpDiam_EA.ri.",
        "number_of_missing_values": "0"
      },
      {
        "data_type": "numeric",
        "index": "63",
        "is_ignore": "false",
        "is_row_identifier": "false",
        "is_target": "false",
        "name": "SpMax_EA.ri.",
        "number_of_missing_values": "0"
      },
      {
        "data_type": "numeric",
        "index": "64",
        "is_ignore": "false",
        "is_row_identifier": "false",
        "is_target": "false",
        "name": "nN",
        "number_of_missing_values": "0"
      },
      {
        "data_type": "numeric",
        "index": "65",
        "is_ignore": "false",
        "is_row_identifier": "false",
        "is_target": "false",
        "name": "SpDiam_EA.ed.",
        "number_of_missing_values": "0"
      },
      {
        "data_type": "numeric",
        "index": "66",
        "is_ignore": "false",
        "is_row_identifier": "false",
        "is_target": "false",
        "name": "SpMin1_Bh.s.",
        "number_of_missing_values": "0"
      },
      {
        "data_type": "numeric",
        "index": "67",
        "is_ignore": "false",
        "is_row_identifier": "false",
        "is_target": "false",
        "name": "SM08_EA.ed.",
        "number_of_missing_values": "0"
      },
      {
        "data_type": "numeric",
        "index": "68",
        "is_ignore": "false",
        "is_row_identifier": "false",
        "is_target": "false",
        "name": "Eig01_AEA.ed.",
        "number_of_missing_values": "0"
      },
      {
        "data_type": "numeric",
        "index": "69",
        "is_ignore": "false",
        "is_row_identifier": "false",
        "is_target": "false",
        "name": "SpMax_AEA.ed.",
        "number_of_missing_values": "0"
      },
      {
        "data_type": "numeric",
        "index": "70",
        "is_ignore": "false",
        "is_row_identifier": "false",
        "is_target": "false",
        "name": "SpMaxA_EA.ed.",
        "number_of_missing_values": "0"
      },
      {
        "data_type": "numeric",
        "index": "71",
        "is_ignore": "false",
        "is_row_identifier": "false",
        "is_target": "false",
        "name": "C.004",
        "number_of_missing_values": "0"
      },
      {
        "data_type": "numeric",
        "index": "72",
        "is_ignore": "false",
        "is_row_identifier": "false",
        "is_target": "false",
        "name": "nCq",
        "number_of_missing_values": "0"
      },
      {
        "data_type": "numeric",
        "index": "73",
        "is_ignore": "false",
        "is_row_identifier": "false",
        "is_target": "false",
        "name": "SM13_AEA.ed.",
        "number_of_missing_values": "0"
      },
      {
        "data_type": "numeric",
        "index": "74",
        "is_ignore": "false",
        "is_row_identifier": "false",
        "is_target": "false",
        "name": "SM14_AEA.ed.",
        "number_of_missing_values": "0"
      },
      {
        "data_type": "numeric",
        "index": "75",
        "is_ignore": "false",
        "is_row_identifier": "false",
        "is_target": "false",
        "name": "SIC3",
        "number_of_missing_values": "0"
      },
      {
        "data_type": "numeric",
        "index": "76",
        "is_ignore": "false",
        "is_row_identifier": "false",
        "is_target": "false",
        "name": "SM03_EA.dm.",
        "number_of_missing_values": "0"
      },
      {
        "data_type": "numeric",
        "index": "77",
        "is_ignore": "false",
        "is_row_identifier": "false",
        "is_target": "false",
        "name": "SM07_EA.dm.",
        "number_of_missing_values": "0"
      },
      {
        "data_type": "numeric",
        "index": "78",
        "is_ignore": "false",
        "is_row_identifier": "false",
        "is_target": "false",
        "name": "X0A",
        "number_of_missing_values": "0"
      },
      {
        "data_type": "numeric",
        "index": "79",
        "is_ignore": "false",
        "is_row_identifier": "false",
        "is_target": "false",
        "name": "SpDiam_AEA.ri.",
        "number_of_missing_values": "0"
      },
      {
        "data_type": "numeric",
        "index": "80",
        "is_ignore": "false",
        "is_row_identifier": "false",
        "is_target": "false",
        "name": "SM13_EA",
        "number_of_missing_values": "0"
      },
      {
        "data_type": "numeric",
        "index": "81",
        "is_ignore": "false",
        "is_row_identifier": "false",
        "is_target": "false",
        "name": "GATS4s",
        "number_of_missing_values": "0"
      },
      {
        "data_type": "numeric",
        "index": "82",
        "is_ignore": "false",
        "is_row_identifier": "false",
        "is_target": "false",
        "name": "SpMAD_EA.dm.",
        "number_of_missing_values": "0"
      },
      {
        "data_type": "numeric",
        "index": "83",
        "is_ignore": "false",
        "is_row_identifier": "false",
        "is_target": "false",
        "name": "SpMin1_Bh.v.",
        "number_of_missing_values": "0"
      },
      {
        "data_type": "numeric",
        "index": "84",
        "is_ignore": "false",
        "is_row_identifier": "false",
        "is_target": "false",
        "name": "SpMin1_Bh.p.",
        "number_of_missing_values": "0"
      },
      {
        "data_type": "numeric",
        "index": "85",
        "is_ignore": "false",
        "is_row_identifier": "false",
        "is_target": "false",
        "name": "SpMin1_Bh.e.",
        "number_of_missing_values": "0"
      },
      {
        "data_type": "numeric",
        "index": "86",
        "is_ignore": "false",
        "is_row_identifier": "false",
        "is_target": "false",
        "name": "RCI",
        "number_of_missing_values": "0"
      },
      {
        "data_type": "numeric",
        "index": "87",
        "is_ignore": "false",
        "is_row_identifier": "false",
        "is_target": "false",
        "name": "S2K",
        "number_of_missing_values": "0"
      },
      {
        "data_type": "numeric",
        "index": "88",
        "is_ignore": "false",
        "is_row_identifier": "false",
        "is_target": "false",
        "name": "N.072",
        "number_of_missing_values": "0"
      },
      {
        "data_type": "numeric",
        "index": "89",
        "is_ignore": "false",
        "is_row_identifier": "false",
        "is_target": "false",
        "name": "SpMAD_EA",
        "number_of_missing_values": "0"
      },
      {
        "data_type": "numeric",
        "index": "90",
        "is_ignore": "false",
        "is_row_identifier": "false",
        "is_target": "false",
        "name": "P_VSA_MR_3",
        "number_of_missing_values": "0"
      },
      {
        "data_type": "numeric",
        "index": "91",
        "is_ignore": "false",
        "is_row_identifier": "false",
        "is_target": "false",
        "name": "SM08_EA.ri.",
        "number_of_missing_values": "0"
      },
      {
        "data_type": "numeric",
        "index": "92",
        "is_ignore": "false",
        "is_row_identifier": "false",
        "is_target": "false",
        "name": "X5A",
        "number_of_missing_values": "0"
      },
      {
        "data_type": "numeric",
        "index": "93",
        "is_ignore": "false",
        "is_row_identifier": "false",
        "is_target": "false",
        "name": "nRCOOH",
        "number_of_missing_values": "0"
      },
      {
        "data_type": "numeric",
        "index": "94",
        "is_ignore": "false",
        "is_row_identifier": "false",
        "is_target": "false",
        "name": "SM12_EA.dm.",
        "number_of_missing_values": "0"
      },
      {
        "data_type": "numeric",
        "index": "95",
        "is_ignore": "false",
        "is_row_identifier": "false",
        "is_target": "false",
        "name": "Eta_L_A",
        "number_of_missing_values": "0"
      },
      {
        "data_type": "numeric",
        "index": "96",
        "is_ignore": "false",
        "is_row_identifier": "false",
        "is_target": "false",
        "name": "nCIC",
        "number_of_missing_values": "0"
      },
      {
        "data_type": "numeric",
        "index": "97",
        "is_ignore": "false",
        "is_row_identifier": "false",
        "is_target": "false",
        "name": "SpMAD_AEA.ri.",
        "number_of_missing_values": "0"
      },
      {
        "data_type": "numeric",
        "index": "98",
        "is_ignore": "false",
        "is_row_identifier": "false",
        "is_target": "false",
        "name": "SpDiam_EA.dm.",
        "number_of_missing_values": "0"
      },
      {
        "data_type": "numeric",
        "index": "99",
        "is_ignore": "false",
        "is_row_identifier": "false",
        "is_target": "false",
        "name": "SM07_EA.ri.",
        "number_of_missing_values": "0"
      },
      {
        "data_type": "numeric",
        "index": "100",
        "is_ignore": "false",
        "is_row_identifier": "false",
        "is_target": "false",
        "name": "SsssCH",
        "number_of_missing_values": "0"
      },
      {
        "data_type": "numeric",
        "index": "101",
        "is_ignore": "false",
        "is_row_identifier": "false",
        "is_target": "false",
        "name": "D.Dtr11",
        "number_of_missing_values": "0"
      },
      {
        "data_type": "numeric",
        "index": "102",
        "is_ignore": "false",
        "is_row_identifier": "false",
        "is_target": "false",
        "name": "GATS5s",
        "number_of_missing_values": "0"
      },
      {
        "data_type": "numeric",
        "index": "103",
        "is_ignore": "false",
        "is_row_identifier": "false",
        "is_target": "false",
        "name": "MATS5v",
        "number_of_missing_values": "0"
      },
      {
        "data_type": "numeric",
        "index": "104",
        "is_ignore": "false",
        "is_row_identifier": "false",
        "is_target": "false",
        "name": "CIC4",
        "number_of_missing_values": "0"
      },
      {
        "data_type": "numeric",
        "index": "105",
        "is_ignore": "false",
        "is_row_identifier": "false",
        "is_target": "false",
        "name": "HNar",
        "number_of_missing_values": "0"
      },
      {
        "data_type": "numeric",
        "index": "106",
        "is_ignore": "false",
        "is_row_identifier": "false",
        "is_target": "false",
        "name": "Eig01_EA.bo.",
        "number_of_missing_values": "0"
      },
      {
        "data_type": "numeric",
        "index": "107",
        "is_ignore": "false",
        "is_row_identifier": "false",
        "is_target": "false",
        "name": "SM11_AEA.ri.",
        "number_of_missing_values": "0"
      },
      {
        "data_type": "numeric",
        "index": "108",
        "is_ignore": "false",
        "is_row_identifier": "false",
        "is_target": "false",
        "name": "SpDiam_EA.bo.",
        "number_of_missing_values": "0"
      },
      {
        "data_type": "numeric",
        "index": "109",
        "is_ignore": "false",
        "is_row_identifier": "false",
        "is_target": "false",
        "name": "SpMax_EA.bo.",
        "number_of_missing_values": "0"
      },
      {
        "data_type": "numeric",
        "index": "110",
        "is_ignore": "false",
        "is_row_identifier": "false",
        "is_target": "false",
        "name": "Eig01_AEA.bo.",
        "number_of_missing_values": "0"
      },
      {
        "data_type": "numeric",
        "index": "111",
        "is_ignore": "false",
        "is_row_identifier": "false",
        "is_target": "false",
        "name": "SpDiam_AEA.bo.",
        "number_of_missing_values": "0"
      },
      {
        "data_type": "numeric",
        "index": "112",
        "is_ignore": "false",
        "is_row_identifier": "false",
        "is_target": "false",
        "name": "SpMax_AEA.bo.",
        "number_of_missing_values": "0"
      },
      {
        "data_type": "numeric",
        "index": "113",
        "is_ignore": "false",
        "is_row_identifier": "false",
        "is_target": "false",
        "name": "MATS3v",
        "number_of_missing_values": "0"
      },
      {
        "data_type": "numeric",
        "index": "114",
        "is_ignore": "false",
        "is_row_identifier": "false",
        "is_target": "false",
        "name": "TWC",
        "number_of_missing_values": "0"
      },
      {
        "data_type": "numeric",
        "index": "115",
        "is_ignore": "false",
        "is_row_identifier": "false",
        "is_target": "false",
        "name": "Hy",
        "number_of_missing_values": "0"
      },
      {
        "data_type": "numeric",
        "index": "116",
        "is_ignore": "false",
        "is_row_identifier": "false",
        "is_target": "false",
        "name": "SRW09",
        "number_of_missing_values": "0"
      },
      {
        "data_type": "numeric",
        "index": "117",
        "is_ignore": "false",
        "is_row_identifier": "false",
        "is_target": "false",
        "name": "SM04_EA.dm.",
        "number_of_missing_values": "0"
      },
      {
        "data_type": "numeric",
        "index": "118",
        "is_ignore": "false",
        "is_row_identifier": "false",
        "is_target": "false",
        "name": "SRW07",
        "number_of_missing_values": "0"
      },
      {
        "data_type": "numeric",
        "index": "119",
        "is_ignore": "false",
        "is_row_identifier": "false",
        "is_target": "false",
        "name": "SM14_EA.ri.",
        "number_of_missing_values": "0"
      },
      {
        "data_type": "numeric",
        "index": "120",
        "is_ignore": "false",
        "is_row_identifier": "false",
        "is_target": "false",
        "name": "SRW05",
        "number_of_missing_values": "0"
      },
      {
        "data_type": "numeric",
        "index": "121",
        "is_ignore": "false",
        "is_row_identifier": "false",
        "is_target": "false",
        "name": "Eta_sh_x",
        "number_of_missing_values": "0"
      },
      {
        "data_type": "numeric",
        "index": "122",
        "is_ignore": "false",
        "is_row_identifier": "false",
        "is_target": "false",
        "name": "SM11_EA.ri.",
        "number_of_missing_values": "0"
      },
      {
        "data_type": "numeric",
        "index": "123",
        "is_ignore": "false",
        "is_row_identifier": "false",
        "is_target": "false",
        "name": "CATS2D_01_AN",
        "number_of_missing_values": "0"
      },
      {
        "data_type": "numeric",
        "index": "124",
        "is_ignore": "false",
        "is_row_identifier": "false",
        "is_target": "false",
        "name": "CATS2D_01_DN",
        "number_of_missing_values": "0"
      },
      {
        "data_type": "numeric",
        "index": "125",
        "is_ignore": "false",
        "is_row_identifier": "false",
        "is_target": "false",
        "name": "CATS2D_08_NL",
        "number_of_missing_values": "0"
      },
      {
        "data_type": "numeric",
        "index": "126",
        "is_ignore": "false",
        "is_row_identifier": "false",
        "is_target": "false",
        "name": "Eta_sh_p",
        "number_of_missing_values": "0"
      },
      {
        "data_type": "numeric",
        "index": "127",
        "is_ignore": "false",
        "is_row_identifier": "false",
        "is_target": "false",
        "name": "SIC4",
        "number_of_missing_values": "0"
      },
      {
        "data_type": "numeric",
        "index": "128",
        "is_ignore": "false",
        "is_row_identifier": "false",
        "is_target": "false",
        "name": "MAXDN",
        "number_of_missing_values": "0"
      },
      {
        "data_type": "numeric",
        "index": "129",
        "is_ignore": "false",
        "is_row_identifier": "false",
        "is_target": "false",
        "name": "TRS",
        "number_of_missing_values": "0"
      },
      {
        "data_type": "numeric",
        "index": "130",
        "is_ignore": "false",
        "is_row_identifier": "false",
        "is_target": "false",
        "name": "SM14_EA.ed.",
        "number_of_missing_values": "0"
      },
      {
        "data_type": "numeric",
        "index": "131",
        "is_ignore": "false",
        "is_row_identifier": "false",
        "is_target": "false",
        "name": "SM02_EA.dm.",
        "number_of_missing_values": "0"
      },
      {
        "data_type": "numeric",
        "index": "132",
        "is_ignore": "false",
        "is_row_identifier": "false",
        "is_target": "false",
        "name": "H.050",
        "number_of_missing_values": "0"
      },
      {
        "data_type": "numeric",
        "index": "133",
        "is_ignore": "false",
        "is_row_identifier": "false",
        "is_target": "false",
        "name": "nHDon",
        "number_of_missing_values": "0"
      },
      {
        "data_type": "numeric",
        "index": "134",
        "is_ignore": "false",
        "is_row_identifier": "false",
        "is_target": "false",
        "name": "NssssC",
        "number_of_missing_values": "0"
      },
      {
        "data_type": "numeric",
        "index": "135",
        "is_ignore": "false",
        "is_row_identifier": "false",
        "is_target": "false",
        "name": "SM09_EA.ed.",
        "number_of_missing_values": "0"
      },
      {
        "data_type": "numeric",
        "index": "136",
        "is_ignore": "false",
        "is_row_identifier": "false",
        "is_target": "false",
        "name": "SM10_EA.ed.",
        "number_of_missing_values": "0"
      },
      {
        "data_type": "numeric",
        "index": "137",
        "is_ignore": "false",
        "is_row_identifier": "false",
        "is_target": "false",
        "name": "NssCH2",
        "number_of_missing_values": "0"
      },
      {
        "data_type": "numeric",
        "index": "138",
        "is_ignore": "false",
        "is_row_identifier": "false",
        "is_target": "false",
        "name": "MWC09",
        "number_of_missing_values": "0"
      },
      {
        "data_type": "numeric",
        "index": "139",
        "is_ignore": "false",
        "is_row_identifier": "false",
        "is_target": "false",
        "name": "nRCONR2",
        "number_of_missing_values": "0"
      },
      {
        "data_type": "numeric",
        "index": "140",
        "is_ignore": "false",
        "is_row_identifier": "false",
        "is_target": "true",
        "name": "pXC50",
        "number_of_missing_values": "0"
      }
    ]
  }
}