{
  "data_features": {
    "feature": [
      {
        "data_type": "nominal",
        "index": "0",
        "is_ignore": "false",
        "is_row_identifier": "true",
        "is_target": "false",
        "name": "molecule_id",
        "nominal_value": [
          "CHEMBL1078231",
          "CHEMBL114544",
          "CHEMBL1212972",
          "CHEMBL1287980",
          "CHEMBL1300729",
          "CHEMBL1302600",
          "CHEMBL1303373",
          "CHEMBL1303508",
          "CHEMBL1306900",
          "CHEMBL1309432",
          "CHEMBL1309871",
          "CHEMBL1309890",
          "CHEMBL1310449",
          "CHEMBL1310782",
          "CHEMBL1310804",
          "CHEMBL1312308",
          "CHEMBL1312968",
          "CHEMBL1312969",
          "CHEMBL1313592",
          "CHEMBL1318103",
          "CHEMBL1318358",
          "CHEMBL1318526",
          "CHEMBL1321614",
          "CHEMBL1323821",
          "CHEMBL1324005",
          "CHEMBL1330558",
          "CHEMBL1334040",
          "CHEMBL1335002",
          "CHEMBL1336535",
          "CHEMBL1338167",
          "CHEMBL1340770",
          "CHEMBL1341008",
          "CHEMBL1342293",
          "CHEMBL1342574",
          "CHEMBL1342907",
          "CHEMBL1343689",
          "CHEMBL1346587",
          "CHEMBL1351473",
          "CHEMBL1352515",
          "CHEMBL1359342",
          "CHEMBL1359359",
          "CHEMBL1359949",
          "CHEMBL1361256",
          "CHEMBL1361913",
          "CHEMBL1363242",
          "CHEMBL1363376",
          "CHEMBL1366012",
          "CHEMBL1370183",
          "CHEMBL1371649",
          "CHEMBL1373031",
          "CHEMBL1374840",
          "CHEMBL1375775",
          "CHEMBL1379500",
          "CHEMBL1379713",
          "CHEMBL1380425",
          "CHEMBL1382003",
          "CHEMBL1382317",
          "CHEMBL1382320",
          "CHEMBL1387248",
          "CHEMBL1388330",
          "CHEMBL1391094",
          "CHEMBL1391621",
          "CHEMBL1397830",
          "CHEMBL1398171",
          "CHEMBL1400481",
          "CHEMBL1401467",
          "CHEMBL1403869",
          "CHEMBL1404301",
          "CHEMBL1406051",
          "CHEMBL1406895",
          "CHEMBL1410616",
          "CHEMBL1412087",
          "CHEMBL1419683",
          "CHEMBL1420064",
          "CHEMBL1421589",
          "CHEMBL1422976",
          "CHEMBL1424264",
          "CHEMBL1424361",
          "CHEMBL1426411",
          "CHEMBL1426562",
          "CHEMBL1427185",
          "CHEMBL1428258",
          "CHEMBL1429468",
          "CHEMBL1430235",
          "CHEMBL1430795",
          "CHEMBL1431325",
          "CHEMBL1431608",
          "CHEMBL1431909",
          "CHEMBL1435343",
          "CHEMBL1437683",
          "CHEMBL1438570",
          "CHEMBL1443778",
          "CHEMBL1445842",
          "CHEMBL1446929",
          "CHEMBL1446969",
          "CHEMBL1446971",
          "CHEMBL1447124",
          "CHEMBL1447350",
          "CHEMBL1447697",
          "CHEMBL1448982",
          "CHEMBL1450616",
          "CHEMBL1454171",
          "CHEMBL1454837",
          "CHEMBL1455967",
          "CHEMBL1457040",
          "CHEMBL1458147",
          "CHEMBL1458840",
          "CHEMBL1461196",
          "CHEMBL1462873",
          "CHEMBL1463088",
          "CHEMBL1463571",
          "CHEMBL1463647",
          "CHEMBL1463974",
          "CHEMBL1464853",
          "CHEMBL1467867",
          "CHEMBL1469161",
          "CHEMBL1469580",
          "CHEMBL1470485",
          "CHEMBL1470925",
          "CHEMBL1472570",
          "CHEMBL1477528",
          "CHEMBL1481383",
          "CHEMBL1483161",
          "CHEMBL1483287",
          "CHEMBL1484163",
          "CHEMBL1484710",
          "CHEMBL1485277",
          "CHEMBL1485605",
          "CHEMBL1485865",
          "CHEMBL1487183",
          "CHEMBL1487205",
          "CHEMBL1487940",
          "CHEMBL1490134",
          "CHEMBL1490887",
          "CHEMBL1491015",
          "CHEMBL1491719",
          "CHEMBL1491847",
          "CHEMBL1496231",
          "CHEMBL1497049",
          "CHEMBL1497290",
          "CHEMBL1500256",
          "CHEMBL1500450",
          "CHEMBL1504403",
          "CHEMBL1504875",
          "CHEMBL1506256",
          "CHEMBL1506728",
          "CHEMBL1508121",
          "CHEMBL1509216",
          "CHEMBL1510664",
          "CHEMBL1510905",
          "CHEMBL1510964",
          "CHEMBL1516786",
          "CHEMBL1517470",
          "CHEMBL1518799",
          "CHEMBL1519374",
          "CHEMBL1519958",
          "CHEMBL1522033",
          "CHEMBL1522544",
          "CHEMBL1522846",
          "CHEMBL1524515",
          "CHEMBL1524916",
          "CHEMBL1524932",
          "CHEMBL1527565",
          "CHEMBL1528367",
          "CHEMBL1528425",
          "CHEMBL1528430",
          "CHEMBL1529115",
          "CHEMBL1530839",
          "CHEMBL1531676",
          "CHEMBL1532089",
          "CHEMBL1533772",
          "CHEMBL1534949",
          "CHEMBL1535150",
          "CHEMBL1535169",
          "CHEMBL1536932",
          "CHEMBL1539107",
          "CHEMBL1541594",
          "CHEMBL1542492",
          "CHEMBL1543371",
          "CHEMBL1545697",
          "CHEMBL1546440",
          "CHEMBL1546739",
          "CHEMBL1548252",
          "CHEMBL1555566",
          "CHEMBL1557648",
          "CHEMBL1561133",
          "CHEMBL1561507",
          "CHEMBL1563335",
          "CHEMBL1565051",
          "CHEMBL1565536",
          "CHEMBL1567573",
          "CHEMBL1568277",
          "CHEMBL1570587",
          "CHEMBL1570845",
          "CHEMBL1570871",
          "CHEMBL1571835",
          "CHEMBL1572356",
          "CHEMBL1574132",
          "CHEMBL1577064",
          "CHEMBL1578607",
          "CHEMBL1578670",
          "CHEMBL1580311",
          "CHEMBL1580684",
          "CHEMBL1582121",
          "CHEMBL1583665",
          "CHEMBL1584395",
          "CHEMBL1584752",
          "CHEMBL1585777",
          "CHEMBL1587764",
          "CHEMBL1595015",
          "CHEMBL1595121",
          "CHEMBL1600326",
          "CHEMBL1600396",
          "CHEMBL1607475",
          "CHEMBL1608392",
          "CHEMBL1609011",
          "CHEMBL1609630",
          "CHEMBL1610008",
          "CHEMBL1698464",
          "CHEMBL1698492",
          "CHEMBL1700182",
          "CHEMBL1700323",
          "CHEMBL1700786",
          "CHEMBL1702614",
          "CHEMBL1703076",
          "CHEMBL1705093",
          "CHEMBL1706492",
          "CHEMBL1707040",
          "CHEMBL1708074",
          "CHEMBL1710429",
          "CHEMBL1710708",
          "CHEMBL1712082",
          "CHEMBL1713323",
          "CHEMBL1713376",
          "CHEMBL1714002",
          "CHEMBL1716008",
          "CHEMBL1716038",
          "CHEMBL1717415",
          "CHEMBL1717529",
          "CHEMBL1717890",
          "CHEMBL1720855",
          "CHEMBL1721159",
          "CHEMBL1722738",
          "CHEMBL1723955",
          "CHEMBL1724522",
          "CHEMBL1724933",
          "CHEMBL1725379",
          "CHEMBL1726134",
          "CHEMBL1727268",
          "CHEMBL1728065",
          "CHEMBL1729008",
          "CHEMBL1729300",
          "CHEMBL1730238",
          "CHEMBL1730870",
          "CHEMBL1733564",
          "CHEMBL1733858",
          "CHEMBL1734152",
          "CHEMBL1734467",
          "CHEMBL1735062",
          "CHEMBL1735318",
          "CHEMBL1875956",
          "CHEMBL1892026",
          "CHEMBL1904956",
          "CHEMBL1964407",
          "CHEMBL1965403",
          "CHEMBL1965860",
          "CHEMBL1967770",
          "CHEMBL1968732",
          "CHEMBL1969046",
          "CHEMBL1982845",
          "CHEMBL1987894",
          "CHEMBL198949",
          "CHEMBL1991431",
          "CHEMBL1993788",
          "CHEMBL1996730",
          "CHEMBL1997098",
          "CHEMBL1997450",
          "CHEMBL2000517",
          "CHEMBL2001922",
          "CHEMBL2004847",
          "CHEMBL212504",
          "CHEMBL225164",
          "CHEMBL242163",
          "CHEMBL309474",
          "CHEMBL355496",
          "CHEMBL363491",
          "CHEMBL387762",
          "CHEMBL393287",
          "CHEMBL42288",
          "CHEMBL449621",
          "CHEMBL454246",
          "CHEMBL592124",
          "CHEMBL67166"
        ],
        "number_of_missing_values": "0"
      },
      {
        "data_type": "numeric",
        "index": "1",
        "is_ignore": "false",
        "is_row_identifier": "false",
        "is_target": "false",
        "name": "AMW",
        "number_of_missing_values": "0"
      },
      {
        "data_type": "numeric",
        "index": "2",
        "is_ignore": "false",
        "is_row_identifier": "false",
        "is_target": "false",
        "name": "C.",
        "number_of_missing_values": "0"
      },
      {
        "data_type": "numeric",
        "index": "3",
        "is_ignore": "false",
        "is_row_identifier": "false",
        "is_target": "false",
        "name": "H.",
        "number_of_missing_values": "0"
      },
      {
        "data_type": "numeric",
        "index": "4",
        "is_ignore": "false",
        "is_row_identifier": "false",
        "is_target": "false",
        "name": "Me",
        "number_of_missing_values": "0"
      },
      {
        "data_type": "numeric",
        "index": "5",
        "is_ignore": "false",
        "is_row_identifier": "false",
        "is_target": "false",
        "name": "Mi",
        "number_of_missing_values": "0"
      },
      {
        "data_type": "numeric",
        "index": "6",
        "is_ignore": "false",
        "is_row_identifier": "false",
        "is_target": "false",
        "name": "Mp",
        "number_of_missing_values": "0"
      },
      {
        "data_type": "numeric",
        "index": "7",
        "is_ignore": "false",
        "is_row_identifier": "false",
        "is_target": "false",
        "name": "Mv",
        "number_of_missing_values": "0"
      },
      {
        "data_type": "numeric",
        "index": "8",
        "is_ignore": "false",
        "is_row_identifier": "false",
        "is_target": "false",
        "name": "MW",
        "number_of_missing_values": "0"
      },
      {
        "data_type": "numeric",
        "index": "9",
        "is_ignore": "false",
        "is_row_identifier": "false",
        "is_target": "false",
        "name": "N.",
        "number_of_missing_values": "0"
      },
      {
        "data_type": "numeric",
        "index": "10",
        "is_ignore": "false",
        "is_row_identifier": "false",
        "is_target": "false",
        "name": "nAB",
        "number_of_missing_values": "0"
      },
      {
        "data_type": "numeric",
        "index": "11",
        "is_ignore": "false",
        "is_row_identifier": "false",
        "is_target": "false",
        "name": "nAT",
        "number_of_missing_values": "0"
      },
      {
        "data_type": "numeric",
        "index": "12",
        "is_ignore": "false",
        "is_row_identifier": "false",
        "is_target": "false",
        "name": "nB",
        "number_of_missing_values": "0"
      },
      {
        "data_type": "numeric",
        "index": "13",
        "is_ignore": "false",
        "is_row_identifier": "false",
        "is_target": "false",
        "name": "nBM",
        "number_of_missing_values": "0"
      },
      {
        "data_type": "numeric",
        "index": "14",
        "is_ignore": "false",
        "is_row_identifier": "false",
        "is_target": "false",
        "name": "nBO",
        "number_of_missing_values": "0"
      },
      {
        "data_type": "numeric",
        "index": "15",
        "is_ignore": "false",
        "is_row_identifier": "false",
        "is_target": "false",
        "name": "nBR",
        "number_of_missing_values": "0"
      },
      {
        "data_type": "numeric",
        "index": "16",
        "is_ignore": "false",
        "is_row_identifier": "false",
        "is_target": "false",
        "name": "nBT",
        "number_of_missing_values": "0"
      },
      {
        "data_type": "numeric",
        "index": "17",
        "is_ignore": "false",
        "is_row_identifier": "false",
        "is_target": "false",
        "name": "nC",
        "number_of_missing_values": "0"
      },
      {
        "data_type": "numeric",
        "index": "18",
        "is_ignore": "false",
        "is_row_identifier": "false",
        "is_target": "false",
        "name": "nCL",
        "number_of_missing_values": "0"
      },
      {
        "data_type": "numeric",
        "index": "19",
        "is_ignore": "false",
        "is_row_identifier": "false",
        "is_target": "false",
        "name": "nCsp",
        "number_of_missing_values": "0"
      },
      {
        "data_type": "numeric",
        "index": "20",
        "is_ignore": "false",
        "is_row_identifier": "false",
        "is_target": "false",
        "name": "nCsp2",
        "number_of_missing_values": "0"
      },
      {
        "data_type": "numeric",
        "index": "21",
        "is_ignore": "false",
        "is_row_identifier": "false",
        "is_target": "false",
        "name": "nCsp3",
        "number_of_missing_values": "0"
      },
      {
        "data_type": "numeric",
        "index": "22",
        "is_ignore": "false",
        "is_row_identifier": "false",
        "is_target": "false",
        "name": "nDB",
        "number_of_missing_values": "0"
      },
      {
        "data_type": "numeric",
        "index": "23",
        "is_ignore": "false",
        "is_row_identifier": "false",
        "is_target": "false",
        "name": "nF",
        "number_of_missing_values": "0"
      },
      {
        "data_type": "numeric",
        "index": "24",
        "is_ignore": "false",
        "is_row_identifier": "false",
        "is_target": "false",
        "name": "nH",
        "number_of_missing_values": "0"
      },
      {
        "data_type": "numeric",
        "index": "25",
        "is_ignore": "false",
        "is_row_identifier": "false",
        "is_target": "false",
        "name": "nHet",
        "number_of_missing_values": "0"
      },
      {
        "data_type": "numeric",
        "index": "26",
        "is_ignore": "false",
        "is_row_identifier": "false",
        "is_target": "false",
        "name": "nHM",
        "number_of_missing_values": "0"
      },
      {
        "data_type": "numeric",
        "index": "27",
        "is_ignore": "false",
        "is_row_identifier": "false",
        "is_target": "false",
        "name": "nI",
        "number_of_missing_values": "0"
      },
      {
        "data_type": "numeric",
        "index": "28",
        "is_ignore": "false",
        "is_row_identifier": "false",
        "is_target": "false",
        "name": "nN",
        "number_of_missing_values": "0"
      },
      {
        "data_type": "numeric",
        "index": "29",
        "is_ignore": "false",
        "is_row_identifier": "false",
        "is_target": "false",
        "name": "nO",
        "number_of_missing_values": "0"
      },
      {
        "data_type": "numeric",
        "index": "30",
        "is_ignore": "false",
        "is_row_identifier": "false",
        "is_target": "false",
        "name": "nP",
        "number_of_missing_values": "0"
      },
      {
        "data_type": "numeric",
        "index": "31",
        "is_ignore": "false",
        "is_row_identifier": "false",
        "is_target": "false",
        "name": "nS",
        "number_of_missing_values": "0"
      },
      {
        "data_type": "numeric",
        "index": "32",
        "is_ignore": "false",
        "is_row_identifier": "false",
        "is_target": "false",
        "name": "nSK",
        "number_of_missing_values": "0"
      },
      {
        "data_type": "numeric",
        "index": "33",
        "is_ignore": "false",
        "is_row_identifier": "false",
        "is_target": "false",
        "name": "nTB",
        "number_of_missing_values": "0"
      },
      {
        "data_type": "numeric",
        "index": "34",
        "is_ignore": "false",
        "is_row_identifier": "false",
        "is_target": "false",
        "name": "nX",
        "number_of_missing_values": "0"
      },
      {
        "data_type": "numeric",
        "index": "35",
        "is_ignore": "false",
        "is_row_identifier": "false",
        "is_target": "false",
        "name": "O.",
        "number_of_missing_values": "0"
      },
      {
        "data_type": "numeric",
        "index": "36",
        "is_ignore": "false",
        "is_row_identifier": "false",
        "is_target": "false",
        "name": "RBF",
        "number_of_missing_values": "0"
      },
      {
        "data_type": "numeric",
        "index": "37",
        "is_ignore": "false",
        "is_row_identifier": "false",
        "is_target": "false",
        "name": "RBN",
        "number_of_missing_values": "0"
      },
      {
        "data_type": "numeric",
        "index": "38",
        "is_ignore": "false",
        "is_row_identifier": "false",
        "is_target": "false",
        "name": "SCBO",
        "number_of_missing_values": "0"
      },
      {
        "data_type": "numeric",
        "index": "39",
        "is_ignore": "false",
        "is_row_identifier": "false",
        "is_target": "false",
        "name": "Se",
        "number_of_missing_values": "0"
      },
      {
        "data_type": "numeric",
        "index": "40",
        "is_ignore": "false",
        "is_row_identifier": "false",
        "is_target": "false",
        "name": "Si",
        "number_of_missing_values": "0"
      },
      {
        "data_type": "numeric",
        "index": "41",
        "is_ignore": "false",
        "is_row_identifier": "false",
        "is_target": "false",
        "name": "Sp",
        "number_of_missing_values": "0"
      },
      {
        "data_type": "numeric",
        "index": "42",
        "is_ignore": "false",
        "is_row_identifier": "false",
        "is_target": "false",
        "name": "Sv",
        "number_of_missing_values": "0"
      },
      {
        "data_type": "numeric",
        "index": "43",
        "is_ignore": "false",
        "is_row_identifier": "false",
        "is_target": "false",
        "name": "X.",
        "number_of_missing_values": "0"
      },
      {
        "data_type": "numeric",
        "index": "44",
        "is_ignore": "false",
        "is_row_identifier": "false",
        "is_target": "true",
        "name": "pXC50",
        "number_of_missing_values": "0"
      }
    ]
  }
}