{
  "data_set_description": {
    "collection_date": "November 2013",
    "creator": "Dr Jeremy Besnard, Dr Ivan Olier, Dr Noureddin Sadawi, Dr Larisa Soldatova, Dr Crina Grosan, Prof Ross King, Dr Richard Bickerton, Prof Andrew Hopkins and Dr Willem van Hoorn",
    "default_target_attribute": "pXC50",
    "description": "This dataset contains QSAR data (from ChEMBL version 17) showing activity values (unit is pseudo-pCI50) of several compounds on drug target ChEMBL_ID: CHEMBL1781858 (TID: 104150), and it has 71 rows and 1215 features (not including molecule IDs and class feature: molecule_id and pXC50). The features represent Molecular Descriptors which were generated from SMILES strings. Missing value imputation was applied to this dataset (By choosing the Median).",
    "description_version": "1",
    "file_id": "3688984",
    "format": "ARFF",
    "id": "40083",
    "licence": "Public",
    "md5_checksum": "41b1dd97963d8d57797e89a41f9dd04c",
    "minio_url": "https://data.openml.org/datasets/0004/40083/dataset_40083.pq",
    "name": "QSAR-DATASET-FOR-DRUG-TARGET-CHEMBL1781858",
    "original_data_url": "https://www.ebi.ac.uk/chembl/target/inspect/CHEMBL1781858",
    "parquet_url": "https://data.openml.org/datasets/0004/40083/dataset_40083.pq",
    "processing_date": "2018-10-04 07:00:47",
    "row_id_attribute": "molecule_id",
    "status": "deactivated",
    "tag": [
      "MetaQSAR",
      "study_13"
    ],
    "upload_date": "2016-07-16T10:13:39",
    "url": "https://api.openml.org/data/v1/download/3688984/QSAR-DATASET-FOR-DRUG-TARGET-CHEMBL1781858.arff",
    "version": "12",
    "visibility": "public"
  }
}