"molecule_id","FCFP4_1024b79","FCFP4_1024b857","FCFP4_1024b314","FCFP4_1024b882","FCFP4_1024b739","FCFP4_1024b842","FCFP4_1024b573","FCFP4_1024b809","FCFP4_1024b142","FCFP4_1024b589","FCFP4_1024b475","FCFP4_1024b617","FCFP4_1024b888","FCFP4_1024b1","FCFP4_1024b10","FCFP4_1024b100","FCFP4_1024b1000","FCFP4_1024b1001","FCFP4_1024b1002","FCFP4_1024b1003","FCFP4_1024b1004","FCFP4_1024b1005","FCFP4_1024b1006","FCFP4_1024b1007","FCFP4_1024b1008","FCFP4_1024b1009","FCFP4_1024b101","FCFP4_1024b1010","FCFP4_1024b1011","FCFP4_1024b1012","FCFP4_1024b1013","FCFP4_1024b1014","FCFP4_1024b1015","FCFP4_1024b1016","FCFP4_1024b1017","FCFP4_1024b1018","FCFP4_1024b1019","FCFP4_1024b102","FCFP4_1024b1020","FCFP4_1024b1021","FCFP4_1024b1022","FCFP4_1024b1023","FCFP4_1024b1024","FCFP4_1024b103","FCFP4_1024b104","FCFP4_1024b105","FCFP4_1024b106","FCFP4_1024b107","FCFP4_1024b108","FCFP4_1024b109","FCFP4_1024b11","FCFP4_1024b110","FCFP4_1024b111","FCFP4_1024b112","FCFP4_1024b113","FCFP4_1024b114","FCFP4_1024b115","FCFP4_1024b116","FCFP4_1024b117","FCFP4_1024b118","FCFP4_1024b119","FCFP4_1024b12","FCFP4_1024b120","FCFP4_1024b121","FCFP4_1024b122","FCFP4_1024b123","FCFP4_1024b124","FCFP4_1024b125","FCFP4_1024b126","FCFP4_1024b127","FCFP4_1024b128","FCFP4_1024b129","FCFP4_1024b13","FCFP4_1024b130","FCFP4_1024b131","FCFP4_1024b132","FCFP4_1024b133","FCFP4_1024b134","FCFP4_1024b135","FCFP4_1024b136","FCFP4_1024b137","FCFP4_1024b138","FCFP4_1024b139","FCFP4_1024b14","FCFP4_1024b140","FCFP4_1024b141","FCFP4_1024b143","FCFP4_1024b144","FCFP4_1024b145","FCFP4_1024b146","FCFP4_1024b147","FCFP4_1024b148","FCFP4_1024b149","FCFP4_1024b15","FCFP4_1024b150","FCFP4_1024b151","FCFP4_1024b152","FCFP4_1024b153","FCFP4_1024b154","FCFP4_1024b155","FCFP4_1024b156","FCFP4_1024b157","pXC50"
{14 1,79 1,103 6.567}
{0 CHEMBL10195,13 1,14 1,66 1,71 1,81 1,91 1,103 8.268}
{0 CHEMBL10483,14 1,66 1,71 1,81 1,91 1,103 8.924}
{0 CHEMBL10534,14 1,66 1,71 1,81 1,91 1,103 8.553}
{0 CHEMBL10597,14 1,66 1,71 1,81 1,103 6.772}
{0 CHEMBL1077381,14 1,83 1,92 1,103 6.66}
{0 CHEMBL1077391,14 1,83 1,92 1,103 7.62}
{0 CHEMBL1078580,14 1,83 1,92 1,103 6.73}
{0 CHEMBL1078985,14 1,83 1,92 1,103 7.62}
{0 CHEMBL1079272,14 1,83 1,103 5.5}
{0 CHEMBL1080396,14 1,83 1,103 5.971}
{0 CHEMBL1080397,14 1,83 1,103 6.159}
{0 CHEMBL1080398,14 1,60 1,83 1,103 6.39}
{0 CHEMBL1080412,14 1,40 1,83 1,92 1,103 7.092}
{0 CHEMBL1080575,14 1,36 1,83 1,103 6.175}
{0 CHEMBL1080576,14 1,83 1,103 6.979}
{0 CHEMBL1080588,14 1,40 1,83 1,92 1,103 6.733}
{0 CHEMBL1081861,14 1,83 1,103 6.499}
{0 CHEMBL116842,5 1,6 1,8 1,11 1,12 1,13 1,14 1,81 1,83 1,103 9.114}
{0 CHEMBL11709,14 1,66 1,71 1,81 1,103 8.31}
{0 CHEMBL12,14 1,83 1,103 7.532}
{0 CHEMBL120838,14 1,15 1,37 1,81 1,98 1,103 8.538}
{0 CHEMBL121088,14 1,37 1,81 1,83 1,98 1,103 7.783}
{0 CHEMBL121275,14 1,37 1,81 1,98 1,103 8.071}
{0 CHEMBL121277,14 1,37 1,81 1,98 1,103 8.244}
{0 CHEMBL121370,14 1,37 1,44 1,81 1,98 1,103 7.812}
{0 CHEMBL121603,14 1,77 1,81 1,98 1,103 7.547}
{0 CHEMBL122154,14 1,81 1,98 1,103 8.456}
{0 CHEMBL122619,14 1,37 1,81 1,98 1,103 8.009}
{0 CHEMBL123072,14 1,29 1,37 1,81 1,98 1,103 6.68}
{0 CHEMBL123078,14 1,37 1,81 1,92 1,98 1,103 6}
{0 CHEMBL123406,14 1,81 1,98 1,101 1,103 7.706}
{0 CHEMBL123471,14 1,37 1,81 1,98 1,103 6.692}
{0 CHEMBL123530,14 1,81 1,98 1,103 7.244}
{0 CHEMBL123882,14 1,37 1,81 1,98 1,103 7.165}
{0 CHEMBL1256850,14 1,71 1,81 1,91 1,103 7.854}
{0 CHEMBL1269058,14 1,66 1,71 1,81 1,83 1,103 7.569}
{0 CHEMBL1269059,14 1,66 1,71 1,77 1,81 1,103 6.907}
{0 CHEMBL1269060,14 1,66 1,71 1,77 1,81 1,103 5.975}
{0 CHEMBL1269061,14 1,66 1,71 1,81 1,103 7.222}
{0 CHEMBL1269062,14 1,23 1,66 1,71 1,98 1,103 5.523}
{0 CHEMBL1269093,14 1,66 1,71 1,98 1,103 6.908}
{0 CHEMBL1269094,14 1,66 1,71 1,79 1,98 1,103 6.087}
{0 CHEMBL1269148,14 1,66 1,71 1,81 1,103 7.229}
{0 CHEMBL1269149,14 1,66 1,71 1,81 1,103 7.488}
{0 CHEMBL1269785,14 1,66 1,71 1,77 1,103 6.907}
{0 CHEMBL1269786,14 1,66 1,71 1,81 1,83 1,103 7.509}
{0 CHEMBL1269816,14 1,27 1,66 1,71 1,77 1,81 1,103 8.347}
{0 CHEMBL1269929,14 1,66 1,71 1,77 1,81 1,103 7.351}
{0 CHEMBL1269930,14 1,66 1,71 1,81 1,83 1,103 7.348}
{0 CHEMBL1270037,14 1,27 1,66 1,71 1,77 1,81 1,103 7.523}
{0 CHEMBL1270038,14 1,66 1,71 1,77 1,81 1,103 6.955}
{0 CHEMBL1270143,14 1,27 1,66 1,71 1,77 1,81 1,103 7.229}
{0 CHEMBL1270144,14 1,66 1,71 1,81 1,83 1,103 7.409}
{0 CHEMBL1270247,14 1,62 1,66 1,71 1,81 1,83 1,103 6.521}
{0 CHEMBL1270248,14 1,66 1,71 1,81 1,103 7.886}
{0 CHEMBL1270347,14 1,66 1,71 1,81 1,103 6.845}
{0 CHEMBL1270348,14 1,66 1,71 1,81 1,103 6.78}
{0 CHEMBL1270442,14 1,66 1,71 1,81 1,103 7.886}
{0 CHEMBL1270443,14 1,66 1,71 1,81 1,103 8.695}
{0 CHEMBL1270538,14 1,66 1,71 1,81 1,103 6.863}
{0 CHEMBL1270539,14 1,16 1,66 1,71 1,77 1,81 1,103 8.049}
{0 CHEMBL1270540,14 1,66 1,71 1,81 1,83 1,103 8.343}
{0 CHEMBL1270637,14 1,66 1,71 1,81 1,103 7.611}
{0 CHEMBL1270638,14 1,62 1,66 1,71 1,81 1,103 8.097}
{0 CHEMBL1270639,14 1,66 1,71 1,81 1,103 7.481}
{0 CHEMBL1270739,14 1,62 1,66 1,71 1,81 1,103 5.699}
{0 CHEMBL1270740,14 1,62 1,66 1,71 1,81 1,103 6}
{0 CHEMBL1270741,14 1,66 1,71 1,81 1,103 6.752}
{0 CHEMBL1270841,14 1,66 1,71 1,81 1,103 6}
{0 CHEMBL1270842,14 1,66 1,71 1,98 1,103 5.523}
{0 CHEMBL1270843,14 1,62 1,66 1,71 1,81 1,103 6.031}
{0 CHEMBL1270943,14 1,62 1,66 1,71 1,81 1,103 6.464}
{0 CHEMBL1270944,14 1,77 1,78 1,81 1,103 5.301}
{0 CHEMBL1271047,14 1,58 1,66 1,81 1,91 1,103 6.863}
{0 CHEMBL129855,14 1,27 1,37 1,103 6.907}
{0 CHEMBL130416,14 1,27 1,37 1,103 7.222}
{0 CHEMBL132529,14 1,15 1,37 1,81 1,103 7.347}
{0 CHEMBL13280,14 1,83 1,103 8.781}
{0 CHEMBL133112,14 1,37 1,103 6.498}
{0 CHEMBL133219,14 1,83 1,103 7.569}
{0 CHEMBL133272,14 1,37 1,103 7.991}
{0 CHEMBL133705,14 1,37 1,81 1,103 7.056}
{0 CHEMBL134175,14 1,37 1,81 1,103 7.398}
{0 CHEMBL134241,14 1,83 1,103 6}
{0 CHEMBL13458,14 1,48 1,97 1,103 6.633}
{0 CHEMBL13662,14 1,19 1,62 1,103 5.707}
{0 CHEMBL141039,14 1,66 1,71 1,103 7.932}
{0 CHEMBL1518572,14 1,66 1,71 1,81 1,91 1,103 8.377}
{0 CHEMBL1521,14 1,15 1,38 1,81 1,103 5.788}
{0 CHEMBL1631466,14 1,32 1,39 1,82 1,103 7.469}
{0 CHEMBL1631467,14 1,19 1,39 1,65 1,92 1,103 7.268}
{0 CHEMBL1631468,14 1,39 1,65 1,103 6.702}
{0 CHEMBL1631469,14 1,32 1,39 1,63 1,82 1,103 8.824}
{0 CHEMBL1631470,1 1,14 1,39 1,65 1,83 1,103 8.222}
{0 CHEMBL1644823,14 1,20 1,37 1,48 1,71 1,103 9}
{0 CHEMBL1644825,14 1,20 1,37 1,48 1,71 1,103 7.187}
{0 CHEMBL1644826,14 1,20 1,37 1,48 1,71 1,103 8.77}
{0 CHEMBL1644828,14 1,20 1,37 1,48 1,71 1,103 8.357}
{0 CHEMBL171900,5 1,6 1,8 1,10 1,11 1,12 1,13 1,14 1,77 1,103 10.222}
{0 CHEMBL171901,5 1,6 1,8 1,10 1,11 1,12 1,13 1,83 1,103 10.097}
{0 CHEMBL172839,14 1,15 1,66 1,71 1,98 1,103 7.083}
{0 CHEMBL172866,44 1,66 1,71 1,103 6.928}
{0 CHEMBL173087,13 1,14 1,71 1,81 1,93 1,103 6}
{0 CHEMBL173193,66 1,71 1,103 7.939}
{0 CHEMBL173325,66 1,71 1,103 7.08}
{0 CHEMBL173329,14 1,66 1,71 1,81 1,91 1,103 8.538}
{0 CHEMBL173339,14 1,81 1,83 1,103 7.879}
{0 CHEMBL173347,14 1,27 1,37 1,103 7.137}
{0 CHEMBL173416,5 1,6 1,8 1,10 1,11 1,12 1,13 1,83 1,103 9.678}
{0 CHEMBL17354,14 1,17 1,24 1,98 1,103 7.252}
{0 CHEMBL173938,66 1,71 1,103 7.623}
{0 CHEMBL17424,14 1,17 1,24 1,77 1,81 1,98 1,103 7.721}
{0 CHEMBL174535,14 1,37 1,103 7.376}
{0 CHEMBL17466,14 1,17 1,24 1,98 1,103 7.678}
{0 CHEMBL17468,14 1,71 1,81 1,91 1,103 7.923}
{0 CHEMBL175427,14 1,15 1,66 1,71 1,98 1,103 6.374}
{0 CHEMBL17547,14 1,24 1,98 1,103 8.284}
{0 CHEMBL175475,14 1,21 1,81 1,98 1,103 8.009}
{0 CHEMBL17574,14 1,24 1,98 1,103 7.509}
{0 CHEMBL175856,14 1,81 1,98 1,103 6}
{0 CHEMBL175886,14 1,81 1,86 1,98 1,103 7.658}
{0 CHEMBL175929,14 1,58 1,81 1,98 1,103 7.244}
{0 CHEMBL17603,14 1,24 1,77 1,98 1,103 7.796}
{0 CHEMBL176307,14 1,83 1,103 6.523}
{0 CHEMBL17698,14 1,24 1,98 1,103 7.585}
{0 CHEMBL177076,14 1,48 1,66 1,71 1,81 1,103 7.759}
{0 CHEMBL178188,14 1,81 1,98 1,103 6.699}
{0 CHEMBL178242,14 1,58 1,81 1,98 1,103 7.398}
{0 CHEMBL178303,14 1,81 1,98 1,103 6.796}
{0 CHEMBL1783236,14 1,39 1,71 1,103 5.73}
{0 CHEMBL1783244,14 1,39 1,103 8}
{0 CHEMBL1783245,14 1,39 1,65 1,79 1,103 9}
{0 CHEMBL1783246,14 1,39 1,65 1,103 8.18}
{0 CHEMBL1783247,14 1,19 1,39 1,65 1,103 8.26}
{0 CHEMBL1783248,14 1,39 1,65 1,103 8.07}
{0 CHEMBL1783249,14 1,19 1,39 1,65 1,103 8.14}
{0 CHEMBL1783250,14 1,39 1,65 1,103 8.71}
{0 CHEMBL1783251,14 1,37 1,39 1,65 1,103 8.489}
{0 CHEMBL1783252,14 1,19 1,37 1,39 1,65 1,103 8.05}
{0 CHEMBL1783253,14 1,39 1,71 1,103 8}
{0 CHEMBL1783254,14 1,39 1,71 1,103 7.86}
{0 CHEMBL1783255,14 1,39 1,65 1,71 1,103 7.82}
{0 CHEMBL1783256,14 1,39 1,65 1,71 1,103 7.7}
{0 CHEMBL1783257,14 1,39 1,71 1,103 7.58}
{0 CHEMBL1783258,14 1,39 1,71 1,74 1,103 7.53}
{0 CHEMBL1783259,14 1,39 1,71 1,103 7.25}
{0 CHEMBL1783260,14 1,39 1,65 1,71 1,103 7.04}
{0 CHEMBL1783261,14 1,39 1,65 1,71 1,103 6.96}
{0 CHEMBL1783262,14 1,39 1,49 1,71 1,89 1,103 6.89}
{0 CHEMBL1783263,14 1,39 1,71 1,103 6.27}
{0 CHEMBL1783264,14 1,39 1,71 1,79 1,103 5.45}
{0 CHEMBL1783265,14 1,32 1,39 1,71 1,82 1,103 7.84}
{0 CHEMBL1783266,14 1,32 1,39 1,71 1,82 1,103 7.89}
{0 CHEMBL1783267,14 1,39 1,71 1,103 7.22}
{0 CHEMBL1783268,14 1,39 1,71 1,103 6.58}
{0 CHEMBL1783269,14 1,32 1,39 1,71 1,82 1,103 8.33}
{0 CHEMBL1783270,14 1,32 1,39 1,71 1,82 1,103 7.48}
{0 CHEMBL1783271,1 1,14 1,39 1,71 1,83 1,103 8.939}
{0 CHEMBL1783272,1 1,14 1,39 1,65 1,71 1,83 1,103 8.79}
{0 CHEMBL1783273,1 1,14 1,39 1,71 1,83 1,103 8.45}
{0 CHEMBL1783274,1 1,14 1,39 1,71 1,74 1,83 1,103 8.24}
{0 CHEMBL1783275,1 1,14 1,39 1,71 1,83 1,103 7.25}
{0 CHEMBL1783276,1 1,14 1,32 1,39 1,71 1,82 1,83 1,103 9}
{0 CHEMBL1783277,1 1,14 1,32 1,39 1,71 1,82 1,83 1,103 7.86}
{0 CHEMBL1783278,1 1,14 1,39 1,71 1,83 1,103 7.86}
{0 CHEMBL1783279,14 1,39 1,65 1,98 1,103 8.13}
{0 CHEMBL1783280,14 1,39 1,65 1,71 1,103 8.65}
{0 CHEMBL1783281,14 1,19 1,39 1,65 1,71 1,103 8.21}
{0 CHEMBL1783282,1 1,14 1,39 1,65 1,71 1,83 1,103 9.51}
{0 CHEMBL1783283,1 1,14 1,39 1,65 1,71 1,83 1,103 9.39}
{0 CHEMBL1783284,1 1,14 1,39 1,83 1,98 1,103 9.42}
{0 CHEMBL1783285,1 1,14 1,39 1,83 1,98 1,103 9.25}
{0 CHEMBL1783286,14 1,19 1,39 1,98 1,103 8.541}
{0 CHEMBL1783287,14 1,32 1,39 1,82 1,98 1,103 8.62}
{0 CHEMBL178508,14 1,81 1,98 1,103 6.553}
{0 CHEMBL178632,13 1,14 1,81 1,98 1,103 6.328}
{0 CHEMBL178633,14 1,81 1,98 1,103 6}
{0 CHEMBL178670,14 1,15 1,37 1,81 1,98 1,103 7.194}
{0 CHEMBL178677,14 1,37 1,81 1,98 1,103 8.469}
{0 CHEMBL178710,14 1,81 1,98 1,103 7.77}
{0 CHEMBL178738,14 1,81 1,98 1,103 7.62}
{0 CHEMBL178783,14 1,81 1,98 1,103 8.125}
{0 CHEMBL178830,14 1,71 1,81 1,98 1,103 7.131}
{0 CHEMBL178831,1 1,14 1,81 1,83 1,98 1,103 7.796}
{0 CHEMBL178837,14 1,58 1,81 1,98 1,103 6.602}
{0 CHEMBL178840,14 1,39 1,81 1,98 1,103 7.387}
{0 CHEMBL178856,14 1,46 1,81 1,98 1,103 7.367}
{0 CHEMBL178942,14 1,81 1,98 1,103 7.625}
{0 CHEMBL178956,14 1,77 1,81 1,98 1,103 8.187}
{0 CHEMBL178992,14 1,81 1,98 1,103 7.469}
{0 CHEMBL179000,14 1,19 1,81 1,98 1,103 6.678}
{0 CHEMBL179048,14 1,81 1,83 1,98 1,103 6.745}
{0 CHEMBL179414,14 1,81 1,98 1,103 8.553}
{0 CHEMBL179430,14 1,81 1,98 1,103 6.854}
{0 CHEMBL179474,14 1,81 1,98 1,103 8.699}
{0 CHEMBL179475,14 1,15 1,81 1,98 1,103 8.229}
{0 CHEMBL179509,14 1,15 1,81 1,98 1,103 7.081}
{0 CHEMBL179513,14 1,58 1,81 1,98 1,103 6.959}
{0 CHEMBL179545,14 1,81 1,98 1,103 6.509}
{0 CHEMBL179555,14 1,16 1,48 1,81 1,103 6}
{0 CHEMBL179558,14 1,81 1,98 1,103 8.252}
{0 CHEMBL179654,14 1,81 1,98 1,103 6.301}
{0 CHEMBL179664,14 1,58 1,81 1,98 1,103 6}
{0 CHEMBL179699,14 1,58 1,77 1,81 1,98 1,103 7.456}
{0 CHEMBL179700,14 1,81 1,98 1,103 7.086}
{0 CHEMBL179712,14 1,58 1,81 1,98 1,103 8.284}
{0 CHEMBL179737,14 1,81 1,98 1,103 7.119}
{0 CHEMBL179769,14 1,15 1,81 1,98 1,103 6.959}
{0 CHEMBL179777,14 1,63 1,81 1,98 1,103 8.092}
{0 CHEMBL179810,14 1,81 1,98 1,103 6.569}
{0 CHEMBL179924,14 1,58 1,75 1,81 1,98 1,103 7.301}
{0 CHEMBL180174,14 1,81 1,86 1,98 1,103 7.854}
{0 CHEMBL180215,14 1,15 1,39 1,81 1,98 1,103 6.585}
{0 CHEMBL180224,14 1,81 1,98 1,103 6.638}
{0 CHEMBL180416,14 1,71 1,81 1,98 1,103 8.041}
{0 CHEMBL180417,14 1,81 1,98 1,103 6.721}
{0 CHEMBL180464,14 1,81 1,98 1,103 7.367}
{0 CHEMBL180575,14 1,15 1,81 1,98 1,103 6}
{0 CHEMBL19732,8 1,14 1,20 1,103 10.097}
{0 CHEMBL199411,2 1,7 1,14 1,15 1,81 1,103 8.432}
{0 CHEMBL199957,2 1,3 1,7 1,14 1,15 1,50 1,81 1,103 9.253}
{0 CHEMBL200177,1 1,14 1,16 1,58 1,81 1,83 1,98 1,103 9.509}
{0 CHEMBL201472,1 1,2 1,3 1,4 1,14 1,50 1,83 1,92 1,103 8.415}
{0 CHEMBL202070,2 1,7 1,14 1,15 1,81 1,97 1,103 7.721}
{0 CHEMBL202343,1 1,2 1,3 1,4 1,7 1,9 1,14 1,15 1,81 1,83 1,97 1,103 9}
{0 CHEMBL202789,1 1,2 1,83 1,92 1,103 7.962}
{0 CHEMBL203455,1 1,2 1,3 1,4 1,9 1,14 1,15 1,29 1,81 1,83 1,97 1,103 8.812}
{0 CHEMBL203732,1 1,2 1,3 1,9 1,14 1,83 1,97 1,103 8.638}
{0 CHEMBL203785,1 1,2 1,3 1,9 1,14 1,15 1,81 1,83 1,85 1,97 1,103 8.074}
{0 CHEMBL203896,1 1,2 1,83 1,92 1,103 8.337}
{0 CHEMBL203897,1 1,2 1,3 1,9 1,14 1,83 1,97 1,103 8.463}
{0 CHEMBL204156,1 1,2 1,3 1,4 1,9 1,14 1,29 1,83 1,97 1,103 9.036}
{0 CHEMBL204319,2 1,3 1,7 1,9 1,14 1,15 1,81 1,97 1,103 8.921}
{0 CHEMBL204696,1 1,2 1,3 1,4 1,7 1,9 1,14 1,15 1,81 1,83 1,97 1,103 8.745}
{0 CHEMBL204701,1 1,2 1,3 1,4 1,7 1,9 1,14 1,15 1,81 1,83 1,97 1,103 8.678}
{0 CHEMBL224134,14 1,81 1,98 1,103 8.538}
{0 CHEMBL224175,14 1,58 1,81 1,98 1,103 8.585}
{0 CHEMBL224561,14 1,58 1,81 1,98 1,103 9.137}
{0 CHEMBL224608,14 1,58 1,81 1,98 1,103 7.854}
{0 CHEMBL257155,9 1,14 1,83 1,103 6.699}
{0 CHEMBL264235,14 1,71 1,83 1,103 8.301}
{0 CHEMBL267665,14 1,103 8.699}
{0 CHEMBL268262,14 1,48 1,66 1,71 1,81 1,103 7.52}
{0 CHEMBL273456,14 1,54 1,71 1,81 1,98 1,103 7.387}
{0 CHEMBL273464,14 1,66 1,71 1,81 1,91 1,103 7.106}
{0 CHEMBL273680,14 1,48 1,54 1,81 1,103 6}
{0 CHEMBL274281,14 1,17 1,24 1,98 1,103 7.796}
{0 CHEMBL275115,14 1,15 1,37 1,81 1,103 6.509}
{0 CHEMBL275645,14 1,17 1,24 1,98 1,103 7.921}
{0 CHEMBL276508,14 1,24 1,29 1,98 1,103 7.367}
{0 CHEMBL277504,14 1,24 1,77 1,98 1,103 7.357}
{0 CHEMBL27794,14 1,56 1,66 1,96 1,103 7.398}
{0 CHEMBL281480,14 1,31 1,56 1,71 1,82 1,96 1,103 6.569}
{0 CHEMBL282623,14 1,31 1,56 1,66 1,82 1,96 1,103 6.367}
{0 CHEMBL282740,14 1,56 1,66 1,96 1,103 6.745}
{0 CHEMBL283850,14 1,39 1,56 1,66 1,96 1,103 6.081}
{0 CHEMBL284418,14 1,56 1,66 1,96 1,103 6.699}
{0 CHEMBL285328,14 1,56 1,66 1,96 1,103 7.658}
{0 CHEMBL286471,14 1,56 1,66 1,96 1,103 6.409}
{0 CHEMBL286594,14 1,37 1,103 7.67}
{0 CHEMBL28730,14 1,56 1,66 1,96 1,103 7.721}
{0 CHEMBL287442,14 1,21 1,56 1,66 1,96 1,97 1,103 6.013}
{0 CHEMBL28782,14 1,56 1,66 1,96 1,103 6.602}
{0 CHEMBL291308,11 1,13 1,14 1,15 1,19 1,71 1,81 1,103 4.523}
{0 CHEMBL291335,14 1,71 1,83 1,103 7.119}
{0 CHEMBL29213,14 1,56 1,66 1,96 1,103 6.167}
{0 CHEMBL292380,14 1,54 1,63 1,81 1,98 1,103 8.538}
{0 CHEMBL292462,14 1,54 1,81 1,83 1,98 1,103 8.432}
{0 CHEMBL29277,14 1,31 1,56 1,82 1,96 1,103 6.357}
{0 CHEMBL294600,14 1,71 1,83 1,103 8.066}
{0 CHEMBL295277,14 1,83 1,103 6.523}
{0 CHEMBL295981,14 1,83 1,103 6.523}
{0 CHEMBL296383,14 1,54 1,98 1,103 8.013}
{0 CHEMBL296607,14 1,54 1,77 1,81 1,98 1,103 8.658}
{0 CHEMBL297481,14 1,54 1,81 1,98 1,103 6}
{0 CHEMBL297717,14 1,54 1,71 1,81 1,98 1,103 6.071}
{0 CHEMBL297958,14 1,54 1,81 1,98 1,103 6}
{0 CHEMBL298386,14 1,54 1,81 1,98 1,103 8.638}
{0 CHEMBL298501,14 1,54 1,81 1,98 1,103 6.569}
{0 CHEMBL298561,66 1,71 1,103 6.903}
{0 CHEMBL298730,14 1,54 1,81 1,98 1,103 6}
{0 CHEMBL298732,14 1,83 1,103 6.328}
{0 CHEMBL298760,14 1,54 1,81 1,98 1,103 7.62}
{0 CHEMBL299061,14 1,71 1,83 1,103 6.42}
{0 CHEMBL299210,14 1,54 1,58 1,77 1,81 1,98 1,103 9.155}
{0 CHEMBL299250,14 1,66 1,71 1,98 1,103 7.6}
{0 CHEMBL299437,14 1,54 1,81 1,98 1,103 7.796}
{0 CHEMBL299611,14 1,54 1,81 1,98 1,103 8.77}
{0 CHEMBL299642,14 1,54 1,81 1,98 1,103 7.357}
{0 CHEMBL299736,14 1,54 1,81 1,98 1,103 6.886}
{0 CHEMBL299802,14 1,54 1,81 1,98 1,103 7.553}
{0 CHEMBL299882,14 1,54 1,77 1,81 1,98 1,103 6}
{0 CHEMBL299995,14 1,71 1,72 1,81 1,103 6}
{0 CHEMBL300018,14 1,54 1,81 1,98 1,103 6.796}
{0 CHEMBL300497,14 1,54 1,81 1,98 1,103 8.444}
{0 CHEMBL300690,14 1,54 1,81 1,98 1,103 6.292}
{0 CHEMBL300840,14 1,27 1,37 1,103 6.845}
{0 CHEMBL300862,14 1,54 1,77 1,81 1,98 1,103 8.796}
{0 CHEMBL300867,14 1,54 1,71 1,81 1,98 1,103 6.658}
{0 CHEMBL300951,14 1,34 1,54 1,81 1,98 1,103 8.745}
{0 CHEMBL301010,14 1,15 1,71 1,83 1,103 5.745}
{0 CHEMBL301063,14 1,54 1,81 1,98 1,103 8.237}
{0 CHEMBL301104,14 1,54 1,81 1,83 1,98 1,103 6}
{0 CHEMBL301181,14 1,81 1,98 1,103 7.77}
{0 CHEMBL301195,14 1,71 1,83 1,103 6.469}
{0 CHEMBL301336,14 1,54 1,81 1,98 1,103 6.469}
{0 CHEMBL301605,66 1,71 1,103 8.921}
{0 CHEMBL302979,14 1,17 1,24 1,98 1,103 7.337}
{0 CHEMBL303718,14 1,81 1,98 1,103 7.066}
{0 CHEMBL304568,14 1,17 1,24 1,98 1,103 6.523}
{0 CHEMBL305068,14 1,37 1,81 1,98 1,103 7.773}
{0 CHEMBL306422,14 1,54 1,81 1,98 1,103 9.237}
{0 CHEMBL307111,9 1,14 1,54 1,81 1,98 1,103 9.194}
{0 CHEMBL307202,14 1,81 1,83 1,103 8.682}
{0 CHEMBL307218,14 1,24 1,98 1,103 6.523}
{0 CHEMBL307230,14 1,29 1,81 1,98 1,103 6.959}
{0 CHEMBL307473,14 1,17 1,103 6.523}
{0 CHEMBL307783,14 1,66 1,71 1,81 1,103 7.824}
{0 CHEMBL308077,14 1,17 1,24 1,98 1,103 7.553}
{0 CHEMBL308481,14 1,17 1,24 1,77 1,98 1,103 7.721}
{0 CHEMBL312118,14 1,17 1,48 1,103 7.357}
{0 CHEMBL314788,14 1,66 1,71 1,81 1,91 1,103 4.527}
{0 CHEMBL314804,14 1,71 1,98 1,103 6.523}
{0 CHEMBL314844,14 1,73 1,81 1,91 1,103 6}
{0 CHEMBL31796,14 1,56 1,66 1,96 1,103 5.886}
{0 CHEMBL318370,14 1,51 1,77 1,79 1,103 7.721}
{0 CHEMBL318873,14 1,58 1,77 1,79 1,103 7.699}
{0 CHEMBL320395,14 1,77 1,79 1,103 7.42}
{0 CHEMBL331549,14 1,81 1,98 1,103 6}
{0 CHEMBL331569,14 1,37 1,81 1,98 1,103 7.535}
{0 CHEMBL331657,14 1,81 1,98 1,103 6.643}
{0 CHEMBL331907,14 1,81 1,98 1,103 7.18}
{0 CHEMBL332893,14 1,37 1,81 1,98 1,103 7.469}
{0 CHEMBL333659,14 1,30 1,81 1,92 1,98 1,103 6}
{0 CHEMBL334138,14 1,81 1,98 1,101 1,103 7.416}
{0 CHEMBL334246,14 1,37 1,81 1,98 1,103 7.445}
{0 CHEMBL335888,14 1,37 1,81 1,103 7.071}
{0 CHEMBL335960,14 1,37 1,59 1,103 6.412}
{0 CHEMBL336133,14 1,27 1,37 1,103 6}
{0 CHEMBL336377,14 1,83 1,103 7.538}
{0 CHEMBL336636,14 1,37 1,81 1,103 7.155}
{0 CHEMBL336728,14 1,37 1,103 7.921}
{0 CHEMBL337166,14 1,37 1,81 1,103 7.252}
{0 CHEMBL339163,14 1,37 1,103 7.357}
{0 CHEMBL339172,14 1,37 1,81 1,103 6.824}
{0 CHEMBL341398,14 1,83 1,103 7.886}
{0 CHEMBL34155,14 1,65 1,103 4.585}
{0 CHEMBL35571,14 1,37 1,103 6}
{0 CHEMBL359474,14 1,81 1,98 1,103 6.301}
{0 CHEMBL359545,14 1,81 1,98 1,103 7.678}
{0 CHEMBL359613,14 1,81 1,98 1,103 7.143}
{0 CHEMBL359616,14 1,24 1,34 1,54 1,81 1,98 1,103 6.409}
{0 CHEMBL359638,14 1,78 1,81 1,98 1,103 6.301}
{0 CHEMBL359650,14 1,17 1,58 1,81 1,98 1,103 7.602}
{0 CHEMBL359853,14 1,81 1,98 1,103 6.301}
{0 CHEMBL359906,14 1,81 1,98 1,103 7.523}
{0 CHEMBL360036,14 1,81 1,98 1,103 6.796}
{0 CHEMBL360113,14 1,37 1,81 1,98 1,103 6.959}
{0 CHEMBL360122,14 1,58 1,77 1,81 1,98 1,103 8.638}
{0 CHEMBL360262,14 1,81 1,98 1,103 6.301}
{0 CHEMBL360311,14 1,81 1,98 1,103 7}
{0 CHEMBL360345,14 1,48 1,81 1,103 6.538}
{0 CHEMBL360562,14 1,71 1,81 1,98 1,103 6}
{0 CHEMBL360733,14 1,81 1,98 1,103 7.721}
{0 CHEMBL360912,14 1,63 1,81 1,98 1,103 7.678}
{0 CHEMBL360966,14 1,29 1,81 1,98 1,103 7.284}
{0 CHEMBL361015,14 1,81 1,98 1,103 7.824}
{0 CHEMBL361105,14 1,81 1,98 1,103 7.268}
{0 CHEMBL361114,14 1,58 1,77 1,81 1,98 1,103 8.77}
{0 CHEMBL361129,14 1,58 1,75 1,81 1,98 1,103 8.602}
{0 CHEMBL361200,14 1,81 1,98 1,103 7.469}
{0 CHEMBL361340,14 1,81 1,98 1,103 7.745}
{0 CHEMBL361561,14 1,81 1,86 1,98 1,103 6.886}
{0 CHEMBL361597,14 1,58 1,81 1,98 1,103 7.167}
{0 CHEMBL361754,14 1,81 1,98 1,100 1,103 6.301}
{0 CHEMBL361786,14 1,81 1,98 1,103 8.398}
{0 CHEMBL362014,14 1,46 1,81 1,97 1,98 1,103 6.319}
{0 CHEMBL362282,14 1,81 1,98 1,103 8.125}
{0 CHEMBL362409,14 1,81 1,86 1,98 1,103 7.377}
{0 CHEMBL362421,14 1,81 1,98 1,103 7.167}
{0 CHEMBL362485,14 1,81 1,98 1,103 8.004}
{0 CHEMBL362620,14 1,58 1,81 1,98 1,103 7.553}
{0 CHEMBL362869,14 1,71 1,81 1,98 1,103 7.102}
{0 CHEMBL363211,14 1,16 1,58 1,81 1,98 1,103 9.071}
{0 CHEMBL366384,5 1,6 1,8 1,10 1,11 1,12 1,13 1,14 1,103 10.523}
{0 CHEMBL366468,14 1,58 1,81 1,98 1,103 7.792}
{0 CHEMBL366471,14 1,81 1,98 1,103 7.456}
{0 CHEMBL366537,14 1,58 1,77 1,81 1,98 1,103 8.149}
{0 CHEMBL366789,66 1,71 1,83 1,103 5.523}
{0 CHEMBL366947,14 1,83 1,103 9.194}
{0 CHEMBL367051,14 1,23 1,83 1,103 6.523}
{0 CHEMBL367639,66 1,71 1,103 6.642}
{0 CHEMBL368130,14 1,48 1,81 1,83 1,97 1,103 6.475}
{0 CHEMBL368171,14 1,48 1,66 1,71 1,77 1,81 1,103 6.688}
{0 CHEMBL368179,13 1,14 1,66 1,71 1,81 1,93 1,103 6.375}
{0 CHEMBL368618,5 1,6 1,8 1,10 1,11 1,12 1,13 1,14 1,27 1,103 8.432}
{0 CHEMBL368768,14 1,83 1,103 8.032}
{0 CHEMBL368905,14 1,29 1,81 1,98 1,103 6.495}
{0 CHEMBL368919,14 1,81 1,83 1,103 9.77}
{0 CHEMBL369035,14 1,81 1,98 1,103 8.06}
{0 CHEMBL369093,14 1,81 1,98 1,103 6}
{0 CHEMBL369358,14 1,81 1,83 1,103 6.668}
{0 CHEMBL369902,1 1,2 1,3 1,4 1,7 1,14 1,15 1,50 1,62 1,81 1,83 1,103 9.069}
{0 CHEMBL373250,1 1,14 1,16 1,58 1,81 1,83 1,98 1,103 9.155}
{0 CHEMBL375742,14 1,58 1,81 1,98 1,103 9.602}
{0 CHEMBL381380,1 1,2 1,3 1,4 1,7 1,14 1,15 1,50 1,62 1,81 1,83 1,103 9.284}
{0 CHEMBL381625,14 1,20 1,39 1,59 1,92 1,103 7.869}
{0 CHEMBL39071,14 1,65 1,103 4.301}
{0 CHEMBL407,14 1,83 1,103 9.046}
{0 CHEMBL408797,14 1,48 1,83 1,97 1,103 7.509}
{0 CHEMBL413325,14 1,71 1,83 1,103 6.495}
{0 CHEMBL415290,14 1,83 1,103 7.788}
{0 CHEMBL415293,14 1,83 1,103 7.666}
{0 CHEMBL416450,14 1,103 7.444}
{0 CHEMBL416659,14 1,54 1,81 1,98 1,103 8.097}
{0 CHEMBL420044,14 1,73 1,81 1,91 1,103 6.979}
{0 CHEMBL420929,14 1,24 1,77 1,98 1,103 7.319}
{0 CHEMBL421072,14 1,81 1,98 1,103 6.561}
{0 CHEMBL421257,14 1,37 1,81 1,98 1,103 6.779}
{0 CHEMBL426234,14 1,81 1,98 1,103 6.959}
{0 CHEMBL427207,1 1,2 1,3 1,4 1,7 1,9 1,14 1,15 1,62 1,81 1,83 1,97 1,103 9.097}
{0 CHEMBL427313,14 1,81 1,98 1,103 6.921}
{0 CHEMBL431973,14 1,66 1,71 1,103 5.523}
{0 CHEMBL432104,14 1,37 1,59 1,103 6.523}
{0 CHEMBL432542,14 1,24 1,92 1,98 1,103 7.31}
{0 CHEMBL434138,14 1,15 1,37 1,81 1,98 1,103 6.745}
{0 CHEMBL435550,14 1,66 1,71 1,77 1,81 1,91 1,103 6.536}
{0 CHEMBL436768,1 1,2 1,3 1,4 1,7 1,14 1,15 1,50 1,81 1,83 1,103 8.481}
{0 CHEMBL43718,14 1,83 1,103 5.816}
{0 CHEMBL43724,14 1,83 1,103 5.543}
{0 CHEMBL43725,14 1,83 1,103 4.471}
{0 CHEMBL439945,66 1,71 1,83 1,103 7.914}
{0 CHEMBL440558,14 1,58 1,81 1,98 1,103 7.229}
{0 CHEMBL441612,14 1,54 1,81 1,98 1,103 7.796}
{0 CHEMBL441978,14 1,54 1,81 1,98 1,103 6.921}
{0 CHEMBL445358,14 1,54 1,81 1,98 1,103 6.252}
{0 CHEMBL445856,14 1,37 1,81 1,103 6}
{0 CHEMBL44613,5 1,6 1,8 1,10 1,11 1,12 1,13 1,14 1,71 1,103 10}
{0 CHEMBL44784,14 1,52 1,83 1,97 1,103 6.523}
{0 CHEMBL451,14 1,49 1,83 1,97 1,103 6.372}
{0 CHEMBL45174,14 1,83 1,103 5.538}
{0 CHEMBL45346,14 1,83 1,103 6.523}
{0 CHEMBL454606,14 1,66 1,71 1,81 1,103 8.31}
{0 CHEMBL458012,14 1,66 1,71 1,98 1,103 6.712}
{0 CHEMBL46957,14 1,15 1,74 1,83 1,103 4.9}
{0 CHEMBL47141,5 1,6 1,8 1,10 1,11 1,12 1,13 1,83 1,103 9.77}
{0 CHEMBL47853,14 1,15 1,83 1,103 4.523}
{0 CHEMBL48053,5 1,6 1,8 1,10 1,11 1,12 1,13 1,14 1,71 1,103 8.883}
{0 CHEMBL49141,14 1,66 1,71 1,81 1,91 1,103 8.917}
{0 CHEMBL498936,14 1,66 1,71 1,98 1,103 7.6}
{0 CHEMBL499814,14 1,66 1,71 1,98 1,103 7.281}
{0 CHEMBL50320,14 1,54 1,81 1,98 1,103 7.602}
{0 CHEMBL50402,14 1,54 1,81 1,98 1,103 7.959}
{0 CHEMBL50581,14 1,54 1,81 1,98 1,103 7.796}
{0 CHEMBL509197,14 1,66 1,71 1,81 1,103 7.824}
{0 CHEMBL51911,14 1,15 1,54 1,81 1,98 1,103 6.208}
{0 CHEMBL52014,14 1,54 1,71 1,81 1,98 1,103 6}
{0 CHEMBL52030,14 1,71 1,103 7.65}
{0 CHEMBL52310,14 1,54 1,81 1,98 1,103 7.42}
{0 CHEMBL52640,14 1,54 1,71 1,81 1,98 1,103 6.77}
{0 CHEMBL52672,14 1,54 1,81 1,98 1,103 8.77}
{0 CHEMBL52696,14 1,54 1,81 1,83 1,98 1,103 6.42}
{0 CHEMBL52750,14 1,66 1,71 1,98 1,103 7.281}
{0 CHEMBL52818,14 1,54 1,81 1,98 1,103 6.284}
{0 CHEMBL52962,14 1,54 1,81 1,98 1,103 6}
{0 CHEMBL53238,14 1,81 1,98 1,103 8.721}
{0 CHEMBL53528,14 1,54 1,81 1,98 1,103 6}
{0 CHEMBL53529,14 1,54 1,81 1,98 1,103 7.252}
{0 CHEMBL53587,14 1,81 1,98 1,103 7.585}
{0 CHEMBL53619,14 1,71 1,83 1,103 6.886}
{0 CHEMBL53642,14 1,15 1,37 1,54 1,81 1,98 1,103 6.398}
{0 CHEMBL53651,14 1,66 1,71 1,98 1,103 6.921}
{0 CHEMBL53729,14 1,54 1,81 1,98 1,103 6.328}
{0 CHEMBL53977,54 1,78 1,81 1,89 1,98 1,103 6}
{0 CHEMBL54211,14 1,54 1,81 1,98 1,103 6}
{0 CHEMBL54368,14 1,71 1,81 1,83 1,103 7.42}
{0 CHEMBL54422,14 1,71 1,83 1,103 7.62}
{0 CHEMBL54507,14 1,71 1,81 1,83 1,103 6.176}
{0 CHEMBL54859,14 1,20 1,32 1,103 5.745}
{0 CHEMBL55022,14 1,71 1,81 1,83 1,103 7.638}
{0 CHEMBL55081,14 1,54 1,81 1,83 1,98 1,103 6.237}
{0 CHEMBL55450,14 1,54 1,65 1,81 1,98 1,103 7.398}
{0 CHEMBL55467,14 1,71 1,83 1,103 5.959}
{0 CHEMBL55565,14 1,83 1,103 8.097}
{0 CHEMBL55570,14 1,71 1,83 1,103 6.62}
{0 CHEMBL55694,14 1,15 1,19 1,24 1,71 1,81 1,98 1,103 4.523}
{0 CHEMBL55777,14 1,71 1,83 1,103 6.176}
{0 CHEMBL56098,14 1,71 1,83 1,103 8.18}
{0 CHEMBL56746,14 1,71 1,83 1,103 6.222}
{0 CHEMBL56761,14 1,71 1,83 1,103 7.377}
{0 CHEMBL57655,14 1,37 1,103 8.143}
{0 CHEMBL58385,14 1,37 1,103 7.569}
{0 CHEMBL58570,14 1,37 1,103 7.252}
{0 CHEMBL58757,14 1,37 1,103 7.58}
{0 CHEMBL59180,14 1,37 1,103 7.654}
{0 CHEMBL59181,14 1,27 1,37 1,103 6.848}
{0 CHEMBL59197,14 1,71 1,83 1,103 7.292}
{0 CHEMBL59427,14 1,83 1,103 7.699}
{0 CHEMBL59478,14 1,71 1,77 1,83 1,103 7.432}
{0 CHEMBL62630,14 1,29 1,81 1,98 1,103 7.201}
{0 CHEMBL6421,14 1,15 1,84 1,92 1,103 7.656}
{0 CHEMBL6440,14 1,83 1,103 7.317}
{0 CHEMBL646,14 1,83 1,103 9.229}
{0 CHEMBL6597,14 1,15 1,84 1,92 1,103 8.585}
{0 CHEMBL6655,14 1,83 1,103 7.971}
{0 CHEMBL6659,14 1,83 1,103 7.951}
{0 CHEMBL66902,14 1,66 1,71 1,98 1,103 6.712}
{0 CHEMBL67421,14 1,66 1,71 1,98 1,103 5.523}
{0 CHEMBL6814,14 1,103 7.472}
{0 CHEMBL68490,14 1,54 1,81 1,98 1,103 8.796}
{0 CHEMBL68684,14 1,54 1,81 1,98 1,103 8.697}
{0 CHEMBL68712,14 1,81 1,98 1,103 7.352}
{0 CHEMBL69605,9 1,14 1,54 1,81 1,98 1,103 8.553}
{0 CHEMBL69719,14 1,66 1,71 1,81 1,103 7.796}
{0 CHEMBL69842,14 1,17 1,48 1,49 1,103 6.523}
{0 CHEMBL69945,14 1,17 1,24 1,98 1,103 6.523}
{0 CHEMBL69946,14 1,17 1,24 1,98 1,103 8.119}
{0 CHEMBL70526,14 1,17 1,24 1,98 1,103 6.74}
{0 CHEMBL70604,14 1,17 1,48 1,103 6.523}
{0 CHEMBL70812,14 1,17 1,24 1,98 1,103 6.735}
{0 CHEMBL71006,14 1,24 1,98 1,103 6.523}
{0 CHEMBL72357,14 1,24 1,81 1,98 1,103 6.523}
{0 CHEMBL7290,14 1,103 7.303}
{0 CHEMBL72914,14 1,17 1,103 6.79}
{0 CHEMBL73052,14 1,24 1,63 1,98 1,103 6.793}
{0 CHEMBL73096,14 1,103 6.86}
{0 CHEMBL73486,14 1,24 1,77 1,98 1,103 7.409}
{0 CHEMBL78766,66 1,71 1,103 6.301}
{0 CHEMBL79945,66 1,71 1,83 1,103 7.983}
{0 CHEMBL83464,14 1,66 1,71 1,98 1,103 7.083}
{0 CHEMBL83581,14 1,66 1,71 1,98 1,103 6.67}
{0 CHEMBL84668,14 1,66 1,71 1,81 1,91 1,103 5.523}
{0 CHEMBL84842,14 1,73 1,81 1,91 1,103 5.523}
{0 CHEMBL84921,14 1,39 1,66 1,71 1,103 6.268}
{0 CHEMBL85539,14 1,71 1,98 1,103 6.523}
{0 CHEMBL85716,14 1,73 1,81 1,91 1,103 6}
{0 CHEMBL85861,14 1,71 1,81 1,91 1,103 7.728}
{0 CHEMBL86231,14 1,66 1,71 1,98 1,103 6.087}
{0 CHEMBL87331,14 1,66 1,71 1,98 1,103 5.523}
{0 CHEMBL87437,8 1,14 1,66 1,71 1,81 1,91 1,103 6.536}
{0 CHEMBL87602,14 1,66 1,71 1,81 1,91 1,103 7.815}
{0 CHEMBL87641,14 1,23 1,66 1,71 1,98 1,103 5.523}
{0 CHEMBL911,14 1,94 1,103 6.802}
{0 CHEMBL95188,14 1,71 1,103 7.222}
{0 CHEMBL95268,14 1,103 6.523}
{0 CHEMBL95443,14 1,77 1,79 1,103 7.824}
{0 CHEMBL95541,14 1,79 1,103 7.886}
{0 CHEMBL95724,14 1,71 1,79 1,103 7.201}
{0 CHEMBL95746,14 1,78 1,79 1,98 1,103 8.268}
{0 CHEMBL95760,14 1,17 1,74 1,77 1,79 1,103 7.244}
{0 CHEMBL96,14 1,103 4.398}
{0 CHEMBL98649,12 1,14 1,58 1,77 1,79 1,103 7.469}
