"molecule_id","nDB","nS","O.","nHM","Mp","RBF","Mi","nBO","SCBO","MW","Sv","Sp","nCsp3","pXC50"
{1 2,3 3.8,5 0.655,6 0.055,7 1.139,8 32,9 41.5,10 393.5,11 32.794,12 34.04,13 8,14 7.695}
{0 CHEMBL1161916,1 2,3 3.8,5 0.655,6 0.055,7 1.139,8 32,9 41.5,10 393.5,11 32.794,12 34.04,13 8,14 8.339}
{0 CHEMBL1161919,1 2,3 4.3,5 0.665,6 0.06,7 1.134,8 30,9 39.5,10 364.45,11 30.246,12 31.273,13 7,14 6.222}
{0 CHEMBL1683571,1 1,3 2,5 0.614,6 0.058,7 1.179,8 31,9 35,10 403.44,11 30.139,12 30.097,13 12,14 8.678}
{0 CHEMBL178401,1 4,3 8.3,5 0.619,6 0.102,7 1.147,8 26,9 33,10 349.44,11 28.707,12 29.699,13 8,14 4.684}
{0 CHEMBL1808475,1 3,3 5.7,5 0.656,6 0.127,7 1.126,8 30,9 39,10 379.5,11 33.003,12 34.756,13 6,14 4.215}
{0 CHEMBL1812901,1 3,3 4.1,5 0.664,6 0.098,7 1.124,8 28,9 37,10 349.47,11 30.762,12 32.54,13 5,14 4.42}
{0 CHEMBL1812910,1 4,3 3.8,5 0.666,6 0.109,7 1.122,8 30,9 40,10 375.51,11 33.289,12 35.302,13 5,14 4.131}
{0 CHEMBL182300,1 2,3 2.4,5 0.618,6 0.071,7 1.145,8 20,9 24,10 262.4,11 23.542,12 25.33,13 11,14 5.585}
{0 CHEMBL183721,1 2,3 3.6,5 0.617,6 0.071,7 1.153,8 14,9 18,10 194.27,11 16.434,12 17.284,13 6,14 5.721}
{0 CHEMBL183728,1 2,3 2.3,5 0.636,6 0.065,7 1.138,8 24,9 28,10 286.42,11 25.542,12 27.33,13 13,14 5.495}
{0 CHEMBL184140,1 4,3 7.9,5 0.643,6 0.179,7 1.152,8 24,9 33,10 317.35,11 24.401,12 24.449,13 5,14 5.921}
{0 CHEMBL184335,1 1,3 2.6,5 0.649,6 0.15,7 1.148,8 23,9 31,10 299.38,11 24.499,12 25.301,13 6,14 7.222}
{0 CHEMBL184487,1 2,3 2.9,5 0.623,6 0.083,7 1.146,8 18,9 22,10 234.34,11 20.488,12 21.807,13 9,14 5.596}
{0 CHEMBL184572,1 2,3 3.2,5 0.614,6 0.097,7 1.151,8 15,9 19,10 208.3,11 17.961,12 19.046,13 7,14 6.658}
{0 CHEMBL184599,1 2,3 4.5,5 0.631,6 0.064,7 1.14,8 25,9 29,10 302.42,11 26.256,12 27.784,13 13,14 5.194}
{0 CHEMBL184631,1 2,3 3.2,5 0.614,6 0.097,7 1.151,8 15,9 19,10 208.3,11 17.961,12 19.046,13 7,14 5.367}
{0 CHEMBL184651,1 2,3 2.7,5 0.663,6 0.158,7 1.145,8 23,9 32,10 297.36,11 23.972,12 24.54,13 5,14 6.103}
{0 CHEMBL185222,1 2,3 2.7,5 0.663,6 0.158,7 1.145,8 23,9 32,10 297.36,11 23.972,12 24.54,13 5,14 5.284}
{0 CHEMBL185923,1 2,3 3.2,5 0.614,6 0.097,7 1.151,8 15,9 19,10 208.3,11 17.961,12 19.046,13 7,14 4.613}
{0 CHEMBL191699,1 1,3 3.2,5 0.614,6 0.031,7 1.151,8 16,9 19,10 208.3,11 17.961,12 19.046,13 8,14 8.041}
{0 CHEMBL192165,1 1,3 2.4,5 0.66,6 0.07,7 1.139,8 25,9 33,10 310.4,11 26.004,12 27.057,13 8,14 8.174}
{0 CHEMBL192882,1 1,3 2.1,5 0.614,6 0.061,7 1.144,8 23,9 26,10 290.46,11 26.595,12 28.853,13 14,14 8.444}
{0 CHEMBL193168,1 3,2 1,3 6.8,4 1,5 0.662,6 0.087,7 1.133,8 26,9 34,10 348.47,11 27.632,12 29.125,13 8,14 8.409}
{0 CHEMBL194717,1 1,3 2.4,4 1,5 0.683,6 0.068,7 1.132,8 26,9 34,10 343.85,11 27.337,12 28.671,13 8,14 9.824}
{0 CHEMBL194993,1 1,3 2.1,5 0.64,6 0.102,7 1.135,8 25,9 31,10 312.46,11 28.068,12 30.091,13 10,14 8.824}
{0 CHEMBL195063,1 1,3 4.4,5 0.64,6 0.085,7 1.137,8 25,9 31,10 314.43,11 27.256,12 28.784,13 9,14 9.553}
{0 CHEMBL195335,1 1,3 2.4,5 0.648,6 0.07,7 1.135,8 23,9 29,10 284.4,11 25.015,12 26.569,13 8,14 9.276}
{0 CHEMBL195420,1 1,3 2.4,5 0.66,6 0.07,7 1.139,8 25,9 33,10 310.4,11 26.004,12 27.057,13 8,14 9.569}
{0 CHEMBL195804,1 1,3 2.3,5 0.644,6 0.087,7 1.135,8 24,9 30,10 298.43,11 26.542,12 28.33,13 9,14 8.523}
{0 CHEMBL2058756,1 1,2 1,3 3.8,4 1,5 0.669,6 0.053,7 1.133,8 33,9 41,10 412.57,11 33.486,12 35.444,13 11,14 9.143}
{0 CHEMBL2058757,1 1,2 2,3 1.9,4 2,5 0.681,6 0.054,7 1.129,8 31,9 37,10 403.63,11 32.464,12 35.392,13 11,14 9.114}
{0 CHEMBL2058758,1 1,2 2,3 1.9,4 2,5 0.691,6 0.053,7 1.128,8 33,9 41,10 428.64,11 33.959,12 36.637,13 11,14 9.161}
{0 CHEMBL2058759,1 1,2 1,3 1.7,4 1,5 0.657,6 0.048,7 1.149,8 36,9 42.5,10 465.6,11 36.48,12 38.08,13 12,14 8.886}
{0 CHEMBL2058760,1 1,2 1,3 1.9,4 1,5 0.656,6 0.053,7 1.137,8 31,9 37,10 386.58,11 32.298,12 34.75,13 11,14 8.959}
{0 CHEMBL2058761,1 1,2 1,3 1.9,4 2,5 0.672,6 0.053,7 1.136,8 32,9 38,10 421.02,11 33.126,12 35.608,13 11,14 8.987}
{0 CHEMBL2058762,1 1,2 1,3 1.9,4 1,5 0.667,6 0.052,7 1.136,8 33,9 41,10 411.59,11 33.793,12 35.995,13 11,14 9.215}
{0 CHEMBL2058967,1 1,2 1,3 3.8,4 1,5 0.658,6 0.054,7 1.134,8 31,9 37,10 387.56,11 31.992,12 34.199,13 11,14 8.824}
{0 CHEMBL2058968,1 1,2 1,3 1.8,4 1,5 0.664,6 0.051,7 1.131,8 32,9 38.5,10 397.6,11 33.804,12 36.506,13 11,14 8.523}
{0 CHEMBL2058969,1 1,2 1,3 1.8,4 1,5 0.664,6 0.051,7 1.131,8 32,9 38.5,10 397.6,11 33.804,12 36.506,13 11,14 9}
{0 CHEMBL2058970,1 1,2 1,3 1.7,4 1,5 0.66,6 0.048,7 1.131,8 33,9 39.5,10 411.63,11 35.33,12 38.267,13 12,14 8.824}
{0 CHEMBL2058971,1 1,2 1,3 1.7,4 1,5 0.657,6 0.048,7 1.149,8 36,9 42.5,10 465.6,11 36.48,12 38.08,13 12,14 9.229}
{0 CHEMBL2058972,1 1,2 1,3 1.8,4 2,5 0.679,6 0.051,7 1.13,8 33,9 39.5,10 432.04,11 34.631,12 37.364,13 11,14 9.208}
{0 CHEMBL2058973,1 1,2 1,3 1.8,4 1,5 0.664,6 0.051,7 1.131,8 32,9 38.5,10 397.6,11 33.804,12 36.506,13 11,14 9.081}
{0 CHEMBL2058974,1 1,2 1,3 1.8,4 2,5 0.679,6 0.051,7 1.13,8 33,9 39.5,10 432.04,11 34.631,12 37.364,13 11,14 9.102}
{0 CHEMBL2058975,1 1,2 1,3 1.8,4 1,5 0.674,6 0.05,7 1.13,8 34,9 42.5,10 422.61,11 35.298,12 37.75,13 11,14 9.252}
{0 CHEMBL2147702,1 1,2 2,3 1.8,4 2,5 0.681,6 0.067,7 1.127,8 33,9 39.5,10 429.67,11 34.991,12 38.154,13 11,14 8.268}
{0 CHEMBL2147703,1 1,2 1,3 1.8,4 1,5 0.658,6 0.066,7 1.135,8 33,9 39.5,10 412.62,11 34.825,12 37.512,13 11,14 9.721}
{0 CHEMBL2147704,1 1,2 1,3 1.8,4 1,5 0.655,6 0.068,7 1.143,8 33,9 39.5,10 414.6,11 33.814,12 36,13 11,14 9.745}
{0 CHEMBL2147705,1 1,2 1,3 1.8,4 1,5 0.656,6 0.067,7 1.139,8 33,9 39.5,10 413.61,11 34.32,12 36.756,13 12,14 8.538}
{0 CHEMBL2147706,1 1,2 1,3 1.6,4 1,5 0.628,6 0.062,7 1.149,8 33,9 36.5,10 420.66,11 35.395,12 38.285,13 17,14 8.509}
{0 CHEMBL2147707,1 1,2 1,3 1.8,4 1,5 0.658,6 0.066,7 1.135,8 33,9 39.5,10 412.62,11 34.825,12 37.512,13 11,14 9.161}
{0 CHEMBL2147709,1 1,2 1,3 1.7,4 1,5 0.651,6 0.063,7 1.152,8 37,9 43.5,10 480.62,11 37.502,12 39.086,13 12,14 9.509}
{0 CHEMBL2147710,1 1,2 1,3 1.6,4 1,5 0.653,6 0.062,7 1.148,8 37,9 43.5,10 479.63,11 38.007,12 39.841,13 13,14 8.602}
{0 CHEMBL2147711,1 1,2 1,3 1.7,4 1,5 0.654,6 0.063,7 1.141,8 35,9 41.5,10 444.64,11 36.735,12 39.211,13 12,14 8.638}
{0 CHEMBL2147712,1 1,2 1,3 1.7,4 1,5 0.654,6 0.063,7 1.141,8 35,9 41.5,10 444.64,11 36.735,12 39.211,13 12,14 9.31}
{0 CHEMBL2147713,1 1,2 1,3 1.7,4 1,5 0.654,6 0.063,7 1.141,8 35,9 41.5,10 444.64,11 36.735,12 39.211,13 12,14 9.276}
{0 CHEMBL2147714,1 1,2 1,3 1.7,4 2,5 0.669,6 0.063,7 1.134,8 35,9 41.5,10 461.09,11 37.179,12 40.131,13 12,14 8.538}
{0 CHEMBL2147715,1 1,2 1,3 1.6,4 1,5 0.664,6 0.062,7 1.134,8 36,9 44.5,10 451.66,11 37.846,12 40.517,13 12,14 7.886}
{0 CHEMBL2147771,1 1,2 1,3 1.7,4 1,5 0.653,6 0.063,7 1.139,8 34,9 40.5,10 427.64,11 35.846,12 38.517,13 12,14 9.143}
{0 CHEMBL2147772,1 1,2 1,3 1.7,4 1,5 0.653,6 0.063,7 1.139,8 34,9 40.5,10 427.64,11 35.846,12 38.517,13 12,14 8.328}
{0 CHEMBL2147773,1 1,2 1,3 1.7,4 1,5 0.653,6 0.063,7 1.139,8 34,9 40.5,10 427.64,11 35.846,12 38.517,13 12,14 9.114}
{0 CHEMBL2147774,1 1,2 1,3 1.7,4 1,5 0.663,6 0.063,7 1.138,8 36,9 44.5,10 452.65,11 37.341,12 39.762,13 12,14 7.854}
{0 CHEMBL2147775,1 1,2 1,3 1.7,4 1,5 0.655,6 0.063,7 1.135,8 34,9 40.5,10 426.65,11 36.352,12 39.273,13 12,14 8.244}
{0 CHEMBL2147776,1 1,2 1,3 1.7,4 1,5 0.655,6 0.063,7 1.135,8 34,9 40.5,10 426.65,11 36.352,12 39.273,13 12,14 6}
{0 CHEMBL2147777,1 1,2 1,3 1.7,4 1,5 0.655,6 0.063,7 1.135,8 34,9 40.5,10 426.65,11 36.352,12 39.273,13 12,14 9.538}
{0 CHEMBL216426,1 3,3 3.8,5 0.633,6 0.054,7 1.143,8 30,9 36,10 370.51,11 31.826,12 33.557,13 10,14 6.301}
{0 CHEMBL223060,1 1,2 1,3 2.4,4 1,5 0.658,6 0.093,7 1.131,8 22,9 26,10 291.46,11 24.707,12 26.972,13 8,14 6.767}
{0 CHEMBL223114,1 1,2 1,3 2.6,4 1,5 0.663,6 0.075,7 1.13,8 21,9 25,10 277.43,11 23.181,12 25.211,13 7,14 6.721}
{0 CHEMBL223497,1 1,2 1,3 2.4,4 1,5 0.672,6 0.091,7 1.13,8 24,9 30,10 316.47,11 26.202,12 28.216,13 8,14 7.465}
{0 CHEMBL223865,1 1,2 1,3 2.2,4 1,5 0.661,6 0.042,7 1.128,8 25,9 29,10 317.5,11 27.234,12 29.733,13 10,14 7.001}
{0 CHEMBL223914,1 1,2 1,3 2.4,4 1,5 0.665,6 0.044,7 1.136,8 25,9 29,10 321.46,11 26.091,12 27.909,13 9,14 7.996}
{0 CHEMBL223915,1 1,2 1,3 2.6,4 2,5 0.686,6 0.075,7 1.129,8 22,9 26,10 311.87,11 24.008,12 26.068,13 7,14 7.259}
{0 CHEMBL223916,1 1,2 1,3 2.4,4 2,5 0.698,6 0.044,7 1.124,8 25,9 29,10 382.36,11 26.733,12 29.324,13 9,14 7.971}
{0 CHEMBL224346,1 3,2 1,3 7.5,4 1,5 0.659,6 0.095,7 1.136,8 24,9 30,10 322.43,11 25.105,12 26.364,13 7,14 7.678}
{0 CHEMBL224421,1 3,2 2,3 7.3,4 2,5 0.677,6 0.093,7 1.129,8 24,9 30,10 341.5,11 25.797,12 27.767,13 7,14 6.523}
{0 CHEMBL224435,1 1,2 1,3 3.8,4 1,5 0.642,6 0.037,7 1.139,8 13,9 14,10 186.31,11 15.106,12 16.682,13 7,14 6.217}
{0 CHEMBL225493,1 3,2 1,3 6.8,4 1,5 0.662,6 0.064,7 1.133,8 27,9 33,10 348.47,11 27.632,12 29.125,13 9,14 7.987}
{0 CHEMBL226771,1 1,2 1,3 4.1,4 1,5 0.657,6 0.118,7 1.132,8 27,9 33,10 360.53,11 29.97,12 32.194,13 10,14 7.638}
{0 CHEMBL227418,1 2,2 1,3 4.7,4 1,5 0.672,6 0.067,7 1.133,8 26,9 33,10 345.47,11 27.411,12 28.915,13 7,14 7.118}
{0 CHEMBL227482,1 2,2 1,3 6.3,4 1,5 0.664,6 0.12,7 1.131,8 28,9 35,10 374.51,11 30.158,12 31.887,13 9,14 7.788}
{0 CHEMBL227615,1 1,2 1,3 2.4,4 1,5 0.666,6 0.044,7 1.128,8 24,9 28,10 303.47,11 25.707,12 27.972,13 9,14 7.409}
{0 CHEMBL227737,1 1,2 1,3 2.2,4 1,5 0.666,6 0.085,7 1.13,8 25,9 31,10 330.5,11 27.729,12 29.978,13 9,14 7.866}
{0 CHEMBL227800,1 1,2 1,3 2,4 1,5 0.657,6 0.094,7 1.131,8 27,9 33,10 358.56,11 30.782,12 33.5,13 11,14 7.903}
{0 CHEMBL227867,1 2,2 1,3 7.7,4 1,5 0.67,6 0.098,7 1.125,8 23,9 28,10 306.42,11 24.589,12 26.114,13 7,14 6.523}
{0 CHEMBL228021,1 1,2 1,3 1.8,4 1,5 0.692,6 0.102,7 1.121,8 34,9 45,10 431.61,11 36.277,12 38.745,13 9,14 8.032}
{0 CHEMBL228032,1 2,2 1,3 3.6,4 1,5 0.699,6 0.086,7 1.119,8 35,9 47,10 445.59,11 36.465,12 38.438,13 8,14 6.775}
{0 CHEMBL228243,1 2,2 1,3 4.1,4 1,5 0.662,6 0.118,7 1.134,8 28,9 35,10 373.53,11 30.465,12 32.438,13 9,14 7.783}
{0 CHEMBL238506,1 1,2 1,3 3.7,4 1,5 0.643,6 0.07,7 1.135,8 29,9 33,10 376.58,11 32.024,12 34.716,13 12,14 7.772}
{0 CHEMBL238507,1 1,2 1,3 2,4 2,5 0.667,6 0.057,7 1.133,8 28,9 32,10 380.99,11 30.61,12 33.358,13 11,14 7.987}
{0 CHEMBL238515,1 1,2 1,3 1.9,4 1,5 0.673,6 0.055,7 1.132,8 31,9 39,10 396.57,11 32.772,12 34.989,13 11,14 8.745}
{0 CHEMBL238516,1 3,2 1,3 5.7,4 1,5 0.649,6 0.071,7 1.134,8 30,9 36,10 390.56,11 32.212,12 34.409,13 12,14 8.481}
{0 CHEMBL239356,1 3,2 1,3 5.5,4 1,5 0.644,6 0.069,7 1.138,8 31,9 37,10 405.58,11 33.233,12 35.415,13 12,14 8.538}
{0 CHEMBL239564,1 1,2 1,3 2,4 1,5 0.648,6 0.058,7 1.138,8 27,9 31,10 347.54,11 29.277,12 31.745,13 11,14 8.409}
{0 CHEMBL239565,1 1,2 1,3 2,4 2,5 0.665,6 0.058,7 1.137,8 28,9 32,10 381.98,11 30.104,12 32.603,13 11,14 8.509}
{0 CHEMBL239983,1 1,2 1,3 2,4 2,5 0.667,6 0.057,7 1.133,8 28,9 32,10 380.99,11 30.61,12 33.358,13 11,14 7.963}
{0 CHEMBL239984,1 1,2 1,3 2,4 2,5 0.677,6 0.057,7 1.131,8 28,9 32,10 425.44,11 30.808,12 33.853,13 11,14 8.046}
{0 CHEMBL240601,1 1,2 1,3 2,4 1,5 0.65,6 0.057,7 1.134,8 27,9 31,10 346.55,11 29.782,12 32.5,13 11,14 7.754}
{0 CHEMBL240602,1 1,2 1,3 1.6,4 1,5 0.663,6 0.075,7 1.126,8 35,9 42,10 436.68,11 38.363,12 41.785,13 12,14 7.503}
{0 CHEMBL241245,1 1,2 1,3 1.9,4 1,5 0.643,6 0.054,7 1.153,8 31,9 35,10 414.55,11 32.459,12 34.074,13 12,14 8.143}
{0 CHEMBL241246,1 1,2 1,3 2,4 3,5 0.684,6 0.057,7 1.132,8 29,9 33,10 415.43,11 31.437,12 34.216,13 11,14 8.377}
{0 CHEMBL241252,1 1,2 1,3 1.9,4 1,5 0.641,6 0.055,7 1.158,8 31,9 35,10 415.54,11 31.954,12 33.319,13 12,14 8.745}
{0 CHEMBL241253,1 1,2 1,3 2,4 1,5 0.66,6 0.057,7 1.137,8 29,9 35,10 372.55,11 30.772,12 32.989,13 11,14 8.854}
{0 CHEMBL241464,1 1,2 1,3 2,4 1,5 0.66,6 0.057,7 1.137,8 29,9 35,10 372.55,11 30.772,12 32.989,13 11,14 8.921}
{0 CHEMBL241673,1 1,2 1,3 2.6,4 1,5 0.631,6 0.05,7 1.141,8 19,9 20,10 255.43,11 21.707,12 23.972,13 11,14 6.917}
{0 CHEMBL241674,1 1,2 1,3 5.1,4 1,5 0.626,6 0.049,7 1.143,8 20,9 21,10 271.43,11 22.422,12 24.426,13 11,14 7.724}
{0 CHEMBL256691,1 2,2 1,3 3.8,4 1,5 0.639,6 0.055,7 1.144,8 29,9 33.5,10 378.56,11 31.013,12 33.205,13 13,14 7.237}
{0 CHEMBL257742,1 2,2 1,3 3.6,4 1,5 0.636,6 0.052,7 1.144,8 30,9 34.5,10 392.59,11 32.54,12 34.966,13 14,14 6.119}
{0 CHEMBL258101,1 2,2 1,3 3.4,4 1,5 0.66,6 0.063,7 1.134,8 35,9 42.5,10 440.63,11 36.54,12 38.966,13 12,14 6.824}
{0 CHEMBL269952,1 2,2 2,3 3.8,4 2,5 0.658,6 0.054,7 1.14,8 30,9 34.5,10 410.63,11 32.2,12 34.853,13 13,14 7.222}
{0 CHEMBL269953,1 2,2 1,3 3.6,4 1,5 0.636,6 0.052,7 1.144,8 30,9 34.5,10 392.59,11 32.54,12 34.966,13 14,14 7.161}
{0 CHEMBL269965,1 2,2 1,3 5.4,4 1,5 0.633,6 0.085,7 1.145,8 31,9 35.5,10 408.59,11 33.255,12 35.421,13 14,14 7.31}
{0 CHEMBL270163,1 2,2 1,3 3.8,4 1,5 0.635,6 0.055,7 1.163,8 32,9 36.5,10 432.53,11 32.163,12 33.017,13 13,14 6.854}
{0 CHEMBL270395,1 2,3 5.8,5 0.616,6 0.055,7 1.149,8 29,9 33.5,10 362.49,11 30.541,12 32.012,13 13,14 6.018}
{0 CHEMBL271444,1 2,2 1,3 3.6,4 1,5 0.636,6 0.069,7 1.144,8 30,9 34.5,10 392.59,11 32.54,12 34.966,13 14,14 6.921}
{0 CHEMBL271870,1 2,2 1,3 3.6,4 1,5 0.638,6 0.051,7 1.14,8 30,9 34.5,10 391.6,11 33.045,12 35.722,13 14,14 6.292}
{0 CHEMBL272079,1 2,2 1,3 3.8,4 1,5 0.641,6 0.054,7 1.14,8 29,9 33.5,10 377.57,11 31.519,12 33.961,13 13,14 6.62}
{0 CHEMBL273206,1 2,2 1,3 3.8,4 1,5 0.641,6 0.054,7 1.14,8 29,9 33.5,10 377.57,11 31.519,12 33.961,13 13,14 7.215}
{0 CHEMBL307636,1 1,3 2.6,5 0.614,6 0.051,7 1.143,8 18,9 21,10 235.37,11 21.52,12 23.324,13 11,14 8.553}
{0 CHEMBL319819,1 1,3 4.3,5 0.623,6 0.06,7 1.138,8 25,9 28,10 303.45,11 27.289,12 29.302,13 15,14 8.638}
{0 CHEMBL359848,1 2,3 3.1,5 0.626,6 0.091,7 1.147,8 17,9 21,10 220.31,11 18.961,12 20.046,13 8,14 5.886}
{0 CHEMBL361656,1 3,3 6.1,5 0.638,6 0.18,7 1.14,8 27,9 35,10 357.46,11 29.993,12 31.245,13 8,14 6.18}
{0 CHEMBL361741,1 4,3 8.9,5 0.621,6 0.087,7 1.148,8 25,9 32,10 335.41,11 27.181,12 27.938,13 7,14 5.678}
{0 CHEMBL362262,1 2,3 2.3,5 0.636,6 0.065,7 1.138,8 24,9 28,10 286.42,11 25.542,12 27.33,13 13,14 5.824}
{0 CHEMBL362297,1 3,3 4.1,5 0.649,6 0.098,7 1.136,8 28,9 36,10 353.47,11 30.278,12 31.79,13 9,14 5.357}
{0 CHEMBL363542,1 2,3 2.7,5 0.663,6 0.158,7 1.145,8 23,9 32,10 297.36,11 23.972,12 24.54,13 5,14 6.444}
{0 CHEMBL365291,1 4,3 6.3,5 0.64,6 0.12,7 1.146,8 29,9 38,10 371.45,11 29.982,12 30.733,13 9,14 5.921}
{0 CHEMBL368015,1 4,3 7.7,5 0.624,6 0.093,7 1.144,8 29,9 36,10 375.48,11 31.234,12 32.461,13 10,14 5.337}
{0 CHEMBL369129,1 2,3 4.5,5 0.626,6 0.045,7 1.157,8 12,9 16,10 166.21,11 13.381,12 13.761,13 4,14 5.921}
{0 CHEMBL370046,1 1,3 2.3,5 0.676,6 0.067,7 1.132,8 27,9 37,10 334.42,11 28.004,12 29.057,13 8,14 9.77}
{0 CHEMBL370540,1 3,3 7,5 0.645,6 0.089,7 1.14,8 26,9 34,10 329.4,11 26.939,12 27.722,13 8,14 9.77}
{0 CHEMBL371143,1 1,3 2.4,5 0.662,6 0.068,7 1.134,8 25,9 33,10 309.41,11 26.509,12 27.813,13 8,14 9.585}
{0 CHEMBL371585,1 2,3 4.4,5 0.645,6 0.064,7 1.138,8 26,9 33,10 327.43,11 27.751,12 29.029,13 8,14 8.959}
{0 CHEMBL374688,1 1,2 1,3 2.6,4 1,5 0.678,6 0.073,7 1.129,8 23,9 29,10 302.44,11 24.675,12 26.455,13 7,14 7.474}
{0 CHEMBL376562,1 2,2 1,3 4.8,4 1,5 0.659,6 0.068,7 1.135,8 24,9 29,10 320.46,11 25.917,12 27.671,13 7,14 6.821}
{0 CHEMBL376587,1 2,2 1,3 5,4 1,5 0.667,6 0.071,7 1.129,8 23,9 28,10 305.44,11 24.895,12 26.665,13 7,14 6.627}
{0 CHEMBL379522,1 1,3 5,5 0.626,6 0.098,7 1.143,8 21,9 26,10 276.38,11 23.73,12 25.023,13 11,14 7.42}
{0 CHEMBL381626,1 1,3 3.4,5 0.622,6 0.033,7 1.145,8 15,9 18,10 193.28,11 16.94,12 18.04,13 8,14 8.538}
{0 CHEMBL384299,1 3,3 3.8,5 0.633,6 0.054,7 1.143,8 30,9 36,10 370.51,11 31.826,12 33.557,13 10,14 7.886}
{0 CHEMBL385248,1 3,3 4.3,5 0.631,6 0.104,7 1.146,8 26,9 32,10 330.44,11 27.772,12 29.034,13 7,14 5.721}
{0 CHEMBL386325,1 3,3 4,5 0.636,6 0.057,7 1.143,8 29,9 35,10 356.48,11 30.299,12 31.796,13 9,14 5.658}
{0 CHEMBL386369,1 2,3 5.6,5 0.648,6 0.089,7 1.135,8 31,9 40,10 395.51,11 33.519,12 35.006,13 11,14 9}
{0 CHEMBL387260,1 3,3 3.6,5 0.631,6 0.068,7 1.142,8 31,9 37,10 384.54,11 33.353,12 35.319,13 11,14 6.638}
{0 CHEMBL387666,1 2,2 1,3 7.5,4 1,5 0.684,6 0.095,7 1.124,8 25,9 32,10 331.43,11 26.083,12 27.358,13 7,14 6.523}
{0 CHEMBL388111,1 1,2 1,3 4.3,4 1,5 0.656,6 0.061,7 1.13,8 26,9 30,10 333.5,11 27.949,12 30.188,13 10,14 8.215}
{0 CHEMBL389244,1 1,2 1,3 2.4,4 1,5 0.666,6 0.044,7 1.128,8 24,9 28,10 303.47,11 25.707,12 27.972,13 9,14 7.71}
{0 CHEMBL389624,1 2,2 1,3 5.6,4 1,5 0.656,6 0.143,7 1.132,8 30,9 37,10 402.57,11 33.212,12 35.409,13 11,14 7.815}
{0 CHEMBL389848,1 1,2 1,3 1.9,4 1,5 0.653,6 0.125,7 1.132,8 28,9 34,10 372.59,11 32.309,12 35.262,13 12,14 8.301}
{0 CHEMBL389906,1 3,2 2,3 7.1,4 2,5 0.691,6 0.091,7 1.128,8 26,9 34,10 366.51,11 27.292,12 29.012,13 7,14 6.523}
{0 CHEMBL390512,1 1,2 1,3 2.4,4 2,5 0.686,6 0.044,7 1.126,8 25,9 29,10 337.91,11 26.535,12 28.83,13 9,14 7.873}
{0 CHEMBL390513,1 1,2 1,3 2.6,4 1,5 0.676,6 0.075,7 1.135,8 23,9 29,10 303.43,11 24.17,12 25.699,13 7,14 7.517}
{0 CHEMBL391331,1 1,2 1,3 2.4,4 1,5 0.628,6 0.047,7 1.141,8 20,9 21,10 269.46,11 23.234,12 25.733,13 12,14 7.128}
{0 CHEMBL391332,1 1,2 1,3 2.3,4 1,5 0.622,6 0.044,7 1.146,8 21,9 22,10 284.48,11 24.256,12 26.739,13 12,14 7.091}
{0 CHEMBL391433,1 1,2 1,3 1.9,4 1,5 0.646,6 0.071,7 1.134,8 28,9 32,10 360.58,11 31.309,12 34.262,13 12,14 7.417}
{0 CHEMBL391466,1 3,2 1,3 5.8,4 1,5 0.647,6 0.073,7 1.138,8 30,9 36,10 391.55,11 31.707,12 33.654,13 11,14 8.658}
{0 CHEMBL391577,1 1,2 1,3 2,4 2,5 0.667,6 0.057,7 1.133,8 28,9 32,10 380.99,11 30.61,12 33.358,13 11,14 8.143}
{0 CHEMBL391578,1 1,2 1,3 2,4 1,5 0.662,6 0.056,7 1.133,8 29,9 35,10 371.56,11 31.277,12 33.745,13 11,14 8.328}
{0 CHEMBL395606,1 1,2 1,3 2,4 1,5 0.652,6 0.056,7 1.13,8 27,9 31,10 345.56,11 30.288,12 33.256,13 12,14 8.018}
{0 CHEMBL395854,1 1,2 1,3 2,4 1,5 0.648,6 0.058,7 1.138,8 27,9 31,10 347.54,11 29.277,12 31.745,13 11,14 8.456}
{0 CHEMBL397893,1 1,2 1,3 2,4 1,5 0.649,6 0.057,7 1.141,8 28,9 32,10 364.54,11 30.166,12 32.438,13 11,14 7.757}
{0 CHEMBL399405,1 1,2 1,3 2,4 1,5 0.66,6 0.057,7 1.137,8 29,9 35,10 372.55,11 30.772,12 32.989,13 11,14 8.721}
{0 CHEMBL399610,1 3,2 1,3 5.9,4 1,5 0.645,6 0.074,7 1.143,8 30,9 36,10 392.54,11 31.201,12 32.898,13 11,14 8.959}
{0 CHEMBL402645,1 2,2 1,3 3.4,4 1,5 0.633,6 0.066,7 1.143,8 31,9 35.5,10 406.62,11 34.067,12 36.728,13 15,14 6.721}
{0 CHEMBL403449,1 2,2 2,3 4,4 2,5 0.662,6 0.057,7 1.14,8 29,9 33.5,10 396.6,11 30.673,12 33.091,13 12,14 7.119}
{0 CHEMBL403969,1 2,2 1,3 4.1,4 1,5 0.642,6 0.058,7 1.144,8 28,9 32.5,10 364.53,11 29.486,12 31.444,13 12,14 7.347}
{0 CHEMBL403970,1 2,2 1,3 3.8,4 1,5 0.641,6 0.054,7 1.14,8 29,9 33.5,10 377.57,11 31.519,12 33.961,13 13,14 6.469}
{0 CHEMBL404159,1 2,2 1,3 3.8,4 1,5 0.641,6 0.054,7 1.14,8 29,9 33.5,10 377.57,11 31.519,12 33.961,13 14,14 6.347}
{0 CHEMBL411561,1 1,2 1,3 4.8,4 1,5 0.653,6 0.091,7 1.133,8 23,9 27,10 307.46,11 25.422,12 27.426,13 8,14 7.26}
{0 CHEMBL429890,1 2,3 2.8,5 0.634,6 0.079,7 1.142,8 20,9 24,10 246.35,11 21.488,12 22.807,13 10,14 5.678}
{0 CHEMBL433811,1 1,3 6.1,5 0.633,6 0.098,7 1.138,8 27,9 33,10 344.46,11 29.498,12 31,13 10,14 9.62}
{0 CHEMBL437592,1 2,2 1,3 3.4,4 1,5 0.633,6 0.082,7 1.143,8 31,9 35.5,10 406.62,11 34.067,12 36.728,13 15,14 6.959}
{0 CHEMBL439067,1 2,2 1,3 3.8,4 1,5 0.641,6 0.054,7 1.14,8 29,9 33.5,10 377.57,11 31.519,12 33.961,13 13,14 6.495}
{0 CHEMBL441559,1 2,2 1,3 4.9,4 1,5 0.681,6 0.07,7 1.128,8 25,9 32,10 330.45,11 26.39,12 27.909,13 7,14 7.467}
{0 CHEMBL445437,1 1,3 2.4,4 1,5 0.683,6 0.068,7 1.132,8 26,9 34,10 343.85,11 27.337,12 28.671,13 8,14 9.886}
{0 CHEMBL452425,1 4,3 8.3,5 0.619,6 0.102,7 1.147,8 26,9 33,10 349.44,11 28.707,12 29.699,13 8,14 5.807}
{0 CHEMBL456420,1 1,3 2.3,5 0.676,6 0.067,7 1.132,8 27,9 37,10 334.42,11 28.004,12 29.057,13 8,14 9.77}
{0 CHEMBL515387,1 1,3 2,5 0.62,6 0.057,7 1.161,8 29,9 33,10 366.47,11 29.878,12 30.978,13 12,14 7.893}
{0 CHEMBL534473,1 2,3 6.3,5 0.62,6 0.122,7 1.139,8 24,9 29,10 319.45,11 28.003,12 29.756,13 9,14 4.633}
{0 CHEMBL534918,1 3,3 7.3,5 0.618,6 0.125,7 1.142,8 28,9 34,10 376.51,11 32.266,12 33.978,13 10,14 5.409}
{0 CHEMBL534920,1 2,3 4.3,4 2,5 0.658,6 0.085,7 1.14,8 25,9 30,10 373.32,11 28.438,12 30.262,13 8,14 5.252}
{0 CHEMBL535813,1 1,2 1,3 3.2,4 1,5 0.62,6 0.097,7 1.143,8 13,9 14,10 202.36,11 17.159,12 19.205,13 8,14 5.569}
{0 CHEMBL536036,1 4,3 8.3,5 0.617,6 0.102,7 1.154,8 27,9 34,10 367.43,11 29.091,12 29.637,13 8,14 5.644}
{0 CHEMBL536486,1 2,3 4.3,5 0.634,6 0.083,7 1.141,8 25,9 32,10 329.45,11 28.278,12 29.79,13 8,14 5.036}
{0 CHEMBL536487,1 2,3 4.1,5 0.615,6 0.08,7 1.163,8 27,9 32,10 372.44,11 29.46,12 30.12,13 9,14 4.602}
{0 CHEMBL537848,1 4,3 8.3,5 0.619,6 0.102,7 1.147,8 26,9 33,10 349.44,11 28.707,12 29.699,13 8,14 5.151}
{0 CHEMBL538074,1 4,3 8.3,4 1,5 0.637,6 0.102,7 1.146,8 27,9 34,10 383.88,11 29.535,12 30.557,13 8,14 5.327}
{0 CHEMBL539939,1 2,3 4.7,5 0.652,6 0.067,7 1.133,8 25,9 32,10 312.41,11 26.73,12 28.023,13 8,14 8.42}
{0 CHEMBL556382,1 2,3 4.3,5 0.621,6 0.085,7 1.143,8 23,9 28,10 304.44,11 26.783,12 28.546,13 8,14 4.824}
{0 CHEMBL556754,1 2,3 4.3,5 0.634,6 0.083,7 1.141,8 25,9 32,10 329.45,11 28.278,12 29.79,13 8,14 5.394}
{0 CHEMBL557575,1 3,3 7.3,5 0.618,6 0.125,7 1.142,8 28,9 34,10 376.51,11 32.266,12 33.978,13 10,14 5.056}
{0 CHEMBL77538,1 1,3 2.5,5 0.651,6 0.146,7 1.142,8 23,9 31,10 298.39,11 25.004,12 26.057,13 7,14 8.43}
{0 CHEMBL77539,1 3,3 7.3,5 0.633,6 0.167,7 1.149,8 24,9 32,10 318.38,11 25.434,12 25.966,13 7,14 7.766}
