{
  "data_features": {
    "feature": [
      {
        "data_type": "nominal",
        "index": "0",
        "is_ignore": "false",
        "is_row_identifier": "true",
        "is_target": "false",
        "name": "molecule_id",
        "nominal_value": [
          "CHEMBL1689460",
          "CHEMBL1689463",
          "CHEMBL1689466",
          "CHEMBL1689467",
          "CHEMBL1689468",
          "CHEMBL1689469",
          "CHEMBL1689470",
          "CHEMBL1689471",
          "CHEMBL1689472",
          "CHEMBL1689473",
          "CHEMBL1689474",
          "CHEMBL1689478",
          "CHEMBL1689479",
          "CHEMBL1689480",
          "CHEMBL1689483"
        ],
        "number_of_missing_values": "0"
      },
      {
        "data_type": "numeric",
        "index": "1",
        "is_ignore": "false",
        "is_row_identifier": "false",
        "is_target": "false",
        "name": "O.",
        "number_of_missing_values": "0"
      },
      {
        "data_type": "numeric",
        "index": "2",
        "is_ignore": "false",
        "is_row_identifier": "false",
        "is_target": "false",
        "name": "AMW",
        "number_of_missing_values": "0"
      },
      {
        "data_type": "numeric",
        "index": "3",
        "is_ignore": "false",
        "is_row_identifier": "false",
        "is_target": "true",
        "name": "pXC50",
        "number_of_missing_values": "0"
      }
    ]
  }
}