{
  "data_features": {
    "feature": [
      {
        "data_type": "nominal",
        "index": "0",
        "is_ignore": "false",
        "is_row_identifier": "true",
        "is_target": "false",
        "name": "molecule_id",
        "nominal_value": [
          "CHEMBL1096289",
          "CHEMBL121388",
          "CHEMBL121915",
          "CHEMBL123132",
          "CHEMBL12442",
          "CHEMBL13378",
          "CHEMBL154535",
          "CHEMBL154700",
          "CHEMBL1835336",
          "CHEMBL193087",
          "CHEMBL2092841",
          "CHEMBL224688",
          "CHEMBL224872",
          "CHEMBL224926",
          "CHEMBL2312403",
          "CHEMBL260328",
          "CHEMBL27130",
          "CHEMBL275040",
          "CHEMBL276815",
          "CHEMBL28472",
          "CHEMBL30285",
          "CHEMBL337577",
          "CHEMBL346524",
          "CHEMBL366489",
          "CHEMBL370941",
          "CHEMBL372643",
          "CHEMBL384474",
          "CHEMBL387549",
          "CHEMBL388746",
          "CHEMBL449296",
          "CHEMBL492469",
          "CHEMBL492628",
          "CHEMBL492629",
          "CHEMBL492630",
          "CHEMBL493596",
          "CHEMBL493665",
          "CHEMBL493892",
          "CHEMBL508818",
          "CHEMBL553028",
          "CHEMBL575060",
          "CHEMBL72366"
        ],
        "number_of_missing_values": "0"
      },
      {
        "data_type": "numeric",
        "index": "1",
        "is_ignore": "false",
        "is_row_identifier": "false",
        "is_target": "false",
        "name": "nCsp3",
        "number_of_missing_values": "0"
      },
      {
        "data_type": "numeric",
        "index": "2",
        "is_ignore": "false",
        "is_row_identifier": "false",
        "is_target": "false",
        "name": "C.",
        "number_of_missing_values": "0"
      },
      {
        "data_type": "numeric",
        "index": "3",
        "is_ignore": "false",
        "is_row_identifier": "false",
        "is_target": "true",
        "name": "pXC50",
        "number_of_missing_values": "0"
      }
    ]
  }
}