{
  "data_features": {
    "feature": [
      {
        "data_type": "nominal",
        "index": "0",
        "is_ignore": "false",
        "is_row_identifier": "true",
        "is_target": "false",
        "name": "molecule_id",
        "nominal_value": [
          "CHEMBL10",
          "CHEMBL101253",
          "CHEMBL103667",
          "CHEMBL104264",
          "CHEMBL105442",
          "CHEMBL1079175",
          "CHEMBL1082440",
          "CHEMBL1084546",
          "CHEMBL1090356",
          "CHEMBL1090360",
          "CHEMBL1095624",
          "CHEMBL1096290",
          "CHEMBL1096291",
          "CHEMBL1096292",
          "CHEMBL1096626",
          "CHEMBL1096634",
          "CHEMBL1096636",
          "CHEMBL1097974",
          "CHEMBL1098241",
          "CHEMBL1098316",
          "CHEMBL1098938",
          "CHEMBL1098939",
          "CHEMBL1098943",
          "CHEMBL1098944",
          "CHEMBL1099276",
          "CHEMBL1099281",
          "CHEMBL1099290",
          "CHEMBL1099296",
          "CHEMBL1099297",
          "CHEMBL1099298",
          "CHEMBL116070",
          "CHEMBL1171647",
          "CHEMBL1173055",
          "CHEMBL1173655",
          "CHEMBL117697",
          "CHEMBL1190711",
          "CHEMBL119385",
          "CHEMBL1230020",
          "CHEMBL1230122",
          "CHEMBL1236107",
          "CHEMBL1236126",
          "CHEMBL1240703",
          "CHEMBL1241473",
          "CHEMBL1241674",
          "CHEMBL1242373",
          "CHEMBL1243326",
          "CHEMBL124660",
          "CHEMBL1254114",
          "CHEMBL1254115",
          "CHEMBL1257163",
          "CHEMBL1257164",
          "CHEMBL1257280",
          "CHEMBL1257281",
          "CHEMBL1258329",
          "CHEMBL1258330",
          "CHEMBL1258441",
          "CHEMBL1258442",
          "CHEMBL1258550",
          "CHEMBL1258551",
          "CHEMBL1258662",
          "CHEMBL1258663",
          "CHEMBL1258778",
          "CHEMBL1258779",
          "CHEMBL1258898",
          "CHEMBL1258899",
          "CHEMBL127898",
          "CHEMBL1287853",
          "CHEMBL1289926",
          "CHEMBL1336",
          "CHEMBL1375418",
          "CHEMBL1375640",
          "CHEMBL1381197",
          "CHEMBL1419458",
          "CHEMBL1421",
          "CHEMBL14249",
          "CHEMBL143703",
          "CHEMBL1461728",
          "CHEMBL1472492",
          "CHEMBL14762",
          "CHEMBL1516890",
          "CHEMBL1614701",
          "CHEMBL1614705",
          "CHEMBL162",
          "CHEMBL1624529",
          "CHEMBL1682341",
          "CHEMBL1682345",
          "CHEMBL1682346",
          "CHEMBL1682357",
          "CHEMBL1682359",
          "CHEMBL1682360",
          "CHEMBL1682540",
          "CHEMBL1682545",
          "CHEMBL1682546",
          "CHEMBL1682552",
          "CHEMBL1682553",
          "CHEMBL1682558",
          "CHEMBL1721885",
          "CHEMBL1727312",
          "CHEMBL17370",
          "CHEMBL178133",
          "CHEMBL1782182",
          "CHEMBL1782185",
          "CHEMBL1782186",
          "CHEMBL1782187",
          "CHEMBL1782188",
          "CHEMBL178349",
          "CHEMBL178397",
          "CHEMBL178445",
          "CHEMBL178468",
          "CHEMBL178696",
          "CHEMBL178737",
          "CHEMBL178872",
          "CHEMBL1789941",
          "CHEMBL179183",
          "CHEMBL1794065",
          "CHEMBL1794066",
          "CHEMBL179547",
          "CHEMBL180022",
          "CHEMBL180058",
          "CHEMBL180231",
          "CHEMBL180356",
          "CHEMBL180580",
          "CHEMBL181090",
          "CHEMBL181419",
          "CHEMBL181730",
          "CHEMBL181927",
          "CHEMBL182101",
          "CHEMBL1825138",
          "CHEMBL183844",
          "CHEMBL184847",
          "CHEMBL185569",
          "CHEMBL188434",
          "CHEMBL1890036",
          "CHEMBL1908391",
          "CHEMBL1908392",
          "CHEMBL1908393",
          "CHEMBL1908394",
          "CHEMBL1908395",
          "CHEMBL1908396",
          "CHEMBL1908397",
          "CHEMBL191003",
          "CHEMBL191336",
          "CHEMBL1929238",
          "CHEMBL1956071",
          "CHEMBL1957085",
          "CHEMBL1958401",
          "CHEMBL196363",
          "CHEMBL1964290",
          "CHEMBL1964307",
          "CHEMBL1964399",
          "CHEMBL1964413",
          "CHEMBL1964444",
          "CHEMBL1964644",
          "CHEMBL1964687",
          "CHEMBL1964692",
          "CHEMBL1964777",
          "CHEMBL1964804",
          "CHEMBL1964937",
          "CHEMBL1965131",
          "CHEMBL1965351",
          "CHEMBL1965423",
          "CHEMBL1965495",
          "CHEMBL1965507",
          "CHEMBL1965570",
          "CHEMBL1965589",
          "CHEMBL1965631",
          "CHEMBL1965660",
          "CHEMBL1965836",
          "CHEMBL1965845",
          "CHEMBL1965910",
          "CHEMBL1965988",
          "CHEMBL1966035",
          "CHEMBL1966069",
          "CHEMBL1966087",
          "CHEMBL1966279",
          "CHEMBL1966343",
          "CHEMBL1966425",
          "CHEMBL1966514",
          "CHEMBL1966524",
          "CHEMBL1966628",
          "CHEMBL1966703",
          "CHEMBL1966722",
          "CHEMBL1966808",
          "CHEMBL1966816",
          "CHEMBL1967094",
          "CHEMBL1967116",
          "CHEMBL1967302",
          "CHEMBL1967531",
          "CHEMBL1967538",
          "CHEMBL1967544",
          "CHEMBL1967560",
          "CHEMBL1967564",
          "CHEMBL1967720",
          "CHEMBL1967878",
          "CHEMBL1967887",
          "CHEMBL1968070",
          "CHEMBL1968127",
          "CHEMBL1968151",
          "CHEMBL1968245",
          "CHEMBL1968380",
          "CHEMBL1968406",
          "CHEMBL1968590",
          "CHEMBL1968705",
          "CHEMBL1968791",
          "CHEMBL1968850",
          "CHEMBL1968926",
          "CHEMBL1969042",
          "CHEMBL1969049",
          "CHEMBL1969102",
          "CHEMBL1969126",
          "CHEMBL1969156",
          "CHEMBL1969190",
          "CHEMBL1969264",
          "CHEMBL1969301",
          "CHEMBL1969372",
          "CHEMBL1969502",
          "CHEMBL1969506",
          "CHEMBL1969523",
          "CHEMBL1969537",
          "CHEMBL1969561",
          "CHEMBL1969588",
          "CHEMBL1969664",
          "CHEMBL1969735",
          "CHEMBL1969755",
          "CHEMBL1969843",
          "CHEMBL1969879",
          "CHEMBL1970074",
          "CHEMBL1970083",
          "CHEMBL1970104",
          "CHEMBL1970142",
          "CHEMBL1970189",
          "CHEMBL1970203",
          "CHEMBL1970217",
          "CHEMBL1970314",
          "CHEMBL1970317",
          "CHEMBL1970340",
          "CHEMBL1970369",
          "CHEMBL1970522",
          "CHEMBL1970709",
          "CHEMBL1970735",
          "CHEMBL1970806",
          "CHEMBL1970873",
          "CHEMBL1970879",
          "CHEMBL1970913",
          "CHEMBL1971017",
          "CHEMBL1971021",
          "CHEMBL1971029",
          "CHEMBL1971141",
          "CHEMBL1971149",
          "CHEMBL1971186",
          "CHEMBL1971245",
          "CHEMBL1971430",
          "CHEMBL1971649",
          "CHEMBL1971694",
          "CHEMBL1971801",
          "CHEMBL1971943",
          "CHEMBL1971947",
          "CHEMBL1972119",
          "CHEMBL1972125",
          "CHEMBL1972142",
          "CHEMBL1972158",
          "CHEMBL1972183",
          "CHEMBL1972221",
          "CHEMBL1972250",
          "CHEMBL1972258",
          "CHEMBL1972276",
          "CHEMBL1972362",
          "CHEMBL1972365",
          "CHEMBL1972489",
          "CHEMBL1972568",
          "CHEMBL1972576",
          "CHEMBL1972584",
          "CHEMBL1972659",
          "CHEMBL1972820",
          "CHEMBL1972840",
          "CHEMBL1972849",
          "CHEMBL1972937",
          "CHEMBL1973098",
          "CHEMBL1973142",
          "CHEMBL1973145",
          "CHEMBL1973211",
          "CHEMBL1973348",
          "CHEMBL1973395",
          "CHEMBL1973399",
          "CHEMBL1973483",
          "CHEMBL1973540",
          "CHEMBL1973711",
          "CHEMBL1973808",
          "CHEMBL1973860",
          "CHEMBL1973893",
          "CHEMBL1973937",
          "CHEMBL1974157",
          "CHEMBL1974254",
          "CHEMBL1974288",
          "CHEMBL1974310",
          "CHEMBL1974328",
          "CHEMBL1974416",
          "CHEMBL1974457",
          "CHEMBL1974664",
          "CHEMBL1974702",
          "CHEMBL1974803",
          "CHEMBL1974870",
          "CHEMBL1974935",
          "CHEMBL1975121",
          "CHEMBL1975128",
          "CHEMBL1975138",
          "CHEMBL1975208",
          "CHEMBL1975233",
          "CHEMBL1975256",
          "CHEMBL1975357",
          "CHEMBL1975418",
          "CHEMBL1975490",
          "CHEMBL1975500",
          "CHEMBL1975534",
          "CHEMBL1975647",
          "CHEMBL1975787",
          "CHEMBL1975900",
          "CHEMBL1976090",
          "CHEMBL1976093",
          "CHEMBL1976134",
          "CHEMBL1976220",
          "CHEMBL1976240",
          "CHEMBL1976328",
          "CHEMBL1976420",
          "CHEMBL1976455",
          "CHEMBL1976732",
          "CHEMBL1976872",
          "CHEMBL1977041",
          "CHEMBL1977135",
          "CHEMBL1977148",
          "CHEMBL1977223",
          "CHEMBL1977346",
          "CHEMBL1977374",
          "CHEMBL1977604",
          "CHEMBL1977619",
          "CHEMBL1977681",
          "CHEMBL1977713",
          "CHEMBL1977814",
          "CHEMBL1978014",
          "CHEMBL1978099",
          "CHEMBL1978200",
          "CHEMBL1978448",
          "CHEMBL1978656",
          "CHEMBL1979057",
          "CHEMBL1979093",
          "CHEMBL1979176",
          "CHEMBL1979252",
          "CHEMBL1979318",
          "CHEMBL1979357",
          "CHEMBL1979516",
          "CHEMBL1979554",
          "CHEMBL1979577",
          "CHEMBL1979718",
          "CHEMBL1979855",
          "CHEMBL1979883",
          "CHEMBL1979970",
          "CHEMBL1980142",
          "CHEMBL1980144",
          "CHEMBL1980161",
          "CHEMBL1980163",
          "CHEMBL1980297",
          "CHEMBL1980391",
          "CHEMBL1980489",
          "CHEMBL1980540",
          "CHEMBL1980704",
          "CHEMBL1980715",
          "CHEMBL1980802",
          "CHEMBL1980896",
          "CHEMBL1980995",
          "CHEMBL1981045",
          "CHEMBL1981047",
          "CHEMBL1981079",
          "CHEMBL1981107",
          "CHEMBL1981410",
          "CHEMBL1981720",
          "CHEMBL1981725",
          "CHEMBL1981782",
          "CHEMBL1982122",
          "CHEMBL1982135",
          "CHEMBL1982167",
          "CHEMBL1982361",
          "CHEMBL1982383",
          "CHEMBL1982465",
          "CHEMBL1982466",
          "CHEMBL1982476",
          "CHEMBL1982506",
          "CHEMBL1982541",
          "CHEMBL1982563",
          "CHEMBL1982610",
          "CHEMBL1982660",
          "CHEMBL1982711",
          "CHEMBL1982866",
          "CHEMBL1982874",
          "CHEMBL1982880",
          "CHEMBL1982924",
          "CHEMBL1982957",
          "CHEMBL1982980",
          "CHEMBL1982992",
          "CHEMBL1983006",
          "CHEMBL1983025",
          "CHEMBL1983111",
          "CHEMBL1983195",
          "CHEMBL1983309",
          "CHEMBL1983449",
          "CHEMBL1983534",
          "CHEMBL1983923",
          "CHEMBL1983932",
          "CHEMBL1983945",
          "CHEMBL1983963",
          "CHEMBL1984038",
          "CHEMBL1984039",
          "CHEMBL1984044",
          "CHEMBL1984162",
          "CHEMBL1984191",
          "CHEMBL1984206",
          "CHEMBL1984274",
          "CHEMBL1984363",
          "CHEMBL1984367",
          "CHEMBL1984432",
          "CHEMBL1984500",
          "CHEMBL1984541",
          "CHEMBL1984586",
          "CHEMBL1984633",
          "CHEMBL1984700",
          "CHEMBL1984711",
          "CHEMBL1984788",
          "CHEMBL1984842",
          "CHEMBL1985074",
          "CHEMBL1985092",
          "CHEMBL1985095",
          "CHEMBL1985311",
          "CHEMBL1985406",
          "CHEMBL1985566",
          "CHEMBL1985580",
          "CHEMBL1986139",
          "CHEMBL1986186",
          "CHEMBL1986263",
          "CHEMBL1986328",
          "CHEMBL1986499",
          "CHEMBL1986530",
          "CHEMBL1986588",
          "CHEMBL1986597",
          "CHEMBL1986603",
          "CHEMBL1986781",
          "CHEMBL1986869",
          "CHEMBL1986943",
          "CHEMBL1986970",
          "CHEMBL1987007",
          "CHEMBL1987009",
          "CHEMBL1987034",
          "CHEMBL1987054",
          "CHEMBL1987143",
          "CHEMBL1987359",
          "CHEMBL1987533",
          "CHEMBL1987648",
          "CHEMBL1987679",
          "CHEMBL1987756",
          "CHEMBL1987793",
          "CHEMBL1987899",
          "CHEMBL1987910",
          "CHEMBL1987982",
          "CHEMBL1988075",
          "CHEMBL1988153",
          "CHEMBL1988163",
          "CHEMBL1988173",
          "CHEMBL1988300",
          "CHEMBL1988370",
          "CHEMBL1988387",
          "CHEMBL1988437",
          "CHEMBL1988537",
          "CHEMBL1988594",
          "CHEMBL1988608",
          "CHEMBL1988717",
          "CHEMBL1988838",
          "CHEMBL1988995",
          "CHEMBL1989029",
          "CHEMBL1989265",
          "CHEMBL1989423",
          "CHEMBL1989474",
          "CHEMBL1989518",
          "CHEMBL1989646",
          "CHEMBL1989708",
          "CHEMBL1989805",
          "CHEMBL1989834",
          "CHEMBL1989856",
          "CHEMBL1989957",
          "CHEMBL1990212",
          "CHEMBL1990254",
          "CHEMBL1990288",
          "CHEMBL1990346",
          "CHEMBL1990415",
          "CHEMBL1990482",
          "CHEMBL1990496",
          "CHEMBL1990583",
          "CHEMBL1990821",
          "CHEMBL1990884",
          "CHEMBL1990885",
          "CHEMBL1990904",
          "CHEMBL1990912",
          "CHEMBL1991063",
          "CHEMBL1991078",
          "CHEMBL1991138",
          "CHEMBL1991143",
          "CHEMBL1991180",
          "CHEMBL1991188",
          "CHEMBL1991285",
          "CHEMBL1991356",
          "CHEMBL1991395",
          "CHEMBL1991429",
          "CHEMBL1991434",
          "CHEMBL1991577",
          "CHEMBL1991640",
          "CHEMBL1991674",
          "CHEMBL1991678",
          "CHEMBL1991725",
          "CHEMBL1991728",
          "CHEMBL1991800",
          "CHEMBL1991846",
          "CHEMBL1991867",
          "CHEMBL1992242",
          "CHEMBL1992306",
          "CHEMBL1992323",
          "CHEMBL1992342",
          "CHEMBL1992536",
          "CHEMBL1992555",
          "CHEMBL1992634",
          "CHEMBL1992644",
          "CHEMBL1992645",
          "CHEMBL1992732",
          "CHEMBL1992740",
          "CHEMBL1992796",
          "CHEMBL1992922",
          "CHEMBL1992937",
          "CHEMBL1993166",
          "CHEMBL1993243",
          "CHEMBL1993424",
          "CHEMBL1993548",
          "CHEMBL1993584",
          "CHEMBL1993661",
          "CHEMBL1993722",
          "CHEMBL1993781",
          "CHEMBL1993941",
          "CHEMBL1994040",
          "CHEMBL1994074",
          "CHEMBL1994241",
          "CHEMBL1994321",
          "CHEMBL1994361",
          "CHEMBL1994526",
          "CHEMBL1994538",
          "CHEMBL1994693",
          "CHEMBL1994830",
          "CHEMBL1994864",
          "CHEMBL1994938",
          "CHEMBL1995172",
          "CHEMBL1995391",
          "CHEMBL1995448",
          "CHEMBL1995592",
          "CHEMBL1995736",
          "CHEMBL1995740",
          "CHEMBL1995813",
          "CHEMBL1995832",
          "CHEMBL1995927",
          "CHEMBL1996066",
          "CHEMBL1996111",
          "CHEMBL1996155",
          "CHEMBL1996208",
          "CHEMBL1996234",
          "CHEMBL1996390",
          "CHEMBL1996473",
          "CHEMBL1996500",
          "CHEMBL1996543",
          "CHEMBL1996587",
          "CHEMBL1996780",
          "CHEMBL1996791",
          "CHEMBL1996817",
          "CHEMBL1996831",
          "CHEMBL1996837",
          "CHEMBL1996923",
          "CHEMBL1996931",
          "CHEMBL1996979",
          "CHEMBL1997023",
          "CHEMBL1997025",
          "CHEMBL1997129",
          "CHEMBL1997340",
          "CHEMBL1997349",
          "CHEMBL1997503",
          "CHEMBL1997534",
          "CHEMBL1997597",
          "CHEMBL1997617",
          "CHEMBL1997623",
          "CHEMBL1997759",
          "CHEMBL1997764",
          "CHEMBL1997822",
          "CHEMBL1997846",
          "CHEMBL1997872",
          "CHEMBL1998112",
          "CHEMBL1998121",
          "CHEMBL1998159",
          "CHEMBL1998193",
          "CHEMBL1998414",
          "CHEMBL1998435",
          "CHEMBL1998545",
          "CHEMBL1998551",
          "CHEMBL1998585",
          "CHEMBL1998611",
          "CHEMBL1998829",
          "CHEMBL1999112",
          "CHEMBL1999126",
          "CHEMBL1999321",
          "CHEMBL1999428",
          "CHEMBL1999496",
          "CHEMBL1999556",
          "CHEMBL1999590",
          "CHEMBL1999714",
          "CHEMBL1999718",
          "CHEMBL1999749",
          "CHEMBL1999774",
          "CHEMBL1999811",
          "CHEMBL1999918",
          "CHEMBL1999931",
          "CHEMBL2000071",
          "CHEMBL2000104",
          "CHEMBL2000114",
          "CHEMBL2000271",
          "CHEMBL2000335",
          "CHEMBL2000345",
          "CHEMBL2000354",
          "CHEMBL2000393",
          "CHEMBL2000408",
          "CHEMBL2000429",
          "CHEMBL2000433",
          "CHEMBL2000481",
          "CHEMBL2000508",
          "CHEMBL2000568",
          "CHEMBL2000685",
          "CHEMBL2000801",
          "CHEMBL2000832",
          "CHEMBL2000894",
          "CHEMBL2001224",
          "CHEMBL2001239",
          "CHEMBL2001257",
          "CHEMBL2001288",
          "CHEMBL2001485",
          "CHEMBL2001520",
          "CHEMBL2001539",
          "CHEMBL2001547",
          "CHEMBL2001668",
          "CHEMBL2001920",
          "CHEMBL2001923",
          "CHEMBL2001957",
          "CHEMBL2001998",
          "CHEMBL2002165",
          "CHEMBL2002240",
          "CHEMBL2002322",
          "CHEMBL2002323",
          "CHEMBL2002346",
          "CHEMBL2002373",
          "CHEMBL2002407",
          "CHEMBL2002446",
          "CHEMBL2002479",
          "CHEMBL2002649",
          "CHEMBL2002682",
          "CHEMBL2002702",
          "CHEMBL2002726",
          "CHEMBL2002992",
          "CHEMBL2003271",
          "CHEMBL2003286",
          "CHEMBL2003341",
          "CHEMBL2003420",
          "CHEMBL2003456",
          "CHEMBL2003482",
          "CHEMBL2003524",
          "CHEMBL2003638",
          "CHEMBL2003657",
          "CHEMBL2003768",
          "CHEMBL2003817",
          "CHEMBL2004072",
          "CHEMBL2004290",
          "CHEMBL2004311",
          "CHEMBL2004355",
          "CHEMBL2004365",
          "CHEMBL2004419",
          "CHEMBL2004438",
          "CHEMBL2004447",
          "CHEMBL2004513",
          "CHEMBL2004544",
          "CHEMBL2004615",
          "CHEMBL2004647",
          "CHEMBL2004692",
          "CHEMBL2004716",
          "CHEMBL2004771",
          "CHEMBL2004871",
          "CHEMBL2004872",
          "CHEMBL2004892",
          "CHEMBL2004934",
          "CHEMBL2005112",
          "CHEMBL2005186",
          "CHEMBL2005375",
          "CHEMBL2005475",
          "CHEMBL2005528",
          "CHEMBL2005548",
          "CHEMBL2005631",
          "CHEMBL2005792",
          "CHEMBL2005828",
          "CHEMBL2005886",
          "CHEMBL2005899",
          "CHEMBL2005936",
          "CHEMBL2006010",
          "CHEMBL2006156",
          "CHEMBL2006188",
          "CHEMBL2006237",
          "CHEMBL2006263",
          "CHEMBL2006276",
          "CHEMBL2006439",
          "CHEMBL2006481",
          "CHEMBL2006493",
          "CHEMBL2006567",
          "CHEMBL2006580",
          "CHEMBL2006581",
          "CHEMBL2006631",
          "CHEMBL2006715",
          "CHEMBL2006778",
          "CHEMBL2006785",
          "CHEMBL2006836",
          "CHEMBL2006933",
          "CHEMBL2007002",
          "CHEMBL2007044",
          "CHEMBL2007064",
          "CHEMBL2007138",
          "CHEMBL2007151",
          "CHEMBL2007296",
          "CHEMBL2007372",
          "CHEMBL2007592",
          "CHEMBL2012701",
          "CHEMBL2012702",
          "CHEMBL2012703",
          "CHEMBL2031893",
          "CHEMBL2036343",
          "CHEMBL207253",
          "CHEMBL207400",
          "CHEMBL207544",
          "CHEMBL207995",
          "CHEMBL208637",
          "CHEMBL209534",
          "CHEMBL210032",
          "CHEMBL210390",
          "CHEMBL210618",
          "CHEMBL210887",
          "CHEMBL210928",
          "CHEMBL210963",
          "CHEMBL211378",
          "CHEMBL213505",
          "CHEMBL213618",
          "CHEMBL215152",
          "CHEMBL215803",
          "CHEMBL2177361",
          "CHEMBL2177362",
          "CHEMBL2177363",
          "CHEMBL2177364",
          "CHEMBL2177365",
          "CHEMBL2177366",
          "CHEMBL2177367",
          "CHEMBL2177368",
          "CHEMBL2177369",
          "CHEMBL2177370",
          "CHEMBL2177371",
          "CHEMBL2177372",
          "CHEMBL2177373",
          "CHEMBL2177374",
          "CHEMBL2177375",
          "CHEMBL2177376",
          "CHEMBL2177377",
          "CHEMBL2177378",
          "CHEMBL2177379",
          "CHEMBL2177380",
          "CHEMBL2177381",
          "CHEMBL2177382",
          "CHEMBL2177383",
          "CHEMBL2177385",
          "CHEMBL2177386",
          "CHEMBL2177387",
          "CHEMBL2177388",
          "CHEMBL2177389",
          "CHEMBL2177390",
          "CHEMBL2177818",
          "CHEMBL2177819",
          "CHEMBL2177825",
          "CHEMBL2177826",
          "CHEMBL2177827",
          "CHEMBL2177828",
          "CHEMBL2177829",
          "CHEMBL2177830",
          "CHEMBL2177831",
          "CHEMBL2177832",
          "CHEMBL2177833",
          "CHEMBL2177834",
          "CHEMBL2177835",
          "CHEMBL2177836",
          "CHEMBL2177837",
          "CHEMBL2178597",
          "CHEMBL2178598",
          "CHEMBL219722",
          "CHEMBL220057",
          "CHEMBL220241",
          "CHEMBL2205426",
          "CHEMBL221959",
          "CHEMBL223257",
          "CHEMBL223339",
          "CHEMBL223360",
          "CHEMBL223367",
          "CHEMBL223393",
          "CHEMBL223460",
          "CHEMBL225519",
          "CHEMBL226403",
          "CHEMBL226471",
          "CHEMBL226712",
          "CHEMBL226766",
          "CHEMBL226870",
          "CHEMBL227029",
          "CHEMBL227381",
          "CHEMBL227605",
          "CHEMBL227727",
          "CHEMBL227924",
          "CHEMBL227998",
          "CHEMBL228042",
          "CHEMBL228114",
          "CHEMBL228133",
          "CHEMBL228224",
          "CHEMBL228439",
          "CHEMBL228545",
          "CHEMBL228547",
          "CHEMBL228648",
          "CHEMBL228649",
          "CHEMBL228652",
          "CHEMBL228654",
          "CHEMBL228699",
          "CHEMBL228700",
          "CHEMBL228701",
          "CHEMBL228705",
          "CHEMBL228749",
          "CHEMBL228750",
          "CHEMBL228751",
          "CHEMBL228755",
          "CHEMBL228756",
          "CHEMBL228757",
          "CHEMBL228803",
          "CHEMBL228804",
          "CHEMBL228810",
          "CHEMBL228811",
          "CHEMBL228812",
          "CHEMBL228867",
          "CHEMBL230011",
          "CHEMBL2309006",
          "CHEMBL2309609",
          "CHEMBL231209",
          "CHEMBL2325728",
          "CHEMBL2325729",
          "CHEMBL2325730",
          "CHEMBL2325736",
          "CHEMBL2325737",
          "CHEMBL2325738",
          "CHEMBL2325739",
          "CHEMBL2325740",
          "CHEMBL2325741",
          "CHEMBL2325742",
          "CHEMBL2325743",
          "CHEMBL2325982",
          "CHEMBL2325983",
          "CHEMBL2325984",
          "CHEMBL2325985",
          "CHEMBL2325986",
          "CHEMBL2325987",
          "CHEMBL2325988",
          "CHEMBL2325989",
          "CHEMBL2325990",
          "CHEMBL2325991",
          "CHEMBL2325992",
          "CHEMBL2325993",
          "CHEMBL2325994",
          "CHEMBL2325995",
          "CHEMBL2325996",
          "CHEMBL2325997",
          "CHEMBL2333365",
          "CHEMBL2338333",
          "CHEMBL2338334",
          "CHEMBL2338335",
          "CHEMBL234085",
          "CHEMBL243088",
          "CHEMBL244378",
          "CHEMBL246970",
          "CHEMBL24828",
          "CHEMBL248757",
          "CHEMBL249282",
          "CHEMBL249697",
          "CHEMBL251860",
          "CHEMBL252054",
          "CHEMBL252055",
          "CHEMBL252056",
          "CHEMBL252259",
          "CHEMBL252260",
          "CHEMBL252261",
          "CHEMBL252455",
          "CHEMBL252456",
          "CHEMBL252457",
          "CHEMBL252652",
          "CHEMBL252653",
          "CHEMBL252654",
          "CHEMBL252856",
          "CHEMBL252857",
          "CHEMBL253457",
          "CHEMBL253458",
          "CHEMBL253693",
          "CHEMBL253969",
          "CHEMBL254099",
          "CHEMBL255212",
          "CHEMBL255348",
          "CHEMBL255360",
          "CHEMBL255559",
          "CHEMBL255772",
          "CHEMBL255835",
          "CHEMBL255863",
          "CHEMBL256835",
          "CHEMBL257441",
          "CHEMBL258696",
          "CHEMBL258844",
          "CHEMBL259084",
          "CHEMBL259141",
          "CHEMBL259356",
          "CHEMBL259753",
          "CHEMBL259850",
          "CHEMBL259922",
          "CHEMBL259967",
          "CHEMBL259968",
          "CHEMBL259982",
          "CHEMBL259998",
          "CHEMBL259999",
          "CHEMBL260000",
          "CHEMBL260092",
          "CHEMBL260135",
          "CHEMBL260184",
          "CHEMBL260358",
          "CHEMBL260397",
          "CHEMBL260463",
          "CHEMBL260577",
          "CHEMBL260670",
          "CHEMBL261034",
          "CHEMBL261247",
          "CHEMBL261249",
          "CHEMBL261260",
          "CHEMBL261540",
          "CHEMBL261542",
          "CHEMBL261849",
          "CHEMBL262341",
          "CHEMBL262433",
          "CHEMBL263664",
          "CHEMBL264666",
          "CHEMBL264667",
          "CHEMBL264965",
          "CHEMBL265193",
          "CHEMBL265451",
          "CHEMBL270157",
          "CHEMBL270388",
          "CHEMBL270444",
          "CHEMBL270815",
          "CHEMBL270847",
          "CHEMBL271091",
          "CHEMBL271381",
          "CHEMBL272292",
          "CHEMBL272453",
          "CHEMBL273160",
          "CHEMBL274064",
          "CHEMBL276130",
          "CHEMBL278041",
          "CHEMBL288441",
          "CHEMBL289959",
          "CHEMBL296468",
          "CHEMBL296586",
          "CHEMBL300138",
          "CHEMBL302449",
          "CHEMBL306380",
          "CHEMBL316264",
          "CHEMBL31965",
          "CHEMBL326282",
          "CHEMBL336961",
          "CHEMBL340384",
          "CHEMBL340921",
          "CHEMBL354676",
          "CHEMBL359864",
          "CHEMBL360333",
          "CHEMBL361391",
          "CHEMBL362016",
          "CHEMBL362455",
          "CHEMBL362558",
          "CHEMBL363648",
          "CHEMBL367601",
          "CHEMBL368010",
          "CHEMBL369094",
          "CHEMBL369506",
          "CHEMBL369532",
          "CHEMBL371206",
          "CHEMBL373598",
          "CHEMBL374611",
          "CHEMBL374742",
          "CHEMBL375236",
          "CHEMBL375284",
          "CHEMBL375509",
          "CHEMBL376388",
          "CHEMBL376726",
          "CHEMBL377300",
          "CHEMBL377383",
          "CHEMBL377408",
          "CHEMBL378627",
          "CHEMBL378963",
          "CHEMBL379218",
          "CHEMBL379300",
          "CHEMBL379835",
          "CHEMBL379849",
          "CHEMBL383264",
          "CHEMBL383541",
          "CHEMBL38380",
          "CHEMBL384304",
          "CHEMBL385478",
          "CHEMBL386051",
          "CHEMBL387971",
          "CHEMBL388183",
          "CHEMBL388184",
          "CHEMBL388395",
          "CHEMBL388739",
          "CHEMBL388966",
          "CHEMBL389176",
          "CHEMBL389685",
          "CHEMBL392642",
          "CHEMBL394619",
          "CHEMBL394790",
          "CHEMBL396523",
          "CHEMBL398951",
          "CHEMBL401622",
          "CHEMBL401999",
          "CHEMBL402199",
          "CHEMBL402355",
          "CHEMBL402579",
          "CHEMBL402846",
          "CHEMBL403354",
          "CHEMBL403355",
          "CHEMBL403356",
          "CHEMBL404347",
          "CHEMBL404367",
          "CHEMBL404553",
          "CHEMBL404554",
          "CHEMBL404555",
          "CHEMBL404556",
          "CHEMBL405384",
          "CHEMBL406863",
          "CHEMBL407504",
          "CHEMBL407733",
          "CHEMBL408151",
          "CHEMBL409503",
          "CHEMBL411903",
          "CHEMBL412142",
          "CHEMBL413779",
          "CHEMBL41783",
          "CHEMBL422897",
          "CHEMBL424872",
          "CHEMBL425155",
          "CHEMBL425338",
          "CHEMBL425650",
          "CHEMBL428462",
          "CHEMBL428690",
          "CHEMBL428861",
          "CHEMBL429576",
          "CHEMBL429703",
          "CHEMBL437109",
          "CHEMBL437747",
          "CHEMBL440084",
          "CHEMBL440560",
          "CHEMBL442227",
          "CHEMBL442229",
          "CHEMBL442718",
          "CHEMBL442919",
          "CHEMBL443620",
          "CHEMBL443633",
          "CHEMBL443661",
          "CHEMBL443962",
          "CHEMBL444136",
          "CHEMBL445212",
          "CHEMBL445464",
          "CHEMBL445813",
          "CHEMBL446134",
          "CHEMBL446779",
          "CHEMBL446966",
          "CHEMBL447044",
          "CHEMBL447114",
          "CHEMBL447168",
          "CHEMBL447328",
          "CHEMBL447348",
          "CHEMBL447558",
          "CHEMBL448196",
          "CHEMBL448826",
          "CHEMBL448926",
          "CHEMBL448991",
          "CHEMBL449200",
          "CHEMBL449989",
          "CHEMBL450266",
          "CHEMBL450545",
          "CHEMBL450772",
          "CHEMBL450786",
          "CHEMBL451401",
          "CHEMBL451961",
          "CHEMBL451964",
          "CHEMBL452823",
          "CHEMBL453288",
          "CHEMBL453510",
          "CHEMBL453586",
          "CHEMBL453995",
          "CHEMBL454210",
          "CHEMBL454859",
          "CHEMBL455071",
          "CHEMBL455226",
          "CHEMBL458997",
          "CHEMBL460472",
          "CHEMBL462120",
          "CHEMBL464552",
          "CHEMBL468280",
          "CHEMBL469590",
          "CHEMBL470597",
          "CHEMBL470598",
          "CHEMBL474432",
          "CHEMBL475251",
          "CHEMBL477772",
          "CHEMBL481491",
          "CHEMBL482536",
          "CHEMBL482537",
          "CHEMBL482767",
          "CHEMBL482967",
          "CHEMBL483158",
          "CHEMBL483321",
          "CHEMBL484390",
          "CHEMBL485556",
          "CHEMBL488428",
          "CHEMBL488654",
          "CHEMBL491473",
          "CHEMBL491758",
          "CHEMBL493066",
          "CHEMBL493067",
          "CHEMBL493269",
          "CHEMBL493911",
          "CHEMBL494060",
          "CHEMBL494088",
          "CHEMBL494089",
          "CHEMBL494662",
          "CHEMBL495739",
          "CHEMBL496690",
          "CHEMBL497151",
          "CHEMBL498051",
          "CHEMBL498052",
          "CHEMBL499554",
          "CHEMBL499555",
          "CHEMBL499683",
          "CHEMBL499961",
          "CHEMBL500993",
          "CHEMBL501612",
          "CHEMBL502113",
          "CHEMBL502393",
          "CHEMBL502426",
          "CHEMBL502854",
          "CHEMBL503270",
          "CHEMBL503652",
          "CHEMBL503810",
          "CHEMBL503980",
          "CHEMBL504251",
          "CHEMBL504950",
          "CHEMBL505758",
          "CHEMBL505848",
          "CHEMBL506077",
          "CHEMBL506153",
          "CHEMBL506434",
          "CHEMBL506827",
          "CHEMBL507204",
          "CHEMBL507936",
          "CHEMBL508098",
          "CHEMBL508754",
          "CHEMBL508794",
          "CHEMBL508861",
          "CHEMBL508928",
          "CHEMBL50894",
          "CHEMBL509032",
          "CHEMBL509747",
          "CHEMBL512135",
          "CHEMBL513728",
          "CHEMBL513846",
          "CHEMBL513909",
          "CHEMBL514499",
          "CHEMBL519697",
          "CHEMBL520788",
          "CHEMBL521642",
          "CHEMBL521823",
          "CHEMBL521851",
          "CHEMBL522351",
          "CHEMBL522892",
          "CHEMBL523586",
          "CHEMBL523695",
          "CHEMBL523823",
          "CHEMBL523859",
          "CHEMBL52387",
          "CHEMBL524998",
          "CHEMBL525191",
          "CHEMBL526133",
          "CHEMBL535",
          "CHEMBL535331",
          "CHEMBL539474",
          "CHEMBL553",
          "CHEMBL554",
          "CHEMBL558752",
          "CHEMBL560813",
          "CHEMBL562488",
          "CHEMBL564972",
          "CHEMBL565612",
          "CHEMBL572878",
          "CHEMBL572881",
          "CHEMBL573339",
          "CHEMBL574646",
          "CHEMBL574738",
          "CHEMBL576982",
          "CHEMBL578061",
          "CHEMBL583144",
          "CHEMBL590109",
          "CHEMBL590957",
          "CHEMBL592030",
          "CHEMBL593374",
          "CHEMBL593375",
          "CHEMBL593490",
          "CHEMBL593573",
          "CHEMBL593813",
          "CHEMBL594072",
          "CHEMBL594523",
          "CHEMBL594755",
          "CHEMBL594933",
          "CHEMBL595459",
          "CHEMBL595944",
          "CHEMBL596290",
          "CHEMBL596583",
          "CHEMBL596990",
          "CHEMBL596991",
          "CHEMBL597008",
          "CHEMBL597183",
          "CHEMBL597211",
          "CHEMBL597212",
          "CHEMBL597414",
          "CHEMBL597415",
          "CHEMBL597600",
          "CHEMBL597793",
          "CHEMBL597803",
          "CHEMBL597817",
          "CHEMBL597818",
          "CHEMBL597819",
          "CHEMBL598013",
          "CHEMBL598194",
          "CHEMBL598206",
          "CHEMBL598207",
          "CHEMBL598438",
          "CHEMBL598439",
          "CHEMBL598448",
          "CHEMBL598841",
          "CHEMBL598842",
          "CHEMBL599448",
          "CHEMBL599847",
          "CHEMBL599848",
          "CHEMBL599849",
          "CHEMBL600646",
          "CHEMBL601719",
          "CHEMBL602236",
          "CHEMBL603197",
          "CHEMBL603244",
          "CHEMBL603262",
          "CHEMBL603675",
          "CHEMBL603680",
          "CHEMBL603882",
          "CHEMBL604507",
          "CHEMBL604910",
          "CHEMBL604917",
          "CHEMBL605212",
          "CHEMBL605326",
          "CHEMBL605410",
          "CHEMBL606200",
          "CHEMBL606467",
          "CHEMBL607707",
          "CHEMBL608154",
          "CHEMBL7064",
          "CHEMBL91829",
          "CHEMBL939",
          "CHEMBL941",
          "CHEMBL95692"
        ],
        "number_of_missing_values": "0"
      },
      {
        "data_type": "numeric",
        "index": "1",
        "is_ignore": "false",
        "is_row_identifier": "false",
        "is_target": "false",
        "name": "FCFP4_1024b492",
        "number_of_missing_values": "0"
      },
      {
        "data_type": "numeric",
        "index": "2",
        "is_ignore": "false",
        "is_row_identifier": "false",
        "is_target": "false",
        "name": "FCFP4_1024b697",
        "number_of_missing_values": "0"
      },
      {
        "data_type": "numeric",
        "index": "3",
        "is_ignore": "false",
        "is_row_identifier": "false",
        "is_target": "false",
        "name": "FCFP4_1024b583",
        "number_of_missing_values": "0"
      },
      {
        "data_type": "numeric",
        "index": "4",
        "is_ignore": "false",
        "is_row_identifier": "false",
        "is_target": "false",
        "name": "FCFP4_1024b42",
        "number_of_missing_values": "0"
      },
      {
        "data_type": "numeric",
        "index": "5",
        "is_ignore": "false",
        "is_row_identifier": "false",
        "is_target": "false",
        "name": "FCFP4_1024b997",
        "number_of_missing_values": "0"
      },
      {
        "data_type": "numeric",
        "index": "6",
        "is_ignore": "false",
        "is_row_identifier": "false",
        "is_target": "false",
        "name": "FCFP4_1024b669",
        "number_of_missing_values": "0"
      },
      {
        "data_type": "numeric",
        "index": "7",
        "is_ignore": "false",
        "is_row_identifier": "false",
        "is_target": "false",
        "name": "FCFP4_1024b848",
        "number_of_missing_values": "0"
      },
      {
        "data_type": "numeric",
        "index": "8",
        "is_ignore": "false",
        "is_row_identifier": "false",
        "is_target": "false",
        "name": "FCFP4_1024b192",
        "number_of_missing_values": "0"
      },
      {
        "data_type": "numeric",
        "index": "9",
        "is_ignore": "false",
        "is_row_identifier": "false",
        "is_target": "false",
        "name": "FCFP4_1024b265",
        "number_of_missing_values": "0"
      },
      {
        "data_type": "numeric",
        "index": "10",
        "is_ignore": "false",
        "is_row_identifier": "false",
        "is_target": "false",
        "name": "FCFP4_1024b199",
        "number_of_missing_values": "0"
      },
      {
        "data_type": "numeric",
        "index": "11",
        "is_ignore": "false",
        "is_row_identifier": "false",
        "is_target": "false",
        "name": "FCFP4_1024b727",
        "number_of_missing_values": "0"
      },
      {
        "data_type": "numeric",
        "index": "12",
        "is_ignore": "false",
        "is_row_identifier": "false",
        "is_target": "false",
        "name": "FCFP4_1024b482",
        "number_of_missing_values": "0"
      },
      {
        "data_type": "numeric",
        "index": "13",
        "is_ignore": "false",
        "is_row_identifier": "false",
        "is_target": "false",
        "name": "FCFP4_1024b643",
        "number_of_missing_values": "0"
      },
      {
        "data_type": "numeric",
        "index": "14",
        "is_ignore": "false",
        "is_row_identifier": "false",
        "is_target": "false",
        "name": "FCFP4_1024b222",
        "number_of_missing_values": "0"
      },
      {
        "data_type": "numeric",
        "index": "15",
        "is_ignore": "false",
        "is_row_identifier": "false",
        "is_target": "false",
        "name": "FCFP4_1024b437",
        "number_of_missing_values": "0"
      },
      {
        "data_type": "numeric",
        "index": "16",
        "is_ignore": "false",
        "is_row_identifier": "false",
        "is_target": "false",
        "name": "FCFP4_1024b25",
        "number_of_missing_values": "0"
      },
      {
        "data_type": "numeric",
        "index": "17",
        "is_ignore": "false",
        "is_row_identifier": "false",
        "is_target": "false",
        "name": "FCFP4_1024b412",
        "number_of_missing_values": "0"
      },
      {
        "data_type": "numeric",
        "index": "18",
        "is_ignore": "false",
        "is_row_identifier": "false",
        "is_target": "false",
        "name": "FCFP4_1024b20",
        "number_of_missing_values": "0"
      },
      {
        "data_type": "numeric",
        "index": "19",
        "is_ignore": "false",
        "is_row_identifier": "false",
        "is_target": "false",
        "name": "FCFP4_1024b574",
        "number_of_missing_values": "0"
      },
      {
        "data_type": "numeric",
        "index": "20",
        "is_ignore": "false",
        "is_row_identifier": "false",
        "is_target": "false",
        "name": "FCFP4_1024b153",
        "number_of_missing_values": "0"
      },
      {
        "data_type": "numeric",
        "index": "21",
        "is_ignore": "false",
        "is_row_identifier": "false",
        "is_target": "false",
        "name": "FCFP4_1024b687",
        "number_of_missing_values": "0"
      },
      {
        "data_type": "numeric",
        "index": "22",
        "is_ignore": "false",
        "is_row_identifier": "false",
        "is_target": "false",
        "name": "FCFP4_1024b879",
        "number_of_missing_values": "0"
      },
      {
        "data_type": "numeric",
        "index": "23",
        "is_ignore": "false",
        "is_row_identifier": "false",
        "is_target": "false",
        "name": "FCFP4_1024b539",
        "number_of_missing_values": "0"
      },
      {
        "data_type": "numeric",
        "index": "24",
        "is_ignore": "false",
        "is_row_identifier": "false",
        "is_target": "false",
        "name": "FCFP4_1024b563",
        "number_of_missing_values": "0"
      },
      {
        "data_type": "numeric",
        "index": "25",
        "is_ignore": "false",
        "is_row_identifier": "false",
        "is_target": "false",
        "name": "FCFP4_1024b644",
        "number_of_missing_values": "0"
      },
      {
        "data_type": "numeric",
        "index": "26",
        "is_ignore": "false",
        "is_row_identifier": "false",
        "is_target": "false",
        "name": "FCFP4_1024b757",
        "number_of_missing_values": "0"
      },
      {
        "data_type": "numeric",
        "index": "27",
        "is_ignore": "false",
        "is_row_identifier": "false",
        "is_target": "false",
        "name": "FCFP4_1024b369",
        "number_of_missing_values": "0"
      },
      {
        "data_type": "numeric",
        "index": "28",
        "is_ignore": "false",
        "is_row_identifier": "false",
        "is_target": "false",
        "name": "FCFP4_1024b763",
        "number_of_missing_values": "0"
      },
      {
        "data_type": "numeric",
        "index": "29",
        "is_ignore": "false",
        "is_row_identifier": "false",
        "is_target": "false",
        "name": "FCFP4_1024b201",
        "number_of_missing_values": "0"
      },
      {
        "data_type": "numeric",
        "index": "30",
        "is_ignore": "false",
        "is_row_identifier": "false",
        "is_target": "false",
        "name": "FCFP4_1024b630",
        "number_of_missing_values": "0"
      },
      {
        "data_type": "numeric",
        "index": "31",
        "is_ignore": "false",
        "is_row_identifier": "false",
        "is_target": "false",
        "name": "FCFP4_1024b390",
        "number_of_missing_values": "0"
      },
      {
        "data_type": "numeric",
        "index": "32",
        "is_ignore": "false",
        "is_row_identifier": "false",
        "is_target": "false",
        "name": "FCFP4_1024b34",
        "number_of_missing_values": "0"
      },
      {
        "data_type": "numeric",
        "index": "33",
        "is_ignore": "false",
        "is_row_identifier": "false",
        "is_target": "false",
        "name": "FCFP4_1024b11",
        "number_of_missing_values": "0"
      },
      {
        "data_type": "numeric",
        "index": "34",
        "is_ignore": "false",
        "is_row_identifier": "false",
        "is_target": "false",
        "name": "FCFP4_1024b37",
        "number_of_missing_values": "0"
      },
      {
        "data_type": "numeric",
        "index": "35",
        "is_ignore": "false",
        "is_row_identifier": "false",
        "is_target": "false",
        "name": "FCFP4_1024b957",
        "number_of_missing_values": "0"
      },
      {
        "data_type": "numeric",
        "index": "36",
        "is_ignore": "false",
        "is_row_identifier": "false",
        "is_target": "false",
        "name": "FCFP4_1024b316",
        "number_of_missing_values": "0"
      },
      {
        "data_type": "numeric",
        "index": "37",
        "is_ignore": "false",
        "is_row_identifier": "false",
        "is_target": "false",
        "name": "FCFP4_1024b130",
        "number_of_missing_values": "0"
      },
      {
        "data_type": "numeric",
        "index": "38",
        "is_ignore": "false",
        "is_row_identifier": "false",
        "is_target": "false",
        "name": "FCFP4_1024b613",
        "number_of_missing_values": "0"
      },
      {
        "data_type": "numeric",
        "index": "39",
        "is_ignore": "false",
        "is_row_identifier": "false",
        "is_target": "false",
        "name": "FCFP4_1024b322",
        "number_of_missing_values": "0"
      },
      {
        "data_type": "numeric",
        "index": "40",
        "is_ignore": "false",
        "is_row_identifier": "false",
        "is_target": "false",
        "name": "FCFP4_1024b375",
        "number_of_missing_values": "0"
      },
      {
        "data_type": "numeric",
        "index": "41",
        "is_ignore": "false",
        "is_row_identifier": "false",
        "is_target": "false",
        "name": "FCFP4_1024b46",
        "number_of_missing_values": "0"
      },
      {
        "data_type": "numeric",
        "index": "42",
        "is_ignore": "false",
        "is_row_identifier": "false",
        "is_target": "false",
        "name": "FCFP4_1024b451",
        "number_of_missing_values": "0"
      },
      {
        "data_type": "numeric",
        "index": "43",
        "is_ignore": "false",
        "is_row_identifier": "false",
        "is_target": "false",
        "name": "FCFP4_1024b268",
        "number_of_missing_values": "0"
      },
      {
        "data_type": "numeric",
        "index": "44",
        "is_ignore": "false",
        "is_row_identifier": "false",
        "is_target": "false",
        "name": "FCFP4_1024b420",
        "number_of_missing_values": "0"
      },
      {
        "data_type": "numeric",
        "index": "45",
        "is_ignore": "false",
        "is_row_identifier": "false",
        "is_target": "false",
        "name": "FCFP4_1024b372",
        "number_of_missing_values": "0"
      },
      {
        "data_type": "numeric",
        "index": "46",
        "is_ignore": "false",
        "is_row_identifier": "false",
        "is_target": "false",
        "name": "FCFP4_1024b544",
        "number_of_missing_values": "0"
      },
      {
        "data_type": "numeric",
        "index": "47",
        "is_ignore": "false",
        "is_row_identifier": "false",
        "is_target": "false",
        "name": "FCFP4_1024b15",
        "number_of_missing_values": "0"
      },
      {
        "data_type": "numeric",
        "index": "48",
        "is_ignore": "false",
        "is_row_identifier": "false",
        "is_target": "false",
        "name": "FCFP4_1024b842",
        "number_of_missing_values": "0"
      },
      {
        "data_type": "numeric",
        "index": "49",
        "is_ignore": "false",
        "is_row_identifier": "false",
        "is_target": "false",
        "name": "FCFP4_1024b910",
        "number_of_missing_values": "0"
      },
      {
        "data_type": "numeric",
        "index": "50",
        "is_ignore": "false",
        "is_row_identifier": "false",
        "is_target": "false",
        "name": "FCFP4_1024b218",
        "number_of_missing_values": "0"
      },
      {
        "data_type": "numeric",
        "index": "51",
        "is_ignore": "false",
        "is_row_identifier": "false",
        "is_target": "false",
        "name": "FCFP4_1024b1022",
        "number_of_missing_values": "0"
      },
      {
        "data_type": "numeric",
        "index": "52",
        "is_ignore": "false",
        "is_row_identifier": "false",
        "is_target": "false",
        "name": "FCFP4_1024b532",
        "number_of_missing_values": "0"
      },
      {
        "data_type": "numeric",
        "index": "53",
        "is_ignore": "false",
        "is_row_identifier": "false",
        "is_target": "false",
        "name": "FCFP4_1024b151",
        "number_of_missing_values": "0"
      },
      {
        "data_type": "numeric",
        "index": "54",
        "is_ignore": "false",
        "is_row_identifier": "false",
        "is_target": "false",
        "name": "FCFP4_1024b345",
        "number_of_missing_values": "0"
      },
      {
        "data_type": "numeric",
        "index": "55",
        "is_ignore": "false",
        "is_row_identifier": "false",
        "is_target": "false",
        "name": "FCFP4_1024b635",
        "number_of_missing_values": "0"
      },
      {
        "data_type": "numeric",
        "index": "56",
        "is_ignore": "false",
        "is_row_identifier": "false",
        "is_target": "false",
        "name": "FCFP4_1024b1016",
        "number_of_missing_values": "0"
      },
      {
        "data_type": "numeric",
        "index": "57",
        "is_ignore": "false",
        "is_row_identifier": "false",
        "is_target": "false",
        "name": "FCFP4_1024b760",
        "number_of_missing_values": "0"
      },
      {
        "data_type": "numeric",
        "index": "58",
        "is_ignore": "false",
        "is_row_identifier": "false",
        "is_target": "false",
        "name": "FCFP4_1024b885",
        "number_of_missing_values": "0"
      },
      {
        "data_type": "numeric",
        "index": "59",
        "is_ignore": "false",
        "is_row_identifier": "false",
        "is_target": "false",
        "name": "FCFP4_1024b59",
        "number_of_missing_values": "0"
      },
      {
        "data_type": "numeric",
        "index": "60",
        "is_ignore": "false",
        "is_row_identifier": "false",
        "is_target": "false",
        "name": "FCFP4_1024b374",
        "number_of_missing_values": "0"
      },
      {
        "data_type": "numeric",
        "index": "61",
        "is_ignore": "false",
        "is_row_identifier": "false",
        "is_target": "false",
        "name": "FCFP4_1024b908",
        "number_of_missing_values": "0"
      },
      {
        "data_type": "numeric",
        "index": "62",
        "is_ignore": "false",
        "is_row_identifier": "false",
        "is_target": "false",
        "name": "FCFP4_1024b549",
        "number_of_missing_values": "0"
      },
      {
        "data_type": "numeric",
        "index": "63",
        "is_ignore": "false",
        "is_row_identifier": "false",
        "is_target": "false",
        "name": "FCFP4_1024b603",
        "number_of_missing_values": "0"
      },
      {
        "data_type": "numeric",
        "index": "64",
        "is_ignore": "false",
        "is_row_identifier": "false",
        "is_target": "false",
        "name": "FCFP4_1024b876",
        "number_of_missing_values": "0"
      },
      {
        "data_type": "numeric",
        "index": "65",
        "is_ignore": "false",
        "is_row_identifier": "false",
        "is_target": "false",
        "name": "FCFP4_1024b804",
        "number_of_missing_values": "0"
      },
      {
        "data_type": "numeric",
        "index": "66",
        "is_ignore": "false",
        "is_row_identifier": "false",
        "is_target": "false",
        "name": "FCFP4_1024b495",
        "number_of_missing_values": "0"
      },
      {
        "data_type": "numeric",
        "index": "67",
        "is_ignore": "false",
        "is_row_identifier": "false",
        "is_target": "false",
        "name": "FCFP4_1024b164",
        "number_of_missing_values": "0"
      },
      {
        "data_type": "numeric",
        "index": "68",
        "is_ignore": "false",
        "is_row_identifier": "false",
        "is_target": "false",
        "name": "FCFP4_1024b102",
        "number_of_missing_values": "0"
      },
      {
        "data_type": "numeric",
        "index": "69",
        "is_ignore": "false",
        "is_row_identifier": "false",
        "is_target": "false",
        "name": "FCFP4_1024b970",
        "number_of_missing_values": "0"
      },
      {
        "data_type": "numeric",
        "index": "70",
        "is_ignore": "false",
        "is_row_identifier": "false",
        "is_target": "false",
        "name": "FCFP4_1024b455",
        "number_of_missing_values": "0"
      },
      {
        "data_type": "numeric",
        "index": "71",
        "is_ignore": "false",
        "is_row_identifier": "false",
        "is_target": "false",
        "name": "FCFP4_1024b952",
        "number_of_missing_values": "0"
      },
      {
        "data_type": "numeric",
        "index": "72",
        "is_ignore": "false",
        "is_row_identifier": "false",
        "is_target": "false",
        "name": "FCFP4_1024b330",
        "number_of_missing_values": "0"
      },
      {
        "data_type": "numeric",
        "index": "73",
        "is_ignore": "false",
        "is_row_identifier": "false",
        "is_target": "false",
        "name": "FCFP4_1024b773",
        "number_of_missing_values": "0"
      },
      {
        "data_type": "numeric",
        "index": "74",
        "is_ignore": "false",
        "is_row_identifier": "false",
        "is_target": "false",
        "name": "FCFP4_1024b667",
        "number_of_missing_values": "0"
      },
      {
        "data_type": "numeric",
        "index": "75",
        "is_ignore": "false",
        "is_row_identifier": "false",
        "is_target": "false",
        "name": "FCFP4_1024b332",
        "number_of_missing_values": "0"
      },
      {
        "data_type": "numeric",
        "index": "76",
        "is_ignore": "false",
        "is_row_identifier": "false",
        "is_target": "false",
        "name": "FCFP4_1024b10",
        "number_of_missing_values": "0"
      },
      {
        "data_type": "numeric",
        "index": "77",
        "is_ignore": "false",
        "is_row_identifier": "false",
        "is_target": "false",
        "name": "FCFP4_1024b639",
        "number_of_missing_values": "0"
      },
      {
        "data_type": "numeric",
        "index": "78",
        "is_ignore": "false",
        "is_row_identifier": "false",
        "is_target": "false",
        "name": "FCFP4_1024b768",
        "number_of_missing_values": "0"
      },
      {
        "data_type": "numeric",
        "index": "79",
        "is_ignore": "false",
        "is_row_identifier": "false",
        "is_target": "false",
        "name": "FCFP4_1024b573",
        "number_of_missing_values": "0"
      },
      {
        "data_type": "numeric",
        "index": "80",
        "is_ignore": "false",
        "is_row_identifier": "false",
        "is_target": "false",
        "name": "FCFP4_1024b70",
        "number_of_missing_values": "0"
      },
      {
        "data_type": "numeric",
        "index": "81",
        "is_ignore": "false",
        "is_row_identifier": "false",
        "is_target": "false",
        "name": "FCFP4_1024b676",
        "number_of_missing_values": "0"
      },
      {
        "data_type": "numeric",
        "index": "82",
        "is_ignore": "false",
        "is_row_identifier": "false",
        "is_target": "false",
        "name": "FCFP4_1024b206",
        "number_of_missing_values": "0"
      },
      {
        "data_type": "numeric",
        "index": "83",
        "is_ignore": "false",
        "is_row_identifier": "false",
        "is_target": "false",
        "name": "FCFP4_1024b220",
        "number_of_missing_values": "0"
      },
      {
        "data_type": "numeric",
        "index": "84",
        "is_ignore": "false",
        "is_row_identifier": "false",
        "is_target": "false",
        "name": "FCFP4_1024b133",
        "number_of_missing_values": "0"
      },
      {
        "data_type": "numeric",
        "index": "85",
        "is_ignore": "false",
        "is_row_identifier": "false",
        "is_target": "false",
        "name": "FCFP4_1024b78",
        "number_of_missing_values": "0"
      },
      {
        "data_type": "numeric",
        "index": "86",
        "is_ignore": "false",
        "is_row_identifier": "false",
        "is_target": "false",
        "name": "FCFP4_1024b248",
        "number_of_missing_values": "0"
      },
      {
        "data_type": "numeric",
        "index": "87",
        "is_ignore": "false",
        "is_row_identifier": "false",
        "is_target": "false",
        "name": "FCFP4_1024b58",
        "number_of_missing_values": "0"
      },
      {
        "data_type": "numeric",
        "index": "88",
        "is_ignore": "false",
        "is_row_identifier": "false",
        "is_target": "false",
        "name": "FCFP4_1024b407",
        "number_of_missing_values": "0"
      },
      {
        "data_type": "numeric",
        "index": "89",
        "is_ignore": "false",
        "is_row_identifier": "false",
        "is_target": "false",
        "name": "FCFP4_1024b54",
        "number_of_missing_values": "0"
      },
      {
        "data_type": "numeric",
        "index": "90",
        "is_ignore": "false",
        "is_row_identifier": "false",
        "is_target": "false",
        "name": "FCFP4_1024b453",
        "number_of_missing_values": "0"
      },
      {
        "data_type": "numeric",
        "index": "91",
        "is_ignore": "false",
        "is_row_identifier": "false",
        "is_target": "false",
        "name": "FCFP4_1024b400",
        "number_of_missing_values": "0"
      },
      {
        "data_type": "numeric",
        "index": "92",
        "is_ignore": "false",
        "is_row_identifier": "false",
        "is_target": "false",
        "name": "FCFP4_1024b714",
        "number_of_missing_values": "0"
      },
      {
        "data_type": "numeric",
        "index": "93",
        "is_ignore": "false",
        "is_row_identifier": "false",
        "is_target": "false",
        "name": "FCFP4_1024b860",
        "number_of_missing_values": "0"
      },
      {
        "data_type": "numeric",
        "index": "94",
        "is_ignore": "false",
        "is_row_identifier": "false",
        "is_target": "false",
        "name": "FCFP4_1024b297",
        "number_of_missing_values": "0"
      },
      {
        "data_type": "numeric",
        "index": "95",
        "is_ignore": "false",
        "is_row_identifier": "false",
        "is_target": "false",
        "name": "FCFP4_1024b685",
        "number_of_missing_values": "0"
      },
      {
        "data_type": "numeric",
        "index": "96",
        "is_ignore": "false",
        "is_row_identifier": "false",
        "is_target": "false",
        "name": "FCFP4_1024b731",
        "number_of_missing_values": "0"
      },
      {
        "data_type": "numeric",
        "index": "97",
        "is_ignore": "false",
        "is_row_identifier": "false",
        "is_target": "false",
        "name": "FCFP4_1024b461",
        "number_of_missing_values": "0"
      },
      {
        "data_type": "numeric",
        "index": "98",
        "is_ignore": "false",
        "is_row_identifier": "false",
        "is_target": "false",
        "name": "FCFP4_1024b349",
        "number_of_missing_values": "0"
      },
      {
        "data_type": "numeric",
        "index": "99",
        "is_ignore": "false",
        "is_row_identifier": "false",
        "is_target": "false",
        "name": "FCFP4_1024b576",
        "number_of_missing_values": "0"
      },
      {
        "data_type": "numeric",
        "index": "100",
        "is_ignore": "false",
        "is_row_identifier": "false",
        "is_target": "false",
        "name": "FCFP4_1024b425",
        "number_of_missing_values": "0"
      },
      {
        "data_type": "numeric",
        "index": "101",
        "is_ignore": "false",
        "is_row_identifier": "false",
        "is_target": "false",
        "name": "FCFP4_1024b87",
        "number_of_missing_values": "0"
      },
      {
        "data_type": "numeric",
        "index": "102",
        "is_ignore": "false",
        "is_row_identifier": "false",
        "is_target": "false",
        "name": "FCFP4_1024b793",
        "number_of_missing_values": "0"
      },
      {
        "data_type": "numeric",
        "index": "103",
        "is_ignore": "false",
        "is_row_identifier": "false",
        "is_target": "false",
        "name": "FCFP4_1024b728",
        "number_of_missing_values": "0"
      },
      {
        "data_type": "numeric",
        "index": "104",
        "is_ignore": "false",
        "is_row_identifier": "false",
        "is_target": "false",
        "name": "FCFP4_1024b525",
        "number_of_missing_values": "0"
      },
      {
        "data_type": "numeric",
        "index": "105",
        "is_ignore": "false",
        "is_row_identifier": "false",
        "is_target": "false",
        "name": "FCFP4_1024b194",
        "number_of_missing_values": "0"
      },
      {
        "data_type": "numeric",
        "index": "106",
        "is_ignore": "false",
        "is_row_identifier": "false",
        "is_target": "false",
        "name": "FCFP4_1024b2",
        "number_of_missing_values": "0"
      },
      {
        "data_type": "numeric",
        "index": "107",
        "is_ignore": "false",
        "is_row_identifier": "false",
        "is_target": "false",
        "name": "FCFP4_1024b502",
        "number_of_missing_values": "0"
      },
      {
        "data_type": "numeric",
        "index": "108",
        "is_ignore": "false",
        "is_row_identifier": "false",
        "is_target": "false",
        "name": "FCFP4_1024b627",
        "number_of_missing_values": "0"
      },
      {
        "data_type": "numeric",
        "index": "109",
        "is_ignore": "false",
        "is_row_identifier": "false",
        "is_target": "false",
        "name": "FCFP4_1024b33",
        "number_of_missing_values": "0"
      },
      {
        "data_type": "numeric",
        "index": "110",
        "is_ignore": "false",
        "is_row_identifier": "false",
        "is_target": "false",
        "name": "FCFP4_1024b787",
        "number_of_missing_values": "0"
      },
      {
        "data_type": "numeric",
        "index": "111",
        "is_ignore": "false",
        "is_row_identifier": "false",
        "is_target": "false",
        "name": "FCFP4_1024b320",
        "number_of_missing_values": "0"
      },
      {
        "data_type": "numeric",
        "index": "112",
        "is_ignore": "false",
        "is_row_identifier": "false",
        "is_target": "false",
        "name": "FCFP4_1024b65",
        "number_of_missing_values": "0"
      },
      {
        "data_type": "numeric",
        "index": "113",
        "is_ignore": "false",
        "is_row_identifier": "false",
        "is_target": "false",
        "name": "FCFP4_1024b622",
        "number_of_missing_values": "0"
      },
      {
        "data_type": "numeric",
        "index": "114",
        "is_ignore": "false",
        "is_row_identifier": "false",
        "is_target": "false",
        "name": "FCFP4_1024b239",
        "number_of_missing_values": "0"
      },
      {
        "data_type": "numeric",
        "index": "115",
        "is_ignore": "false",
        "is_row_identifier": "false",
        "is_target": "false",
        "name": "FCFP4_1024b623",
        "number_of_missing_values": "0"
      },
      {
        "data_type": "numeric",
        "index": "116",
        "is_ignore": "false",
        "is_row_identifier": "false",
        "is_target": "false",
        "name": "FCFP4_1024b689",
        "number_of_missing_values": "0"
      },
      {
        "data_type": "numeric",
        "index": "117",
        "is_ignore": "false",
        "is_row_identifier": "false",
        "is_target": "false",
        "name": "FCFP4_1024b858",
        "number_of_missing_values": "0"
      },
      {
        "data_type": "numeric",
        "index": "118",
        "is_ignore": "false",
        "is_row_identifier": "false",
        "is_target": "false",
        "name": "FCFP4_1024b472",
        "number_of_missing_values": "0"
      },
      {
        "data_type": "numeric",
        "index": "119",
        "is_ignore": "false",
        "is_row_identifier": "false",
        "is_target": "false",
        "name": "FCFP4_1024b391",
        "number_of_missing_values": "0"
      },
      {
        "data_type": "numeric",
        "index": "120",
        "is_ignore": "false",
        "is_row_identifier": "false",
        "is_target": "false",
        "name": "FCFP4_1024b723",
        "number_of_missing_values": "0"
      },
      {
        "data_type": "numeric",
        "index": "121",
        "is_ignore": "false",
        "is_row_identifier": "false",
        "is_target": "false",
        "name": "FCFP4_1024b589",
        "number_of_missing_values": "0"
      },
      {
        "data_type": "numeric",
        "index": "122",
        "is_ignore": "false",
        "is_row_identifier": "false",
        "is_target": "false",
        "name": "FCFP4_1024b604",
        "number_of_missing_values": "0"
      },
      {
        "data_type": "numeric",
        "index": "123",
        "is_ignore": "false",
        "is_row_identifier": "false",
        "is_target": "false",
        "name": "FCFP4_1024b317",
        "number_of_missing_values": "0"
      },
      {
        "data_type": "numeric",
        "index": "124",
        "is_ignore": "false",
        "is_row_identifier": "false",
        "is_target": "false",
        "name": "FCFP4_1024b1",
        "number_of_missing_values": "0"
      },
      {
        "data_type": "numeric",
        "index": "125",
        "is_ignore": "false",
        "is_row_identifier": "false",
        "is_target": "false",
        "name": "FCFP4_1024b100",
        "number_of_missing_values": "0"
      },
      {
        "data_type": "numeric",
        "index": "126",
        "is_ignore": "false",
        "is_row_identifier": "false",
        "is_target": "false",
        "name": "FCFP4_1024b1000",
        "number_of_missing_values": "0"
      },
      {
        "data_type": "numeric",
        "index": "127",
        "is_ignore": "false",
        "is_row_identifier": "false",
        "is_target": "false",
        "name": "FCFP4_1024b1001",
        "number_of_missing_values": "0"
      },
      {
        "data_type": "numeric",
        "index": "128",
        "is_ignore": "false",
        "is_row_identifier": "false",
        "is_target": "false",
        "name": "FCFP4_1024b1002",
        "number_of_missing_values": "0"
      },
      {
        "data_type": "numeric",
        "index": "129",
        "is_ignore": "false",
        "is_row_identifier": "false",
        "is_target": "false",
        "name": "FCFP4_1024b1003",
        "number_of_missing_values": "0"
      },
      {
        "data_type": "numeric",
        "index": "130",
        "is_ignore": "false",
        "is_row_identifier": "false",
        "is_target": "false",
        "name": "FCFP4_1024b1004",
        "number_of_missing_values": "0"
      },
      {
        "data_type": "numeric",
        "index": "131",
        "is_ignore": "false",
        "is_row_identifier": "false",
        "is_target": "false",
        "name": "FCFP4_1024b1005",
        "number_of_missing_values": "0"
      },
      {
        "data_type": "numeric",
        "index": "132",
        "is_ignore": "false",
        "is_row_identifier": "false",
        "is_target": "false",
        "name": "FCFP4_1024b1006",
        "number_of_missing_values": "0"
      },
      {
        "data_type": "numeric",
        "index": "133",
        "is_ignore": "false",
        "is_row_identifier": "false",
        "is_target": "false",
        "name": "FCFP4_1024b1007",
        "number_of_missing_values": "0"
      },
      {
        "data_type": "numeric",
        "index": "134",
        "is_ignore": "false",
        "is_row_identifier": "false",
        "is_target": "false",
        "name": "FCFP4_1024b1008",
        "number_of_missing_values": "0"
      },
      {
        "data_type": "numeric",
        "index": "135",
        "is_ignore": "false",
        "is_row_identifier": "false",
        "is_target": "false",
        "name": "FCFP4_1024b1009",
        "number_of_missing_values": "0"
      },
      {
        "data_type": "numeric",
        "index": "136",
        "is_ignore": "false",
        "is_row_identifier": "false",
        "is_target": "false",
        "name": "FCFP4_1024b101",
        "number_of_missing_values": "0"
      },
      {
        "data_type": "numeric",
        "index": "137",
        "is_ignore": "false",
        "is_row_identifier": "false",
        "is_target": "false",
        "name": "FCFP4_1024b1010",
        "number_of_missing_values": "0"
      },
      {
        "data_type": "numeric",
        "index": "138",
        "is_ignore": "false",
        "is_row_identifier": "false",
        "is_target": "false",
        "name": "FCFP4_1024b1011",
        "number_of_missing_values": "0"
      },
      {
        "data_type": "numeric",
        "index": "139",
        "is_ignore": "false",
        "is_row_identifier": "false",
        "is_target": "false",
        "name": "FCFP4_1024b1012",
        "number_of_missing_values": "0"
      },
      {
        "data_type": "numeric",
        "index": "140",
        "is_ignore": "false",
        "is_row_identifier": "false",
        "is_target": "false",
        "name": "FCFP4_1024b1013",
        "number_of_missing_values": "0"
      },
      {
        "data_type": "numeric",
        "index": "141",
        "is_ignore": "false",
        "is_row_identifier": "false",
        "is_target": "false",
        "name": "FCFP4_1024b1014",
        "number_of_missing_values": "0"
      },
      {
        "data_type": "numeric",
        "index": "142",
        "is_ignore": "false",
        "is_row_identifier": "false",
        "is_target": "false",
        "name": "FCFP4_1024b1015",
        "number_of_missing_values": "0"
      },
      {
        "data_type": "numeric",
        "index": "143",
        "is_ignore": "false",
        "is_row_identifier": "false",
        "is_target": "false",
        "name": "FCFP4_1024b1017",
        "number_of_missing_values": "0"
      },
      {
        "data_type": "numeric",
        "index": "144",
        "is_ignore": "false",
        "is_row_identifier": "false",
        "is_target": "false",
        "name": "FCFP4_1024b1018",
        "number_of_missing_values": "0"
      },
      {
        "data_type": "numeric",
        "index": "145",
        "is_ignore": "false",
        "is_row_identifier": "false",
        "is_target": "false",
        "name": "FCFP4_1024b1019",
        "number_of_missing_values": "0"
      },
      {
        "data_type": "numeric",
        "index": "146",
        "is_ignore": "false",
        "is_row_identifier": "false",
        "is_target": "false",
        "name": "FCFP4_1024b1020",
        "number_of_missing_values": "0"
      },
      {
        "data_type": "numeric",
        "index": "147",
        "is_ignore": "false",
        "is_row_identifier": "false",
        "is_target": "false",
        "name": "FCFP4_1024b1021",
        "number_of_missing_values": "0"
      },
      {
        "data_type": "numeric",
        "index": "148",
        "is_ignore": "false",
        "is_row_identifier": "false",
        "is_target": "false",
        "name": "FCFP4_1024b1023",
        "number_of_missing_values": "0"
      },
      {
        "data_type": "numeric",
        "index": "149",
        "is_ignore": "false",
        "is_row_identifier": "false",
        "is_target": "false",
        "name": "FCFP4_1024b1024",
        "number_of_missing_values": "0"
      },
      {
        "data_type": "numeric",
        "index": "150",
        "is_ignore": "false",
        "is_row_identifier": "false",
        "is_target": "false",
        "name": "FCFP4_1024b103",
        "number_of_missing_values": "0"
      },
      {
        "data_type": "numeric",
        "index": "151",
        "is_ignore": "false",
        "is_row_identifier": "false",
        "is_target": "false",
        "name": "FCFP4_1024b104",
        "number_of_missing_values": "0"
      },
      {
        "data_type": "numeric",
        "index": "152",
        "is_ignore": "false",
        "is_row_identifier": "false",
        "is_target": "false",
        "name": "FCFP4_1024b105",
        "number_of_missing_values": "0"
      },
      {
        "data_type": "numeric",
        "index": "153",
        "is_ignore": "false",
        "is_row_identifier": "false",
        "is_target": "false",
        "name": "FCFP4_1024b106",
        "number_of_missing_values": "0"
      },
      {
        "data_type": "numeric",
        "index": "154",
        "is_ignore": "false",
        "is_row_identifier": "false",
        "is_target": "false",
        "name": "FCFP4_1024b107",
        "number_of_missing_values": "0"
      },
      {
        "data_type": "numeric",
        "index": "155",
        "is_ignore": "false",
        "is_row_identifier": "false",
        "is_target": "true",
        "name": "pXC50",
        "number_of_missing_values": "0"
      }
    ]
  }
}