{
  "data_features": {
    "feature": [
      {
        "data_type": "nominal",
        "index": "0",
        "is_ignore": "false",
        "is_row_identifier": "true",
        "is_target": "false",
        "name": "molecule_id",
        "nominal_value": [
          "CHEMBL1169657",
          "CHEMBL1170610",
          "CHEMBL1171112",
          "CHEMBL1171506",
          "CHEMBL164506",
          "CHEMBL165636",
          "CHEMBL166127",
          "CHEMBL166337",
          "CHEMBL166381",
          "CHEMBL166829",
          "CHEMBL166955",
          "CHEMBL167482",
          "CHEMBL167633",
          "CHEMBL167833",
          "CHEMBL168267",
          "CHEMBL168268",
          "CHEMBL168365",
          "CHEMBL168390",
          "CHEMBL168477",
          "CHEMBL168717",
          "CHEMBL168730",
          "CHEMBL168757",
          "CHEMBL168849",
          "CHEMBL169039",
          "CHEMBL169319",
          "CHEMBL169341",
          "CHEMBL169405",
          "CHEMBL169423",
          "CHEMBL169461",
          "CHEMBL169681",
          "CHEMBL169810",
          "CHEMBL169958",
          "CHEMBL169959",
          "CHEMBL169963",
          "CHEMBL170222",
          "CHEMBL170271",
          "CHEMBL170667",
          "CHEMBL170733",
          "CHEMBL171029",
          "CHEMBL171041",
          "CHEMBL171084",
          "CHEMBL171107",
          "CHEMBL171142",
          "CHEMBL171313",
          "CHEMBL171478",
          "CHEMBL171479",
          "CHEMBL171591",
          "CHEMBL171661",
          "CHEMBL171713",
          "CHEMBL171731",
          "CHEMBL172210",
          "CHEMBL172217",
          "CHEMBL172291",
          "CHEMBL172388",
          "CHEMBL172616",
          "CHEMBL172623",
          "CHEMBL172634",
          "CHEMBL1738933",
          "CHEMBL1738934",
          "CHEMBL193610",
          "CHEMBL199448",
          "CHEMBL199461",
          "CHEMBL199806",
          "CHEMBL199982",
          "CHEMBL201143",
          "CHEMBL203476",
          "CHEMBL2181034",
          "CHEMBL2181035",
          "CHEMBL243303",
          "CHEMBL24948",
          "CHEMBL255143",
          "CHEMBL255586",
          "CHEMBL256269",
          "CHEMBL256279",
          "CHEMBL256700",
          "CHEMBL256878",
          "CHEMBL256879",
          "CHEMBL257286",
          "CHEMBL257927",
          "CHEMBL257930",
          "CHEMBL258079",
          "CHEMBL258080",
          "CHEMBL269821",
          "CHEMBL270142",
          "CHEMBL270356",
          "CHEMBL270596",
          "CHEMBL270813",
          "CHEMBL271674",
          "CHEMBL271696",
          "CHEMBL271859",
          "CHEMBL273177",
          "CHEMBL281156",
          "CHEMBL310555",
          "CHEMBL327579",
          "CHEMBL352049",
          "CHEMBL352369",
          "CHEMBL352764",
          "CHEMBL352844",
          "CHEMBL352943",
          "CHEMBL353100",
          "CHEMBL353170",
          "CHEMBL353506",
          "CHEMBL353805",
          "CHEMBL354202",
          "CHEMBL354522",
          "CHEMBL354728",
          "CHEMBL354739",
          "CHEMBL355223",
          "CHEMBL355427",
          "CHEMBL355472",
          "CHEMBL355657",
          "CHEMBL370580",
          "CHEMBL370581",
          "CHEMBL370771",
          "CHEMBL371481",
          "CHEMBL371544",
          "CHEMBL371956",
          "CHEMBL372564",
          "CHEMBL377198",
          "CHEMBL380979",
          "CHEMBL381945",
          "CHEMBL402183",
          "CHEMBL402646",
          "CHEMBL403366",
          "CHEMBL403400",
          "CHEMBL404233",
          "CHEMBL404480",
          "CHEMBL404693",
          "CHEMBL408042",
          "CHEMBL408043",
          "CHEMBL434491",
          "CHEMBL439416",
          "CHEMBL440746",
          "CHEMBL441227",
          "CHEMBL539894",
          "CHEMBL625",
          "CHEMBL72683",
          "CHEMBL89671"
        ],
        "number_of_missing_values": "0"
      },
      {
        "data_type": "numeric",
        "index": "1",
        "is_ignore": "false",
        "is_row_identifier": "false",
        "is_target": "false",
        "name": "nAB",
        "number_of_missing_values": "0"
      },
      {
        "data_type": "numeric",
        "index": "2",
        "is_ignore": "false",
        "is_row_identifier": "false",
        "is_target": "false",
        "name": "nBM",
        "number_of_missing_values": "0"
      },
      {
        "data_type": "numeric",
        "index": "3",
        "is_ignore": "false",
        "is_row_identifier": "false",
        "is_target": "true",
        "name": "pXC50",
        "number_of_missing_values": "0"
      }
    ]
  }
}