"molecule_id","AMW","Mi","pXC50"
{1 9.692,2 1.134,3 3.633}
{0 CHEMBL127,1 7.52,2 1.138,3 4.81}
{0 CHEMBL1436,1 9.432,2 1.135,3 4.252}
{0 CHEMBL148,1 8.092,2 1.139,3 4.733}
{0 CHEMBL174,1 8.127,2 1.13,3 3.706}
{0 CHEMBL186,1 8.45,2 1.137,3 2.728}
{0 CHEMBL284104,1 9.831,2 1.127,3 4.319}
{0 CHEMBL29,1 8.157,2 1.124,3 2.948}
{0 CHEMBL415879,1 8.192,2 1.102,3 4.159}
{0 CHEMBL44354,1 9.127,2 1.13,3 3.293}
{0 CHEMBL617,1 9.44,2 1.119,3 4.119}
{0 CHEMBL702,1 8.216,2 1.134,3 3.137}
