{
  "data_features": {
    "feature": [
      {
        "data_type": "nominal",
        "index": "0",
        "is_ignore": "false",
        "is_row_identifier": "true",
        "is_target": "false",
        "name": "molecule_id",
        "nominal_value": [
          "CHEMBL104",
          "CHEMBL104290",
          "CHEMBL104620",
          "CHEMBL104631",
          "CHEMBL104767",
          "CHEMBL104843",
          "CHEMBL104967",
          "CHEMBL104978",
          "CHEMBL105029",
          "CHEMBL105908",
          "CHEMBL106163",
          "CHEMBL106358",
          "CHEMBL106521",
          "CHEMBL10971",
          "CHEMBL109738",
          "CHEMBL112481",
          "CHEMBL116072",
          "CHEMBL116935",
          "CHEMBL117413",
          "CHEMBL118105",
          "CHEMBL124466",
          "CHEMBL131155",
          "CHEMBL139760",
          "CHEMBL140483",
          "CHEMBL140919",
          "CHEMBL140924",
          "CHEMBL141336",
          "CHEMBL141432",
          "CHEMBL141818",
          "CHEMBL141825",
          "CHEMBL142268",
          "CHEMBL142354",
          "CHEMBL142433",
          "CHEMBL142786",
          "CHEMBL142903",
          "CHEMBL143037",
          "CHEMBL143040",
          "CHEMBL143242",
          "CHEMBL143272",
          "CHEMBL143740",
          "CHEMBL143914",
          "CHEMBL155760",
          "CHEMBL155851",
          "CHEMBL155873",
          "CHEMBL155975",
          "CHEMBL156461",
          "CHEMBL157078",
          "CHEMBL160148",
          "CHEMBL160218",
          "CHEMBL160290",
          "CHEMBL160571",
          "CHEMBL160692",
          "CHEMBL160839",
          "CHEMBL1628522",
          "CHEMBL1628662",
          "CHEMBL1793831",
          "CHEMBL19640",
          "CHEMBL19721",
          "CHEMBL19747",
          "CHEMBL19801",
          "CHEMBL19917",
          "CHEMBL19947",
          "CHEMBL19991",
          "CHEMBL20003",
          "CHEMBL20019",
          "CHEMBL20033",
          "CHEMBL20141",
          "CHEMBL20163",
          "CHEMBL20178",
          "CHEMBL20194",
          "CHEMBL20195",
          "CHEMBL20196",
          "CHEMBL20208",
          "CHEMBL20267",
          "CHEMBL20293",
          "CHEMBL20323",
          "CHEMBL20325",
          "CHEMBL20343",
          "CHEMBL20344",
          "CHEMBL20359",
          "CHEMBL20418",
          "CHEMBL20577",
          "CHEMBL20591",
          "CHEMBL20644",
          "CHEMBL20690",
          "CHEMBL20691",
          "CHEMBL20701",
          "CHEMBL20808",
          "CHEMBL20877",
          "CHEMBL20914",
          "CHEMBL20927",
          "CHEMBL21026",
          "CHEMBL210514",
          "CHEMBL2113720",
          "CHEMBL2113721",
          "CHEMBL2113722",
          "CHEMBL2113723",
          "CHEMBL2113724",
          "CHEMBL2113725",
          "CHEMBL2113726",
          "CHEMBL2113727",
          "CHEMBL2113730",
          "CHEMBL2113731",
          "CHEMBL2113732",
          "CHEMBL2113733",
          "CHEMBL21224",
          "CHEMBL2304166",
          "CHEMBL2304167",
          "CHEMBL2304168",
          "CHEMBL274420",
          "CHEMBL277029",
          "CHEMBL277245",
          "CHEMBL277246",
          "CHEMBL277618",
          "CHEMBL277650",
          "CHEMBL277678",
          "CHEMBL277701",
          "CHEMBL278072",
          "CHEMBL278635",
          "CHEMBL279021",
          "CHEMBL279084",
          "CHEMBL279234",
          "CHEMBL279476",
          "CHEMBL279664",
          "CHEMBL279665",
          "CHEMBL279893",
          "CHEMBL280164",
          "CHEMBL280207",
          "CHEMBL280210",
          "CHEMBL280401",
          "CHEMBL280683",
          "CHEMBL281139",
          "CHEMBL281779",
          "CHEMBL281780",
          "CHEMBL282495",
          "CHEMBL282666",
          "CHEMBL282883",
          "CHEMBL282905",
          "CHEMBL283113",
          "CHEMBL283152",
          "CHEMBL283162",
          "CHEMBL283339",
          "CHEMBL283365",
          "CHEMBL283525",
          "CHEMBL283790",
          "CHEMBL284078",
          "CHEMBL284079",
          "CHEMBL284276",
          "CHEMBL284280",
          "CHEMBL284773",
          "CHEMBL285035",
          "CHEMBL285067",
          "CHEMBL285199",
          "CHEMBL285926",
          "CHEMBL286197",
          "CHEMBL286217",
          "CHEMBL286229",
          "CHEMBL286337",
          "CHEMBL286557",
          "CHEMBL286677",
          "CHEMBL286696",
          "CHEMBL286762",
          "CHEMBL287004",
          "CHEMBL287380",
          "CHEMBL287465",
          "CHEMBL287821",
          "CHEMBL288098",
          "CHEMBL288329",
          "CHEMBL288849",
          "CHEMBL289406",
          "CHEMBL289463",
          "CHEMBL29067",
          "CHEMBL290840",
          "CHEMBL291082",
          "CHEMBL291293",
          "CHEMBL291332",
          "CHEMBL293362",
          "CHEMBL293773",
          "CHEMBL294387",
          "CHEMBL294706",
          "CHEMBL295212",
          "CHEMBL296149",
          "CHEMBL296169",
          "CHEMBL296600",
          "CHEMBL297624",
          "CHEMBL297734",
          "CHEMBL299760",
          "CHEMBL299773",
          "CHEMBL299780",
          "CHEMBL299856",
          "CHEMBL299944",
          "CHEMBL300251",
          "CHEMBL300299",
          "CHEMBL300338",
          "CHEMBL300463",
          "CHEMBL300644",
          "CHEMBL300742",
          "CHEMBL301215",
          "CHEMBL301388",
          "CHEMBL301797",
          "CHEMBL309194",
          "CHEMBL309310",
          "CHEMBL310238",
          "CHEMBL310425",
          "CHEMBL310866",
          "CHEMBL311227",
          "CHEMBL312130",
          "CHEMBL312225",
          "CHEMBL312268",
          "CHEMBL312567",
          "CHEMBL312650",
          "CHEMBL317090",
          "CHEMBL317579",
          "CHEMBL317911",
          "CHEMBL318391",
          "CHEMBL319384",
          "CHEMBL319568",
          "CHEMBL319839",
          "CHEMBL319921",
          "CHEMBL320241",
          "CHEMBL320577",
          "CHEMBL320609",
          "CHEMBL320835",
          "CHEMBL320871",
          "CHEMBL32110",
          "CHEMBL322029",
          "CHEMBL322832",
          "CHEMBL32303",
          "CHEMBL32327",
          "CHEMBL32389",
          "CHEMBL32475",
          "CHEMBL32479",
          "CHEMBL325491",
          "CHEMBL325909",
          "CHEMBL32767",
          "CHEMBL328833",
          "CHEMBL32932",
          "CHEMBL32942",
          "CHEMBL33139",
          "CHEMBL331603",
          "CHEMBL33217",
          "CHEMBL334115",
          "CHEMBL334127",
          "CHEMBL334318",
          "CHEMBL33857",
          "CHEMBL33972",
          "CHEMBL34063",
          "CHEMBL341584",
          "CHEMBL34182",
          "CHEMBL342455",
          "CHEMBL342747",
          "CHEMBL34361",
          "CHEMBL34431",
          "CHEMBL34461",
          "CHEMBL344942",
          "CHEMBL34548",
          "CHEMBL345902",
          "CHEMBL34612",
          "CHEMBL346538",
          "CHEMBL34669",
          "CHEMBL347382",
          "CHEMBL34796",
          "CHEMBL348609",
          "CHEMBL349811",
          "CHEMBL35181",
          "CHEMBL35776",
          "CHEMBL358332",
          "CHEMBL36154",
          "CHEMBL36269",
          "CHEMBL36494",
          "CHEMBL36733",
          "CHEMBL369194",
          "CHEMBL369225",
          "CHEMBL37116",
          "CHEMBL37357",
          "CHEMBL37358",
          "CHEMBL37364",
          "CHEMBL37547",
          "CHEMBL37602",
          "CHEMBL37603",
          "CHEMBL37686",
          "CHEMBL37735",
          "CHEMBL37770",
          "CHEMBL37792",
          "CHEMBL37809",
          "CHEMBL37929",
          "CHEMBL37951",
          "CHEMBL37952",
          "CHEMBL407427",
          "CHEMBL412441",
          "CHEMBL415940",
          "CHEMBL415953",
          "CHEMBL416120",
          "CHEMBL416124",
          "CHEMBL416232",
          "CHEMBL416480",
          "CHEMBL417275",
          "CHEMBL417781",
          "CHEMBL418141",
          "CHEMBL418370",
          "CHEMBL418556",
          "CHEMBL418608",
          "CHEMBL419471",
          "CHEMBL419472",
          "CHEMBL420208",
          "CHEMBL420943",
          "CHEMBL429066",
          "CHEMBL430333",
          "CHEMBL430919",
          "CHEMBL430969",
          "CHEMBL431400",
          "CHEMBL431744",
          "CHEMBL431923",
          "CHEMBL432324",
          "CHEMBL432393",
          "CHEMBL432850",
          "CHEMBL434090",
          "CHEMBL435756",
          "CHEMBL440149",
          "CHEMBL442259",
          "CHEMBL446140",
          "CHEMBL449395",
          "CHEMBL50050",
          "CHEMBL50244",
          "CHEMBL50250",
          "CHEMBL505",
          "CHEMBL51170",
          "CHEMBL51238",
          "CHEMBL514432",
          "CHEMBL51692",
          "CHEMBL51696",
          "CHEMBL51760",
          "CHEMBL51855",
          "CHEMBL51867",
          "CHEMBL52031",
          "CHEMBL52297",
          "CHEMBL52526",
          "CHEMBL52577",
          "CHEMBL52615",
          "CHEMBL52616",
          "CHEMBL52636",
          "CHEMBL52693",
          "CHEMBL52821",
          "CHEMBL52834",
          "CHEMBL52924",
          "CHEMBL52925",
          "CHEMBL52933",
          "CHEMBL52966",
          "CHEMBL52970",
          "CHEMBL52971",
          "CHEMBL53001",
          "CHEMBL53014",
          "CHEMBL53019",
          "CHEMBL53029",
          "CHEMBL53149",
          "CHEMBL53372",
          "CHEMBL53482",
          "CHEMBL53527",
          "CHEMBL53534",
          "CHEMBL53584",
          "CHEMBL53585",
          "CHEMBL53750",
          "CHEMBL53804",
          "CHEMBL53808",
          "CHEMBL53867",
          "CHEMBL54029",
          "CHEMBL54041",
          "CHEMBL54046",
          "CHEMBL54068",
          "CHEMBL54095",
          "CHEMBL54106",
          "CHEMBL54163",
          "CHEMBL54417",
          "CHEMBL54482",
          "CHEMBL54709",
          "CHEMBL54935",
          "CHEMBL55123",
          "CHEMBL55156",
          "CHEMBL56418",
          "CHEMBL56434",
          "CHEMBL56588",
          "CHEMBL56742",
          "CHEMBL56932",
          "CHEMBL57072",
          "CHEMBL57480",
          "CHEMBL57489",
          "CHEMBL57510",
          "CHEMBL57676",
          "CHEMBL57716",
          "CHEMBL57736",
          "CHEMBL57825",
          "CHEMBL58518",
          "CHEMBL59051",
          "CHEMBL60625",
          "CHEMBL60764",
          "CHEMBL60930",
          "CHEMBL76778",
          "CHEMBL78137",
          "CHEMBL78310",
          "CHEMBL78545",
          "CHEMBL78624",
          "CHEMBL78642",
          "CHEMBL78668",
          "CHEMBL79089",
          "CHEMBL80130",
          "CHEMBL80165",
          "CHEMBL80179",
          "CHEMBL80443",
          "CHEMBL80505",
          "CHEMBL80647",
          "CHEMBL80774",
          "CHEMBL80963",
          "CHEMBL81384",
          "CHEMBL81715",
          "CHEMBL91397",
          "CHEMBL946",
          "CHEMBL95720",
          "CHEMBL95765",
          "CHEMBL97120",
          "CHEMBL97176",
          "CHEMBL97530",
          "CHEMBL97630",
          "CHEMBL98401",
          "CHEMBL99294",
          "CHEMBL998",
          "CHEMBL99924"
        ],
        "number_of_missing_values": "0"
      },
      {
        "data_type": "numeric",
        "index": "1",
        "is_ignore": "false",
        "is_row_identifier": "false",
        "is_target": "false",
        "name": "Sv",
        "number_of_missing_values": "0"
      },
      {
        "data_type": "numeric",
        "index": "2",
        "is_ignore": "false",
        "is_row_identifier": "false",
        "is_target": "false",
        "name": "nSK",
        "number_of_missing_values": "0"
      },
      {
        "data_type": "numeric",
        "index": "3",
        "is_ignore": "false",
        "is_row_identifier": "false",
        "is_target": "false",
        "name": "nBM",
        "number_of_missing_values": "0"
      },
      {
        "data_type": "numeric",
        "index": "4",
        "is_ignore": "false",
        "is_row_identifier": "false",
        "is_target": "false",
        "name": "Se",
        "number_of_missing_values": "0"
      },
      {
        "data_type": "numeric",
        "index": "5",
        "is_ignore": "false",
        "is_row_identifier": "false",
        "is_target": "false",
        "name": "nC",
        "number_of_missing_values": "0"
      },
      {
        "data_type": "numeric",
        "index": "6",
        "is_ignore": "false",
        "is_row_identifier": "false",
        "is_target": "false",
        "name": "nBT",
        "number_of_missing_values": "0"
      },
      {
        "data_type": "numeric",
        "index": "7",
        "is_ignore": "false",
        "is_row_identifier": "false",
        "is_target": "false",
        "name": "Si",
        "number_of_missing_values": "0"
      },
      {
        "data_type": "numeric",
        "index": "8",
        "is_ignore": "false",
        "is_row_identifier": "false",
        "is_target": "false",
        "name": "nAT",
        "number_of_missing_values": "0"
      },
      {
        "data_type": "numeric",
        "index": "9",
        "is_ignore": "false",
        "is_row_identifier": "false",
        "is_target": "false",
        "name": "nAB",
        "number_of_missing_values": "0"
      },
      {
        "data_type": "numeric",
        "index": "10",
        "is_ignore": "false",
        "is_row_identifier": "false",
        "is_target": "false",
        "name": "MW",
        "number_of_missing_values": "0"
      },
      {
        "data_type": "numeric",
        "index": "11",
        "is_ignore": "false",
        "is_row_identifier": "false",
        "is_target": "false",
        "name": "Sp",
        "number_of_missing_values": "0"
      },
      {
        "data_type": "numeric",
        "index": "12",
        "is_ignore": "false",
        "is_row_identifier": "false",
        "is_target": "false",
        "name": "SCBO",
        "number_of_missing_values": "0"
      },
      {
        "data_type": "numeric",
        "index": "13",
        "is_ignore": "false",
        "is_row_identifier": "false",
        "is_target": "false",
        "name": "nBO",
        "number_of_missing_values": "0"
      },
      {
        "data_type": "numeric",
        "index": "14",
        "is_ignore": "false",
        "is_row_identifier": "false",
        "is_target": "false",
        "name": "nS",
        "number_of_missing_values": "0"
      },
      {
        "data_type": "numeric",
        "index": "15",
        "is_ignore": "false",
        "is_row_identifier": "false",
        "is_target": "false",
        "name": "nCsp2",
        "number_of_missing_values": "0"
      },
      {
        "data_type": "numeric",
        "index": "16",
        "is_ignore": "false",
        "is_row_identifier": "false",
        "is_target": "true",
        "name": "pXC50",
        "number_of_missing_values": "0"
      }
    ]
  }
}