"molecule_id","AMW","C.","pXC50"
{1 6.149,2 37.2,3 7.38}
{0 CHEMBL339911,1 5.727,2 36.5,3 7.81}
{0 CHEMBL443643,1 6.82,2 37.7,3 7.357}
{0 CHEMBL452307,1 7.196,2 40.7,3 8.33}
{0 CHEMBL470094,1 8.03,2 43.5,3 7.446}
{0 CHEMBL471142,1 7.723,2 44.6,3 5.69}
{0 CHEMBL471153,1 8.046,2 41.5,3 8.638}
{0 CHEMBL471316,1 8.03,2 43.5,3 7.092}
{0 CHEMBL471317,1 8.046,2 41.5,3 8.027}
{0 CHEMBL472001,1 8.046,2 41.5,3 8.276}
{0 CHEMBL472002,1 8.046,2 41.5,3 8.409}
{0 CHEMBL472006,1 8.03,2 43.5,3 5.26}
{0 CHEMBL472007,1 6.82,2 37.7,3 9.143}
{0 CHEMBL472171,1 8.046,2 41.5,3 8.097}
{0 CHEMBL472174,1 8.046,2 41.5,3 7.842}
{0 CHEMBL472183,1 7.723,2 44.6,3 6.863}
{0 CHEMBL472351,1 7.723,2 44.6,3 5.851}
{0 CHEMBL472521,1 7.492,2 43.1,3 8.432}
{0 CHEMBL472522,1 6.82,2 37.7,3 8.796}
{0 CHEMBL472523,1 6.82,2 37.7,3 7.86}
{0 CHEMBL486457,1 8.03,2 43.5,3 5.437}
{0 CHEMBL487473,1 8.067,2 46.2,3 8.086}
{0 CHEMBL487483,1 7.649,2 42,3 7.623}
{0 CHEMBL487484,1 7.649,2 42,3 7.229}
{0 CHEMBL487822,1 8.03,2 43.5,3 7.266}
{0 CHEMBL488506,1 7.649,2 42,3 5.706}
{0 CHEMBL488509,1 8.067,2 46.2,3 7.759}
{0 CHEMBL488667,1 6.591,2 38.8,3 9.155}
{0 CHEMBL488668,1 8.437,2 42.9,3 8.174}
{0 CHEMBL488670,1 7.649,2 42,3 7.268}
{0 CHEMBL488671,1 7.649,2 42,3 5.627}
{0 CHEMBL488674,1 7.805,2 44.4,3 8.481}
{0 CHEMBL488675,1 8.046,2 41.5,3 8.42}
{0 CHEMBL488707,1 6.975,2 40.7,3 7.492}
{0 CHEMBL488871,1 6.975,2 40.7,3 8.337}
{0 CHEMBL488872,1 6.975,2 40.7,3 9.284}
{0 CHEMBL511472,1 7.723,2 44.6,3 7.959}
{0 CHEMBL511820,1 8.046,2 41.5,3 8.745}
{0 CHEMBL511847,1 6.82,2 37.7,3 6.174}
{0 CHEMBL512538,1 6.82,2 37.7,3 7.081}
{0 CHEMBL513069,1 8.046,2 41.5,3 7.785}
{0 CHEMBL513379,1 8.03,2 43.5,3 5.607}
{0 CHEMBL519398,1 9.114,2 42.6,3 8.654}
{0 CHEMBL519741,1 6.78,2 39.3,3 9.745}
{0 CHEMBL528323,1 8.067,2 46.2,3 6.042}
{0 CHEMBL529000,1 6.975,2 40.7,3 8.77}
{0 CHEMBL530110,1 6.602,2 37.3,3 9.699}
{0 CHEMBL530337,1 8.067,2 46.2,3 5.857}
