"molecule_id","FCFP4_1024b985","FCFP4_1024b280","FCFP4_1024b173","FCFP4_1024b669","FCFP4_1024b650","FCFP4_1024b614","FCFP4_1024b4","FCFP4_1024b443","FCFP4_1024b64","FCFP4_1024b680","FCFP4_1024b116","FCFP4_1024b231","FCFP4_1024b376","FCFP4_1024b632","FCFP4_1024b264","FCFP4_1024b668","FCFP4_1024b65","FCFP4_1024b891","FCFP4_1024b363","FCFP4_1024b504","FCFP4_1024b731","FCFP4_1024b915","FCFP4_1024b633","FCFP4_1024b804","FCFP4_1024b86","FCFP4_1024b88","FCFP4_1024b453","FCFP4_1024b1","FCFP4_1024b10","FCFP4_1024b100","FCFP4_1024b1000","FCFP4_1024b1001","FCFP4_1024b1002","FCFP4_1024b1003","FCFP4_1024b1004","FCFP4_1024b1005","FCFP4_1024b1006","FCFP4_1024b1007","FCFP4_1024b1008","FCFP4_1024b1009","FCFP4_1024b101","FCFP4_1024b1010","FCFP4_1024b1011","FCFP4_1024b1012","FCFP4_1024b1013","FCFP4_1024b1014","FCFP4_1024b1015","FCFP4_1024b1016","FCFP4_1024b1017","FCFP4_1024b1018","FCFP4_1024b1019","FCFP4_1024b102","FCFP4_1024b1020","FCFP4_1024b1021","FCFP4_1024b1022","FCFP4_1024b1023","FCFP4_1024b1024","FCFP4_1024b103","FCFP4_1024b104","FCFP4_1024b105","FCFP4_1024b106","FCFP4_1024b107","FCFP4_1024b108","FCFP4_1024b109","FCFP4_1024b11","FCFP4_1024b110","FCFP4_1024b111","FCFP4_1024b112","FCFP4_1024b113","FCFP4_1024b114","FCFP4_1024b115","FCFP4_1024b117","FCFP4_1024b118","FCFP4_1024b119","FCFP4_1024b12","FCFP4_1024b120","FCFP4_1024b121","FCFP4_1024b122","FCFP4_1024b123","FCFP4_1024b124","FCFP4_1024b125","FCFP4_1024b126","FCFP4_1024b127","FCFP4_1024b128","FCFP4_1024b129","FCFP4_1024b13","FCFP4_1024b130","FCFP4_1024b131","FCFP4_1024b132","FCFP4_1024b133","FCFP4_1024b134","FCFP4_1024b135","FCFP4_1024b136","FCFP4_1024b137","FCFP4_1024b138","FCFP4_1024b139","FCFP4_1024b14","FCFP4_1024b140","FCFP4_1024b141","FCFP4_1024b142","FCFP4_1024b143","FCFP4_1024b144","FCFP4_1024b145","FCFP4_1024b146","FCFP4_1024b147","FCFP4_1024b148","FCFP4_1024b149","FCFP4_1024b15","FCFP4_1024b150","FCFP4_1024b151","FCFP4_1024b152","FCFP4_1024b153","FCFP4_1024b154","FCFP4_1024b155","FCFP4_1024b156","FCFP4_1024b157","FCFP4_1024b158","FCFP4_1024b159","FCFP4_1024b16","FCFP4_1024b160","FCFP4_1024b161","FCFP4_1024b162","FCFP4_1024b163","FCFP4_1024b164","FCFP4_1024b165","FCFP4_1024b166","FCFP4_1024b167","FCFP4_1024b168","FCFP4_1024b169","FCFP4_1024b17","FCFP4_1024b170","FCFP4_1024b171","FCFP4_1024b172","FCFP4_1024b174","FCFP4_1024b175","FCFP4_1024b176","FCFP4_1024b177","FCFP4_1024b178","FCFP4_1024b179","FCFP4_1024b18","FCFP4_1024b180","FCFP4_1024b181","FCFP4_1024b182","FCFP4_1024b183","FCFP4_1024b184","FCFP4_1024b185","FCFP4_1024b186","FCFP4_1024b187","FCFP4_1024b188","FCFP4_1024b189","FCFP4_1024b19","FCFP4_1024b190","FCFP4_1024b191","FCFP4_1024b192","FCFP4_1024b193","FCFP4_1024b194","FCFP4_1024b195","FCFP4_1024b196","FCFP4_1024b197","FCFP4_1024b198","FCFP4_1024b199","FCFP4_1024b2","FCFP4_1024b20","FCFP4_1024b200","FCFP4_1024b201","FCFP4_1024b202","FCFP4_1024b203","FCFP4_1024b204","FCFP4_1024b205","FCFP4_1024b206","FCFP4_1024b207","FCFP4_1024b208","FCFP4_1024b209","FCFP4_1024b21","FCFP4_1024b210","FCFP4_1024b211","FCFP4_1024b212","FCFP4_1024b213","FCFP4_1024b214","FCFP4_1024b215","FCFP4_1024b216","FCFP4_1024b217","FCFP4_1024b218","FCFP4_1024b219","FCFP4_1024b22","FCFP4_1024b220","FCFP4_1024b221","FCFP4_1024b222","FCFP4_1024b223","FCFP4_1024b224","FCFP4_1024b225","FCFP4_1024b226","FCFP4_1024b227","FCFP4_1024b228","FCFP4_1024b229","FCFP4_1024b23","FCFP4_1024b230","FCFP4_1024b232","FCFP4_1024b233","FCFP4_1024b234","FCFP4_1024b235","FCFP4_1024b236","FCFP4_1024b237","FCFP4_1024b238","FCFP4_1024b239","pXC50"
{14 1,20 1,21 1,24 1,28 1,33 1,42 1,43 1,65 1,66 1,130 1,131 1,140 1,154 1,162 1,184 1,201 1,206 5}
{0 CHEMBL102004,2 1,3 1,4 1,13 1,16 1,17 1,24 1,28 1,32 1,51 1,73 1,75 1,130 1,131 1,162 1,179 1,206 7.721}
{0 CHEMBL1075682,1 1,2 1,3 1,4 1,5 1,6 1,8 1,9 1,11 1,12 1,13 1,14 1,16 1,17 1,20 1,21 1,25 1,26 1,28 1,130 1,131 1,140 1,162 1,206 7.509}
{0 CHEMBL1075683,1 1,2 1,3 1,4 1,5 1,6 1,8 1,9 1,11 1,12 1,13 1,14 1,16 1,17 1,20 1,21 1,25 1,26 1,28 1,130 1,131 1,140 1,162 1,206 8.046}
{0 CHEMBL1075894,1 1,2 1,3 1,4 1,5 1,6 1,8 1,9 1,11 1,12 1,13 1,14 1,16 1,17 1,20 1,21 1,25 1,26 1,28 1,112 1,130 1,131 1,140 1,162 1,170 1,201 1,206 8.301}
{0 CHEMBL1076162,1 1,2 1,3 1,4 1,5 1,6 1,8 1,9 1,11 1,12 1,13 1,14 1,16 1,17 1,20 1,21 1,23 1,28 1,130 1,131 1,140 1,162 1,206 7.538}
{0 CHEMBL1076163,1 1,2 1,3 1,4 1,5 1,6 1,8 1,9 1,11 1,12 1,13 1,14 1,16 1,17 1,20 1,21 1,28 1,130 1,131 1,140 1,162 1,206 7.143}
{0 CHEMBL1079505,1 1,2 1,3 1,4 1,5 1,6 1,8 1,9 1,11 1,12 1,13 1,14 1,16 1,17 1,20 1,21 1,23 1,25 1,26 1,28 1,112 1,130 1,131 1,140 1,162 1,201 1,206 7.886}
{0 CHEMBL1079752,1 1,2 1,3 1,4 1,5 1,6 1,8 1,9 1,11 1,12 1,13 1,14 1,16 1,17 1,20 1,21 1,28 1,130 1,131 1,140 1,162 1,201 1,206 7.523}
{0 CHEMBL1079983,1 1,2 1,3 1,4 1,5 1,6 1,8 1,9 1,11 1,12 1,13 1,14 1,16 1,17 1,20 1,21 1,25 1,26 1,28 1,112 1,130 1,131 1,140 1,162 1,201 1,206 7.046}
{0 CHEMBL1080109,1 1,2 1,3 1,4 1,5 1,6 1,8 1,9 1,11 1,12 1,13 1,14 1,16 1,17 1,20 1,21 1,24 1,28 1,130 1,131 1,140 1,162 1,201 1,206 7.523}
{0 CHEMBL1080172,1 1,2 1,3 1,4 1,5 1,6 1,8 1,9 1,11 1,12 1,13 1,14 1,16 1,17 1,20 1,21 1,23 1,25 1,26 1,28 1,130 1,131 1,140 1,162 1,201 1,206 8}
{0 CHEMBL1080349,1 1,2 1,3 1,4 1,5 1,6 1,8 1,9 1,11 1,12 1,13 1,14 1,16 1,17 1,20 1,21 1,23 1,25 1,26 1,28 1,130 1,131 1,140 1,162 1,206 7.585}
{0 CHEMBL1080368,1 1,2 1,3 1,4 1,5 1,6 1,8 1,9 1,11 1,12 1,13 1,14 1,16 1,17 1,20 1,21 1,23 1,25 1,26 1,28 1,130 1,131 1,140 1,162 1,206 8.046}
{0 CHEMBL1080699,1 1,2 1,3 1,4 1,5 1,6 1,8 1,9 1,11 1,12 1,13 1,14 1,16 1,17 1,20 1,21 1,23 1,25 1,26 1,28 1,112 1,130 1,131 1,140 1,162 1,201 1,206 8.155}
{0 CHEMBL1080822,1 1,2 1,3 1,4 1,5 1,6 1,8 1,9 1,11 1,12 1,13 1,14 1,16 1,17 1,20 1,21 1,23 1,25 1,26 1,28 1,130 1,131 1,140 1,162 1,206 7.337}
{0 CHEMBL1080823,1 1,2 1,3 1,4 1,5 1,6 1,8 1,9 1,11 1,12 1,13 1,14 1,16 1,17 1,20 1,21 1,23 1,24 1,28 1,130 1,131 1,140 1,162 1,206 7.77}
{0 CHEMBL1081546,1 1,2 1,3 1,4 1,5 1,6 1,8 1,9 1,11 1,12 1,13 1,14 1,16 1,17 1,20 1,21 1,23 1,24 1,28 1,75 1,130 1,131 1,140 1,162 1,206 7.699}
{0 CHEMBL1082118,1 1,2 1,3 1,4 1,5 1,6 1,8 1,9 1,11 1,12 1,13 1,14 1,16 1,17 1,20 1,21 1,25 1,26 1,28 1,112 1,130 1,131 1,140 1,162 1,201 1,206 7.013}
{0 CHEMBL1085795,7 1,13 1,16 1,17 1,24 1,27 1,28 1,29 1,51 1,62 1,73 1,94 1,111 1,130 1,131 1,140 1,162 1,179 1,206 5.699}
{0 CHEMBL1169827,1 1,4 1,6 1,8 1,12 1,13 1,16 1,17 1,24 1,28 1,51 1,75 1,125 1,130 1,131 1,140 1,162 1,201 1,203 1,206 8.638}
{0 CHEMBL124079,1 1,4 1,7 1,13 1,16 1,17 1,24 1,27 1,28 1,34 1,62 1,73 1,95 1,96 1,130 1,131 1,140 1,162 1,179 1,206 5.854}
{0 CHEMBL124842,1 1,4 1,7 1,13 1,16 1,17 1,24 1,27 1,28 1,62 1,73 1,96 1,130 1,131 1,140 1,162 1,179 1,206 5.495}
{0 CHEMBL125230,4 1,7 1,13 1,16 1,17 1,24 1,27 1,28 1,62 1,73 1,96 1,124 1,130 1,131 1,140 1,162 1,179 1,206 4.638}
{0 CHEMBL1257776,24 1,28 1,96 1,130 1,131 1,140 1,162 1,163 1,206 4.708}
{0 CHEMBL1257895,24 1,28 1,96 1,130 1,131 1,140 1,162 1,163 1,206 4.469}
{0 CHEMBL1258004,24 1,28 1,96 1,130 1,131 1,140 1,162 1,163 1,206 5.046}
{0 CHEMBL153057,1 1,4 1,6 1,8 1,13 1,15 1,16 1,17 1,24 1,28 1,76 1,130 1,131 1,162 1,206 5.42}
{0 CHEMBL1934476,2 1,4 1,7 1,10 1,13 1,17 1,18 1,24 1,28 1,42 1,96 1,125 1,130 1,131 1,140 1,162 1,188 1,201 1,206 5.18}
{0 CHEMBL1998001,13 1,17 1,24 1,28 1,29 1,130 1,131 1,162 1,206 6.301}
{0 CHEMBL202118,6 1,7 1,10 1,13 1,15 1,16 1,17 1,19 1,22 1,24 1,28 1,51 1,75 1,84 1,92 1,130 1,131 1,162 1,206 6.886}
{0 CHEMBL2030543,13 1,17 1,24 1,28 1,29 1,31 1,96 1,130 1,131 1,162 1,206 6.745}
{0 CHEMBL2030550,4 1,13 1,17 1,24 1,28 1,29 1,31 1,96 1,130 1,131 1,143 1,162 1,206 7.57}
{0 CHEMBL2113263,1 1,2 1,4 1,6 1,13 1,16 1,17 1,24 1,28 1,33 1,125 1,130 1,131 1,140 1,162 1,190 1,201 1,206 8.066}
{0 CHEMBL21241,4 1,7 1,13 1,16 1,17 1,24 1,28 1,73 1,124 1,130 1,131 1,140 1,162 1,179 1,206 5.538}
{0 CHEMBL219586,7 1,10 1,13 1,15 1,16 1,17 1,18 1,19 1,22 1,24 1,28 1,73 1,75 1,125 1,130 1,131 1,140 1,162 1,179 1,201 1,206 5.77}
{0 CHEMBL221044,1 1,2 1,4 1,6 1,13 1,16 1,17 1,24 1,28 1,51 1,130 1,131 1,162 1,190 1,206 7.796}
{0 CHEMBL222880,1 1,4 1,8 1,13 1,16 1,17 1,24 1,28 1,96 1,130 1,131 1,162 1,173 1,206 6.523}
{0 CHEMBL239352,1 1,2 1,4 1,13 1,16 1,17 1,24 1,28 1,112 1,130 1,131 1,140 1,162 1,188 1,190 1,201 1,206 6.432}
{0 CHEMBL239353,1 1,2 1,4 1,13 1,16 1,17 1,24 1,27 1,28 1,112 1,130 1,131 1,140 1,162 1,188 1,190 1,201 1,206 6.215}
{0 CHEMBL241063,1 1,2 1,4 1,13 1,16 1,17 1,24 1,28 1,112 1,125 1,130 1,131 1,140 1,162 1,190 1,201 1,206 5.857}
{0 CHEMBL24458,6 1,7 1,10 1,13 1,15 1,17 1,19 1,22 1,24 1,28 1,51 1,53 1,75 1,84 1,111 1,120 1,130 1,131 1,148 1,162 1,206 5.143}
{0 CHEMBL252675,7 1,10 1,15 1,19 1,22 1,24 1,27 1,28 1,62 1,96 1,130 1,131 1,162 1,206 5}
{0 CHEMBL253109,7 1,10 1,15 1,18 1,19 1,22 1,24 1,27 1,28 1,62 1,75 1,125 1,130 1,131 1,140 1,162 1,201 1,206 5}
{0 CHEMBL253310,7 1,10 1,15 1,18 1,19 1,22 1,24 1,27 1,28 1,62 1,75 1,125 1,130 1,131 1,140 1,162 1,201 1,206 6.523}
{0 CHEMBL253520,7 1,10 1,15 1,18 1,19 1,22 1,24 1,28 1,75 1,125 1,130 1,131 1,140 1,162 1,201 1,206 5}
{0 CHEMBL254540,3 1,5 1,7 1,10 1,11 1,13 1,15 1,17 1,18 1,19 1,21 1,22 1,24 1,28 1,75 1,77 1,121 1,125 1,130 1,131 1,140 1,162 1,163 1,201 1,206 5}
{0 CHEMBL254742,7 1,10 1,15 1,16 1,18 1,19 1,22 1,24 1,28 1,75 1,125 1,130 1,131 1,140 1,162 1,201 1,206 5}
{0 CHEMBL254743,7 1,10 1,13 1,15 1,17 1,18 1,19 1,22 1,24 1,28 1,73 1,75 1,111 1,125 1,130 1,131 1,140 1,162 1,201 1,206 5}
{0 CHEMBL254744,7 1,10 1,15 1,18 1,19 1,22 1,24 1,27 1,28 1,62 1,75 1,125 1,130 1,131 1,140 1,162 1,201 1,206 5}
{0 CHEMBL254946,7 1,10 1,15 1,18 1,19 1,22 1,24 1,27 1,28 1,62 1,75 1,125 1,130 1,131 1,140 1,162 1,201 1,206 5}
{0 CHEMBL278590,1 1,4 1,7 1,13 1,16 1,17 1,24 1,27 1,28 1,62 1,73 1,96 1,130 1,131 1,140 1,162 1,179 1,206 5.642}
{0 CHEMBL278994,1 1,4 1,6 1,13 1,14 1,16 1,17 1,24 1,28 1,130 1,131 1,140 1,162 1,201 1,206 7.638}
{0 CHEMBL340011,4 1,7 1,13 1,16 1,17 1,24 1,27 1,28 1,62 1,73 1,96 1,130 1,131 1,140 1,162 1,179 1,206 5.26}
{0 CHEMBL375812,1 1,2 1,4 1,13 1,16 1,17 1,24 1,28 1,125 1,130 1,131 1,140 1,162 1,190 1,201 1,206 7.076}
{0 CHEMBL38508,1 1,2 1,3 1,4 1,5 1,6 1,8 1,12 1,13 1,16 1,17 1,24 1,28 1,75 1,125 1,130 1,131 1,140 1,162 1,173 1,201 1,206 7.523}
{0 CHEMBL38943,1 1,2 1,3 1,4 1,5 1,6 1,8 1,12 1,13 1,16 1,17 1,24 1,28 1,75 1,125 1,130 1,131 1,140 1,162 1,201 1,206 7.268}
{0 CHEMBL402100,7 1,10 1,15 1,18 1,19 1,22 1,24 1,27 1,28 1,62 1,75 1,111 1,125 1,130 1,131 1,140 1,162 1,201 1,206 5}
{0 CHEMBL404467,7 1,10 1,15 1,18 1,19 1,22 1,24 1,27 1,28 1,62 1,75 1,125 1,130 1,131 1,140 1,162 1,201 1,206 5}
{0 CHEMBL427890,7 1,10 1,15 1,18 1,19 1,22 1,24 1,27 1,28 1,62 1,75 1,125 1,130 1,131 1,140 1,162 1,184 1,201 1,206 5}
{0 CHEMBL435278,1 1,4 1,7 1,13 1,16 1,17 1,24 1,27 1,28 1,62 1,73 1,96 1,130 1,131 1,162 1,179 1,206 6.387}
{0 CHEMBL455157,6 1,7 1,10 1,12 1,13 1,15 1,16 1,17 1,18 1,19 1,22 1,24 1,27 1,28 1,51 1,73 1,99 1,129 1,130 1,131 1,140 1,162 1,179 1,206 5.149}
{0 CHEMBL460278,6 1,7 1,10 1,12 1,13 1,15 1,16 1,17 1,18 1,19 1,22 1,24 1,28 1,30 1,51 1,73 1,129 1,130 1,131 1,140 1,162 1,179 1,206 4.602}
{0 CHEMBL472399,6 1,7 1,10 1,12 1,13 1,15 1,16 1,17 1,18 1,19 1,22 1,24 1,28 1,51 1,73 1,99 1,129 1,130 1,131 1,140 1,162 1,179 1,206 4.602}
{0 CHEMBL482593,24 1,28 1,96 1,130 1,131 1,140 1,162 1,163 1,206 4.658}
{0 CHEMBL516964,6 1,7 1,10 1,12 1,13 1,15 1,16 1,17 1,18 1,19 1,22 1,24 1,28 1,30 1,51 1,73 1,115 1,129 1,130 1,131 1,140 1,162 1,179 1,206 4.602}
{0 CHEMBL518348,6 1,7 1,10 1,12 1,13 1,15 1,16 1,17 1,18 1,19 1,22 1,24 1,28 1,30 1,51 1,73 1,99 1,129 1,130 1,131 1,140 1,162 1,179 1,206 4.602}
{0 CHEMBL592652,7 1,13 1,27 1,28 1,62 1,84 1,94 1,105 1,130 1,131 1,140 1,162 1,206 6.523}
{0 CHEMBL601678,7 1,10 1,14 1,20 1,21 1,24 1,28 1,42 1,43 1,66 1,130 1,131 1,140 1,154 1,162 1,183 1,206 5}
{0 CHEMBL602468,7 1,10 1,14 1,20 1,24 1,28 1,42 1,90 1,130 1,131 1,140 1,154 1,162 1,175 1,183 1,201 1,206 5}
