{
  "data_set_description": {
    "collection_date": "November 2013",
    "creator": "Dr Jeremy Besnard, Dr Ivan Olier, Dr Noureddin Sadawi, Dr Larisa Soldatova, Dr Crina Grosan, Prof Ross King, Dr Richard Bickerton, Prof Andrew Hopkins and Dr Willem van Hoorn",
    "default_target_attribute": "pXC50",
    "description": "This dataset contains QSAR data (from ChEMBL version 17) showing activity values (unit is pseudo-pCI50) of several compounds on drug target ChEMBL_ID: CHEMBL4472 (TID: 10407), and it has 176 rows and 43 features (not including molecule IDs and class feature: molecule_id and pXC50). The features represent Basic Molecular Descriptors which were generated from SMILES strings.  Missing value imputation was applied to this dataset (By choosing the Median).",
    "description_version": "1",
    "file_id": "3683574",
    "format": "ARFF",
    "id": "39783",
    "licence": "Public",
    "md5_checksum": "0666772ef18111e8f9850eb959c439a5",
    "minio_url": "https://data.openml.org/datasets/0003/39783/dataset_39783.pq",
    "name": "QSAR-DATASET-FOR-DRUG-TARGET-CHEMBL4472",
    "original_data_url": "https://www.ebi.ac.uk/chembl/target/inspect/CHEMBL4472",
    "parquet_url": "https://data.openml.org/datasets/0003/39783/dataset_39783.pq",
    "processing_date": "2018-10-04 06:43:05",
    "row_id_attribute": "molecule_id",
    "status": "deactivated",
    "tag": [
      "MetaQSAR",
      "study_13"
    ],
    "upload_date": "2016-07-16T09:11:35",
    "url": "https://api.openml.org/data/v1/download/3683574/QSAR-DATASET-FOR-DRUG-TARGET-CHEMBL4472.arff",
    "version": "12",
    "visibility": "public"
  }
}