{
  "data_features": {
    "feature": [
      {
        "data_type": "nominal",
        "index": "0",
        "is_ignore": "false",
        "is_row_identifier": "true",
        "is_target": "false",
        "name": "molecule_id",
        "nominal_value": [
          "CHEMBL1214684",
          "CHEMBL175434",
          "CHEMBL2178826",
          "CHEMBL2178828",
          "CHEMBL2178829",
          "CHEMBL2178830",
          "CHEMBL2178832",
          "CHEMBL2178833",
          "CHEMBL2178837",
          "CHEMBL2178838",
          "CHEMBL2178841",
          "CHEMBL2178843",
          "CHEMBL2178845",
          "CHEMBL2178846",
          "CHEMBL2178847",
          "CHEMBL2178848",
          "CHEMBL2178849",
          "CHEMBL2178850",
          "CHEMBL2178851",
          "CHEMBL2178852",
          "CHEMBL2178853",
          "CHEMBL2178855",
          "CHEMBL2178856",
          "CHEMBL2178857",
          "CHEMBL2178858",
          "CHEMBL2178861",
          "CHEMBL2178862",
          "CHEMBL2178863",
          "CHEMBL2178867"
        ],
        "number_of_missing_values": "0"
      },
      {
        "data_type": "numeric",
        "index": "1",
        "is_ignore": "false",
        "is_row_identifier": "false",
        "is_target": "false",
        "name": "AMW",
        "number_of_missing_values": "0"
      },
      {
        "data_type": "numeric",
        "index": "2",
        "is_ignore": "false",
        "is_row_identifier": "false",
        "is_target": "false",
        "name": "C.",
        "number_of_missing_values": "0"
      },
      {
        "data_type": "numeric",
        "index": "3",
        "is_ignore": "false",
        "is_row_identifier": "false",
        "is_target": "false",
        "name": "H.",
        "number_of_missing_values": "0"
      },
      {
        "data_type": "numeric",
        "index": "4",
        "is_ignore": "false",
        "is_row_identifier": "false",
        "is_target": "false",
        "name": "Me",
        "number_of_missing_values": "0"
      },
      {
        "data_type": "numeric",
        "index": "5",
        "is_ignore": "false",
        "is_row_identifier": "false",
        "is_target": "false",
        "name": "Mi",
        "number_of_missing_values": "0"
      },
      {
        "data_type": "numeric",
        "index": "6",
        "is_ignore": "false",
        "is_row_identifier": "false",
        "is_target": "false",
        "name": "Mp",
        "number_of_missing_values": "0"
      },
      {
        "data_type": "numeric",
        "index": "7",
        "is_ignore": "false",
        "is_row_identifier": "false",
        "is_target": "true",
        "name": "pXC50",
        "number_of_missing_values": "0"
      }
    ]
  }
}