"molecule_id","AMW","C.","H.","Me","Mi","Mp","pXC50"
{1 6.862,2 41.2,3 50,4 1,5 1.122,6 0.642,7 5}
{0 CHEMBL175434,1 9.382,2 45.7,3 34.3,4 1.029,5 1.109,6 0.722,7 4.004}
{0 CHEMBL2178826,1 9.064,2 41.7,3 36.1,4 1.053,5 1.154,6 0.653,7 5.066}
{0 CHEMBL2178828,1 9.521,2 41.7,3 36.1,4 1.048,5 1.143,6 0.679,7 4.81}
{0 CHEMBL2178829,1 8.535,2 42.1,3 39.5,4 1.039,5 1.151,6 0.653,7 4.544}
{0 CHEMBL2178830,1 7.952,2 48.6,3 40,4 1.005,5 1.112,6 0.7,7 4.714}
{0 CHEMBL2178832,1 7.565,2 41.7,3 44.4,4 1.01,5 1.126,6 0.658,7 4.363}
{0 CHEMBL2178833,1 7.343,2 41,3 46.2,4 1.007,5 1.127,6 0.653,7 4.64}
{0 CHEMBL2178837,1 8.215,2 50,3 38.2,4 1.011,5 1.106,6 0.704,7 5.161}
{0 CHEMBL2178838,1 8.215,2 50,3 38.2,4 1.011,5 1.106,6 0.704,7 4.17}
{0 CHEMBL2178841,1 7.684,2 47.5,3 42.5,4 1.004,5 1.111,6 0.687,7 4.243}
{0 CHEMBL2178843,1 8.48,2 52.9,3 35.3,4 1.008,5 1.103,6 0.727,7 6.432}
{0 CHEMBL2178845,1 7.152,2 40.5,3 47.6,4 1.003,5 1.128,6 0.648,7 5.252}
{0 CHEMBL2178846,1 8.226,2 41,3 43.6,4 1.015,5 1.125,6 0.675,7 5.585}
{0 CHEMBL2178847,1 7.152,2 40.5,3 47.6,4 1.003,5 1.128,6 0.648,7 5.161}
{0 CHEMBL2178848,1 6.987,2 40,3 48.9,4 1,5 1.128,6 0.644,7 5.143}
{0 CHEMBL2178849,1 6.987,2 40,3 48.9,4 1,5 1.128,6 0.644,7 5.921}
{0 CHEMBL2178850,1 7.574,2 43.6,3 43.6,4 1.004,5 1.124,6 0.673,7 4.947}
{0 CHEMBL2178851,1 7.152,2 40.5,3 47.6,4 1.003,5 1.128,6 0.648,7 7.367}
{0 CHEMBL2178852,1 7.694,2 47.4,3 42.1,4 1.001,5 1.114,6 0.691,7 5.26}
{0 CHEMBL2178853,1 7.952,2 48.6,3 40,4 1.005,5 1.112,6 0.7,7 4.03}
{0 CHEMBL2178855,1 8.21,2 51.4,3 37.1,4 1.001,5 1.108,6 0.722,7 5.796}
{0 CHEMBL2178856,1 7.704,2 50,3 41.7,4 0.998,5 1.106,6 0.701,7 7.409}
{0 CHEMBL2178857,1 7.471,2 48.7,3 43.6,4 0.996,5 1.109,6 0.692,7 5.114}
{0 CHEMBL2178858,1 8.215,2 50,3 38.2,4 1.011,5 1.106,6 0.704,7 5.523}
{0 CHEMBL2178861,1 7.474,2 46.5,3 44.2,4 1.001,5 1.113,6 0.68,7 6.432}
{0 CHEMBL2178862,1 7.292,2 45.7,3 45.7,4 0.998,5 1.115,6 0.674,7 7.42}
{0 CHEMBL2178863,1 9.187,2 47.1,3 35.3,4 1.02,5 1.106,6 0.73,7 4.686}
{0 CHEMBL2178867,1 8.772,2 45.7,3 37,4 1.012,5 1.116,6 0.721,7 4.595}
