{
  "data_set_description": {
    "collection_date": "November 2013",
    "creator": "Dr Jeremy Besnard, Dr Ivan Olier, Dr Noureddin Sadawi, Dr Larisa Soldatova, Dr Crina Grosan, Prof Ross King, Dr Richard Bickerton, Prof Andrew Hopkins and Dr Willem van Hoorn",
    "default_target_attribute": "pXC50",
    "description": "This dataset contains QSAR data (from ChEMBL version 17) showing activity values (unit is pseudo-pCI50) of several compounds on drug target ChEMBL_ID: CHEMBL3693 (TID: 100596), and it has 66 rows and 43 features (not including molecule IDs and class feature: molecule_id and pXC50). The features represent Basic Molecular Descriptors which were generated from SMILES strings.  Missing value imputation was applied to this dataset (By choosing the Median).",
    "description_version": "1",
    "file_id": "3681701",
    "format": "ARFF",
    "id": "39704",
    "licence": "Public",
    "md5_checksum": "dd16d0fa17b2127b320f9e598d914078",
    "minio_url": "https://data.openml.org/datasets/0003/39704/dataset_39704.pq",
    "name": "QSAR-DATASET-FOR-DRUG-TARGET-CHEMBL3693",
    "original_data_url": "https://www.ebi.ac.uk/chembl/target/inspect/CHEMBL3693",
    "parquet_url": "https://data.openml.org/datasets/0003/39704/dataset_39704.pq",
    "processing_date": "2018-10-04 06:36:19",
    "row_id_attribute": "molecule_id",
    "status": "deactivated",
    "tag": [
      "MetaQSAR",
      "study_13"
    ],
    "upload_date": "2016-07-16T08:54:38",
    "url": "https://api.openml.org/data/v1/download/3681701/QSAR-DATASET-FOR-DRUG-TARGET-CHEMBL3693.arff",
    "version": "11",
    "visibility": "public"
  }
}