{
  "data_set_description": {
    "collection_date": "November 2013",
    "creator": "Dr Jeremy Besnard, Dr Ivan Olier, Dr Noureddin Sadawi, Dr Larisa Soldatova, Dr Crina Grosan, Prof Ross King, Dr Richard Bickerton, Prof Andrew Hopkins and Dr Willem van Hoorn",
    "default_target_attribute": "pXC50",
    "description": "This dataset contains QSAR data (from ChEMBL version 17) showing activity values (unit is pseudo-pCI50) of several compounds on drug target ChEMBL_ID: CHEMBL2963 (TID: 11043), and it has 35 rows and 1220 features (not including molecule IDs and class feature: molecule_id and pXC50). The features represent Molecular Descriptors which were generated from SMILES strings. Missing value imputation was applied to this dataset (By choosing the Median).",
    "description_version": "1",
    "file_id": "3678967",
    "format": "ARFF",
    "id": "39610",
    "licence": "Public",
    "md5_checksum": "73560887ec849202717c6457a9e54fb4",
    "minio_url": "https://data.openml.org/datasets/0003/39610/dataset_39610.pq",
    "name": "QSAR-DATASET-FOR-DRUG-TARGET-CHEMBL2963",
    "original_data_url": "https://www.ebi.ac.uk/chembl/target/inspect/CHEMBL2963",
    "parquet_url": "https://data.openml.org/datasets/0003/39610/dataset_39610.pq",
    "processing_date": "2018-10-04 06:37:43",
    "row_id_attribute": "molecule_id",
    "status": "deactivated",
    "tag": [
      "MetaQSAR",
      "study_13"
    ],
    "upload_date": "2016-07-16T08:33:56",
    "url": "https://api.openml.org/data/v1/download/3678967/QSAR-DATASET-FOR-DRUG-TARGET-CHEMBL2963.arff",
    "version": "11",
    "visibility": "public"
  }
}