{
  "data_set_description": {
    "default_target_attribute": "CLASS_LABEL",
    "description": [],
    "description_version": "1",
    "file_id": "52508",
    "format": "Sparse_ARFF",
    "id": "396",
    "licence": "Public",
    "md5_checksum": "3efdf8d95305eb98b15187453f887527",
    "name": "la1s.wc",
    "processing_date": "2020-11-20 19:24:38",
    "status": "active",
    "tag": [
      "Biology",
      "Health",
      "Medicine",
      "study_123",
      "word count"
    ],
    "upload_date": "2014-09-28T23:23:22",
    "url": "https://api.openml.org/data/v1/download/52508/la1s.wc.sparse_arff",
    "version": "1",
    "visibility": "public"
  }
}