{
  "data_set_description": {
    "collection_date": "November 2013",
    "creator": "Dr Jeremy Besnard, Dr Ivan Olier, Dr Noureddin Sadawi, Dr Larisa Soldatova, Dr Crina Grosan, Prof Ross King, Dr Richard Bickerton, Prof Andrew Hopkins and Dr Willem van Hoorn",
    "default_target_attribute": "pXC50",
    "description": "This dataset contains QSAR data (from ChEMBL version 17) showing activity values (unit is pseudo-pCI50) of several compounds on drug target ChEMBL_ID: CHEMBL339 (TID: 14037), and it has 4378 rows and 43 features (not including molecule IDs and class feature: molecule_id and pXC50). The features represent Basic Molecular Descriptors which were generated from SMILES strings.  Missing value imputation was applied to this dataset (By choosing the Median).",
    "description_version": "1",
    "file_id": "3678387",
    "format": "ARFF",
    "id": "39594",
    "licence": "Public",
    "md5_checksum": "159b1279b8174b44c8cb13a8590d93c7",
    "minio_url": "https://data.openml.org/datasets/0003/39594/dataset_39594.pq",
    "name": "QSAR-DATASET-FOR-DRUG-TARGET-CHEMBL339",
    "original_data_url": "https://www.ebi.ac.uk/chembl/target/inspect/CHEMBL339",
    "parquet_url": "https://data.openml.org/datasets/0003/39594/dataset_39594.pq",
    "processing_date": "2018-10-04 06:37:35",
    "row_id_attribute": "molecule_id",
    "status": "deactivated",
    "tag": [
      "MetaQSAR",
      "study_13"
    ],
    "upload_date": "2016-07-16T08:30:17",
    "url": "https://api.openml.org/data/v1/download/3678387/QSAR-DATASET-FOR-DRUG-TARGET-CHEMBL339.arff",
    "version": "12",
    "visibility": "public"
  }
}