{
  "data_set_description": {
    "collection_date": "November 2013",
    "creator": "Dr Jeremy Besnard, Dr Ivan Olier, Dr Noureddin Sadawi, Dr Larisa Soldatova, Dr Crina Grosan, Prof Ross King, Dr Richard Bickerton, Prof Andrew Hopkins and Dr Willem van Hoorn",
    "default_target_attribute": "pXC50",
    "description": "This dataset contains QSAR data (from ChEMBL version 17) showing activity values (unit is pseudo-pCI50) of several compounds on drug target ChEMBL_ID: CHEMBL4702 (TID: 11583), and it has 79 rows and 43 features (not including molecule IDs and class feature: molecule_id and pXC50). The features represent Basic Molecular Descriptors which were generated from SMILES strings.  Missing value imputation was applied to this dataset (By choosing the Median).",
    "description_version": "1",
    "file_id": "3677090",
    "format": "ARFF",
    "id": "39553",
    "licence": "Public",
    "md5_checksum": "446ae3c679d06b2fba15f86e6bee79c0",
    "minio_url": "https://data.openml.org/datasets/0003/39553/dataset_39553.pq",
    "name": "QSAR-DATASET-FOR-DRUG-TARGET-CHEMBL4702",
    "original_data_url": "https://www.ebi.ac.uk/chembl/target/inspect/CHEMBL4702",
    "parquet_url": "https://data.openml.org/datasets/0003/39553/dataset_39553.pq",
    "processing_date": "2018-10-04 06:39:20",
    "row_id_attribute": "molecule_id",
    "status": "deactivated",
    "tag": [
      "MetaQSAR",
      "study_13"
    ],
    "upload_date": "2016-07-16T08:21:05",
    "url": "https://api.openml.org/data/v1/download/3677090/QSAR-DATASET-FOR-DRUG-TARGET-CHEMBL4702.arff",
    "version": "12",
    "visibility": "public"
  }
}