{
  "data_set_description": {
    "collection_date": "November 2013",
    "creator": "Dr Jeremy Besnard, Dr Ivan Olier, Dr Noureddin Sadawi, Dr Larisa Soldatova, Dr Crina Grosan, Prof Ross King, Dr Richard Bickerton, Prof Andrew Hopkins and Dr Willem van Hoorn",
    "default_target_attribute": "pXC50",
    "description": "This dataset contains QSAR data (from ChEMBL version 17) showing activity values (unit is pseudo-pCI50) of several compounds on drug target ChEMBL_ID: CHEMBL5869 (TID: 101592), and it has 54 rows and 43 features (not including molecule IDs and class feature: molecule_id and pXC50). The features represent Basic Molecular Descriptors which were generated from SMILES strings.  Missing value imputation was applied to this dataset (By choosing the Median).",
    "description_version": "1",
    "file_id": "3676119",
    "format": "ARFF",
    "id": "39524",
    "licence": "Public",
    "md5_checksum": "66d594cf0abdbcd973da80e0ce6d1b41",
    "minio_url": "https://data.openml.org/datasets/0003/39524/dataset_39524.pq",
    "name": "QSAR-DATASET-FOR-DRUG-TARGET-CHEMBL5869",
    "original_data_url": "https://www.ebi.ac.uk/chembl/target/inspect/CHEMBL5869",
    "parquet_url": "https://data.openml.org/datasets/0003/39524/dataset_39524.pq",
    "processing_date": "2018-10-04 06:26:02",
    "row_id_attribute": "molecule_id",
    "status": "deactivated",
    "tag": [
      "MetaQSAR",
      "study_13"
    ],
    "upload_date": "2016-07-16T08:14:28",
    "url": "https://api.openml.org/data/v1/download/3676119/QSAR-DATASET-FOR-DRUG-TARGET-CHEMBL5869.arff",
    "version": "11",
    "visibility": "public"
  }
}