"molecule_id","AMW","C.","H.","Me","Mi","Mp","Mv","MW","N.","nAB","nAT","nB","nBM","nBO","nBR","nBT","nC","nCL","nCsp","nCsp2","nCsp3","nDB","nF","nH","nHet","nHM","nI","nN","nO","nP","nS","nSK","nTB","nX","O.","RBF","RBN","SCBO","Se","Si","Sp","Sv","X.","pXC50"
{1 8.239,2 33.3,3 43.8,4 1.027,5 1.141,6 0.647,7 0.627,8 395.49,9 10.4,10 11,11 48,13 15,14 28,16 49,17 16,20 10,21 6,22 4,24 21,25 11,26 1,28 5,29 5,31 1,32 27,35 10.4,36 0.204,37 10,38 37.5,39 49.291,40 54.78,41 31.04,42 30.083,44 5.022}
{0 CHEMBL12472,1 7.173,2 38.7,3 51.6,4 0.988,5 1.121,6 0.672,7 0.609,8 444.72,9 3.2,10 16,11 62,13 16,14 32,16 64,17 24,20 14,21 10,24 32,25 6,26 2,28 2,29 2,31 2,32 30,35 3.2,36 0.188,37 12,38 40,39 61.265,40 69.483,41 41.637,42 37.749,44 6.26}
{0 CHEMBL12781,1 7.234,2 41.7,3 50,4 0.987,5 1.115,6 0.683,7 0.622,8 520.82,9 2.8,10 22,11 72,13 22,14 39,16 75,17 30,20 20,21 10,24 36,25 6,26 2,28 2,29 2,31 2,32 36,35 2.8,36 0.173,37 13,38 50,39 71.032,40 80.314,41 49.16,42 44.802,44 5.796}
{0 CHEMBL12858,1 7.254,2 33.3,3 51.5,4 0.997,5 1.137,6 0.65,7 0.596,8 478.76,9 9.1,10 10,11 66,13 12,14 33,16 67,17 22,19 1,20 9,21 12,22 1,24 34,25 10,26 2,28 6,29 2,31 2,32 32,33 1,35 3,36 0.239,37 16,38 41,39 65.789,40 75.061,41 42.898,42 39.307,44 6.328}
{0 CHEMBL12937,1 6.839,2 34.5,3 55.2,4 0.987,5 1.129,6 0.649,7 0.582,8 396.68,9 3.4,10 10,11 58,13 10,14 27,16 59,17 20,20 8,21 12,24 32,25 6,26 2,28 2,29 2,31 2,32 26,35 3.4,36 0.22,37 13,38 32,39 57.265,40 65.483,41 37.637,42 33.749,44 5.658}
{0 CHEMBL13122,1 7.8,2 34.2,3 47.4,4 1.013,5 1.136,6 0.651,7 0.614,8 592.82,9 7.9,10 16,11 76,13 20,14 42,16 78,17 26,20 14,21 12,22 4,24 36,25 14,26 2,28 6,29 6,31 2,32 40,35 7.9,36 0.231,37 18,38 54,39 76.981,40 86.314,41 49.478,42 46.693,44 6.229}
{0 CHEMBL13166,1 6.733,2 34.4,3 55.7,4 0.986,5 1.129,6 0.646,7 0.578,8 410.71,9 3.3,10 10,11 61,13 10,14 28,16 62,17 21,20 8,21 13,24 34,25 6,26 2,28 2,29 2,31 2,32 27,35 3.3,36 0.226,37 14,38 33,39 60.149,40 68.899,41 39.398,42 35.275,44 6.284}
{0 CHEMBL13206,1 7.32,2 32.4,3 51.5,4 1.003,5 1.138,6 0.641,7 0.592,8 497.76,9 7.4,10 10,11 68,13 13,14 34,16 69,17 22,20 10,21 12,22 3,24 35,25 11,26 2,28 5,29 4,31 2,32 33,35 5.9,36 0.246,37 17,38 42,39 68.225,40 77.397,41 43.563,42 40.242,44 6.301}
{0 CHEMBL13308,1 7.089,2 34.6,3 53.8,4 0.99,5 1.128,6 0.656,7 0.59,8 368.62,9 3.8,10 10,11 52,13 10,14 25,16 53,17 18,20 8,21 10,24 28,25 6,26 2,28 2,29 2,31 2,32 24,35 3.8,36 0.208,37 11,38 30,39 51.498,40 58.653,41 34.114,42 30.695,44 5.854}
{0 CHEMBL13426,1 6.549,2 34.3,3 56.7,4 0.984,5 1.13,6 0.641,7 0.572,8 438.77,9 3,10 10,11 67,13 10,14 30,16 68,17 23,20 8,21 15,24 38,25 6,26 2,28 2,29 2,31 2,32 29,35 3,36 0.235,37 16,38 35,39 65.916,40 75.729,41 42.921,42 38.329,44 6.149}
{0 CHEMBL14,1 5.889,2 24,3 60,4 1.004,5 1.165,6 0.555,7 0.516,8 147.23,9 8,11 25,13 1,14 9,16 24,17 6,20 1,21 5,22 1,24 15,25 4,28 2,29 2,32 10,35 8,36 0.167,37 4,38 10,39 25.102,40 29.114,41 13.869,42 12.897,44 4.18}
{0 CHEMBL268499,1 6.637,2 34.4,3 56.3,4 0.985,5 1.13,6 0.643,7 0.575,8 424.74,9 3.1,10 10,11 64,13 10,14 29,16 65,17 22,20 8,21 14,24 36,25 6,26 2,28 2,29 2,31 2,32 28,35 3.1,36 0.231,37 15,38 34,39 63.032,40 72.314,41 41.16,42 36.802,44 6.237}
{0 CHEMBL275537,1 6.957,2 34.5,3 54.5,4 0.989,5 1.129,6 0.652,7 0.586,8 382.65,9 3.6,10 10,11 55,13 10,14 26,16 56,17 19,20 8,21 11,24 30,25 6,26 2,28 2,29 2,31 2,32 25,35 3.6,36 0.214,37 12,38 31,39 54.381,40 62.068,41 35.875,42 32.222,44 5.824}
{0 CHEMBL316973,1 8.271,2 34.8,3 43.5,4 1.026,5 1.137,6 0.653,7 0.632,8 380.47,9 8.7,10 11,11 46,13 15,14 27,16 47,17 16,20 10,21 6,22 4,24 20,25 10,26 1,28 4,29 5,31 1,32 26,35 10.9,36 0.213,37 10,38 36.5,39 47.189,40 52.282,41 30.034,42 29.061,44 4.921}
{0 CHEMBL321605,1 8.21,2 32,3 44,4 1.028,5 1.146,6 0.641,7 0.622,8 410.51,9 12,10 11,11 50,13 15,14 29,16 51,17 16,20 10,21 6,22 4,24 22,25 12,26 1,28 6,29 5,31 1,32 28,35 10,36 0.216,37 11,38 38.5,39 51.393,40 57.278,41 32.046,42 31.104,44 4.921}
{0 CHEMBL418712,1 6.395,2 34.2,3 57.5,4 0.982,5 1.131,6 0.636,7 0.567,8 466.83,9 2.7,10 10,11 73,13 10,14 32,16 74,17 25,20 8,21 17,24 42,25 6,26 2,28 2,29 2,31 2,32 31,35 2.7,36 0.243,37 18,38 37,39 71.683,40 82.559,41 46.444,42 41.383,44 6.398}
{0 CHEMBL418714,1 6.469,2 34.3,3 57.1,4 0.983,5 1.131,6 0.638,7 0.569,8 452.8,9 2.9,10 10,11 70,13 10,14 31,16 71,17 24,20 8,21 16,24 40,25 6,26 2,28 2,29 2,31 2,32 30,35 2.9,36 0.239,37 17,38 36,39 68.799,40 79.144,41 44.682,42 39.856,44 6.268}
{0 CHEMBL517712,1 6.577,2 38.6,3 52.3,4 0.996,5 1.129,6 0.631,7 0.59,8 289.41,9 2.3,10 6,11 44,13 7,14 23,16 46,17 17,20 7,21 10,22 1,24 23,25 4,28 1,29 3,32 21,35 6.8,36 0.109,37 5,38 27,39 43.803,40 49.694,41 27.745,42 25.961,44 9.306}
{0 CHEMBL538467,1 7.109,2 30,3 50,4 1.02,5 1.154,6 0.598,7 0.579,8 142.18,9 10,11 20,13 2,14 10,16 20,17 6,20 2,21 4,22 2,24 10,25 4,28 2,29 2,32 10,35 10,36 0.1,37 2,38 12,39 20.393,40 23.076,41 11.966,42 11.58,44 7.854}
{0 CHEMBL7634,1 6.252,2 36.4,3 54.5,4 0.988,5 1.137,6 0.623,7 0.575,8 206.32,9 6.1,11 33,13 2,14 16,16 34,17 12,19 2,20 1,21 9,22 1,24 18,25 3,28 2,29 1,32 15,33 1,35 3,36 0.059,37 2,38 19,39 32.6,40 37.528,41 20.557,42 18.972,44 5.824}
{0 CHEMBL95,1 6.838,2 44.8,3 48.3,4 0.983,5 1.12,6 0.675,7 0.628,8 198.29,9 6.9,10 11,11 29,13 11,14 17,16 31,17 13,20 9,21 4,24 14,25 2,28 2,32 15,38 22.5,39 28.505,40 32.488,41 19.58,42 18.204,44 5.678}
