"molecule_id","FCFP4_1024b265","FCFP4_1024b737","FCFP4_1024b537","FCFP4_1024b911","FCFP4_1024b585","FCFP4_1024b781","FCFP4_1024b947","FCFP4_1024b875","FCFP4_1024b957","FCFP4_1024b702","FCFP4_1024b846","FCFP4_1024b632","FCFP4_1024b971","FCFP4_1024b376","FCFP4_1024b65","FCFP4_1024b556","FCFP4_1024b360","FCFP4_1024b8","FCFP4_1024b680","FCFP4_1024b983","FCFP4_1024b668","FCFP4_1024b826","FCFP4_1024b521","FCFP4_1024b1014","FCFP4_1024b847","FCFP4_1024b574","FCFP4_1024b164","FCFP4_1024b345","FCFP4_1024b369","FCFP4_1024b623","FCFP4_1024b524","FCFP4_1024b186","FCFP4_1024b747","FCFP4_1024b152","FCFP4_1024b145","FCFP4_1024b891","FCFP4_1024b751","FCFP4_1024b714","FCFP4_1024b286","FCFP4_1024b89","FCFP4_1024b52","FCFP4_1024b357","FCFP4_1024b799","FCFP4_1024b78","FCFP4_1024b905","FCFP4_1024b666","FCFP4_1024b466","FCFP4_1024b698","FCFP4_1024b484","FCFP4_1024b964","FCFP4_1024b17","pXC50"
{1 1,2 1,3 1,4 1,5 1,6 1,7 1,8 1,9 1,10 1,11 1,12 1,13 1,14 1,15 1,16 1,19 1,20 1,22 1,23 1,25 1,35 1,36 1,51 1,52 6.959}
{0 CHEMBL115432,1 1,2 1,3 1,4 1,5 1,6 1,7 1,8 1,9 1,10 1,12 1,13 1,14 1,15 1,16 1,19 1,20 1,22 1,23 1,51 1,52 6.432}
{0 CHEMBL115462,1 1,2 1,3 1,4 1,5 1,6 1,7 1,8 1,9 1,10 1,11 1,12 1,13 1,14 1,15 1,16 1,19 1,20 1,22 1,23 1,51 1,52 6.174}
{0 CHEMBL115534,1 1,2 1,3 1,4 1,5 1,6 1,7 1,8 1,9 1,10 1,11 1,12 1,13 1,14 1,15 1,16 1,19 1,20 1,22 1,23 1,51 1,52 6.06}
{0 CHEMBL115637,1 1,2 1,3 1,4 1,5 1,6 1,7 1,8 1,9 1,10 1,11 1,12 1,13 1,14 1,15 1,16 1,19 1,20 1,22 1,23 1,35 1,36 1,51 1,52 8.046}
{0 CHEMBL115742,1 1,2 1,3 1,4 1,5 1,6 1,7 1,8 1,9 1,10 1,11 1,12 1,13 1,14 1,15 1,16 1,19 1,20 1,22 1,23 1,51 1,52 7}
{0 CHEMBL115815,1 1,2 1,3 1,4 1,5 1,6 1,7 1,8 1,9 1,10 1,11 1,12 1,13 1,14 1,15 1,16 1,19 1,20 1,22 1,23 1,51 1,52 7.155}
{0 CHEMBL115960,1 1,2 1,3 1,4 1,5 1,6 1,7 1,8 1,9 1,10 1,11 1,12 1,13 1,14 1,15 1,16 1,19 1,20 1,22 1,23 1,25 1,26 1,35 1,36 1,51 1,52 6.921}
{0 CHEMBL115966,1 1,2 1,3 1,4 1,5 1,6 1,7 1,8 1,9 1,10 1,11 1,12 1,13 1,14 1,15 1,16 1,19 1,20 1,22 1,23 1,35 1,36 1,51 1,52 7.602}
{0 CHEMBL115971,1 1,2 1,3 1,4 1,5 1,6 1,7 1,8 1,9 1,10 1,11 1,12 1,13 1,14 1,15 1,16 1,19 1,20 1,22 1,23 1,35 1,36 1,51 1,52 7.745}
{0 CHEMBL115981,1 1,2 1,3 1,4 1,5 1,6 1,7 1,8 1,9 1,10 1,11 1,12 1,13 1,14 1,15 1,16 1,19 1,20 1,22 1,23 1,51 1,52 6.77}
{0 CHEMBL1160648,8 1,17 1,18 1,21 1,24 1,25 1,26 1,27 1,28 1,29 1,30 1,31 1,32 1,33 1,34 1,38 1,43 1,52 4.301}
{0 CHEMBL1160651,8 1,17 1,18 1,21 1,24 1,25 1,26 1,27 1,28 1,29 1,30 1,31 1,32 1,33 1,34 1,38 1,43 1,52 4}
{0 CHEMBL1160652,8 1,17 1,18 1,21 1,24 1,25 1,26 1,27 1,28 1,29 1,30 1,31 1,32 1,33 1,34 1,38 1,43 1,52 4}
{0 CHEMBL116070,1 1,2 1,3 1,4 1,5 1,6 1,7 1,8 1,9 1,10 1,11 1,12 1,13 1,14 1,15 1,16 1,19 1,20 1,22 1,23 1,51 1,52 8.398}
{0 CHEMBL116089,1 1,2 1,3 1,4 1,5 1,6 1,7 1,8 1,9 1,10 1,11 1,12 1,13 1,14 1,15 1,16 1,19 1,20 1,22 1,23 1,51 1,52 7.721}
{0 CHEMBL116152,1 1,2 1,3 1,4 1,5 1,6 1,7 1,8 1,9 1,10 1,11 1,12 1,13 1,14 1,15 1,16 1,19 1,20 1,22 1,23 1,51 1,52 8.222}
{0 CHEMBL116307,1 1,2 1,3 1,4 1,5 1,6 1,7 1,8 1,9 1,10 1,11 1,12 1,13 1,14 1,15 1,16 1,19 1,20 1,22 1,23 1,25 1,51 1,52 7.699}
{0 CHEMBL116363,1 1,2 1,3 1,4 1,5 1,6 1,7 1,8 1,9 1,10 1,11 1,12 1,13 1,14 1,15 1,16 1,18 1,19 1,20 1,22 1,23 1,35 1,36 1,50 1,51 1,52 7.886}
{0 CHEMBL116454,1 1,2 1,3 1,4 1,5 1,6 1,7 1,8 1,9 1,10 1,11 1,12 1,13 1,14 1,15 1,16 1,19 1,20 1,22 1,23 1,35 1,36 1,51 1,52 7.553}
{0 CHEMBL116958,1 1,2 1,3 1,4 1,5 1,6 1,7 1,8 1,9 1,10 1,11 1,12 1,13 1,14 1,15 1,16 1,19 1,20 1,22 1,23 1,34 1,35 1,36 1,51 1,52 6.167}
{0 CHEMBL117093,1 1,2 1,3 1,4 1,5 1,6 1,7 1,8 1,9 1,10 1,11 1,12 1,13 1,14 1,15 1,16 1,19 1,20 1,22 1,23 1,35 1,36 1,51 1,52 7.456}
{0 CHEMBL117198,1 1,2 1,3 1,4 1,5 1,6 1,7 1,8 1,9 1,10 1,11 1,12 1,13 1,14 1,15 1,16 1,19 1,20 1,22 1,23 1,51 1,52 8.523}
{0 CHEMBL117279,1 1,2 1,3 1,4 1,5 1,6 1,7 1,8 1,9 1,10 1,11 1,12 1,13 1,14 1,15 1,16 1,19 1,20 1,22 1,23 1,35 1,36 1,50 1,51 1,52 8.301}
{0 CHEMBL117292,1 1,2 1,3 1,4 1,5 1,6 1,7 1,8 1,9 1,10 1,11 1,12 1,13 1,14 1,15 1,16 1,19 1,20 1,22 1,23 1,26 1,35 1,36 1,51 1,52 6.921}
{0 CHEMBL117327,17 1,18 1,21 1,24 1,25 1,26 1,27 1,28 1,29 1,30 1,31 1,32 1,33 1,34 1,38 1,43 1,52 4}
{0 CHEMBL117367,1 1,2 1,3 1,4 1,5 1,6 1,7 1,8 1,9 1,10 1,11 1,12 1,13 1,14 1,15 1,16 1,19 1,20 1,22 1,23 1,51 1,52 6.06}
{0 CHEMBL117452,1 1,2 1,3 1,4 1,5 1,6 1,7 1,8 1,9 1,10 1,11 1,12 1,13 1,14 1,15 1,16 1,19 1,20 1,22 1,23 1,35 1,36 1,51 1,52 6.063}
{0 CHEMBL117453,1 1,2 1,3 1,4 1,5 1,6 1,7 1,8 1,9 1,10 1,11 1,12 1,13 1,14 1,15 1,16 1,19 1,20 1,22 1,23 1,51 1,52 7.699}
{0 CHEMBL117565,1 1,2 1,3 1,4 1,5 1,6 1,7 1,8 1,9 1,10 1,11 1,12 1,13 1,14 1,15 1,16 1,19 1,20 1,22 1,23 1,35 1,36 1,51 1,52 6.328}
{0 CHEMBL117571,1 1,2 1,3 1,4 1,5 1,6 1,7 1,8 1,9 1,10 1,11 1,12 1,13 1,14 1,15 1,16 1,19 1,20 1,22 1,23 1,25 1,51 1,52 7.102}
{0 CHEMBL117668,1 1,2 1,3 1,4 1,5 1,6 1,7 1,8 1,9 1,10 1,11 1,12 1,13 1,14 1,15 1,16 1,19 1,20 1,22 1,23 1,50 1,51 1,52 8.301}
{0 CHEMBL117671,1 1,2 1,3 1,4 1,5 1,6 1,7 1,8 1,9 1,10 1,11 1,12 1,13 1,14 1,15 1,16 1,19 1,20 1,22 1,23 1,26 1,31 1,38 1,51 1,52 6.939}
{0 CHEMBL117746,1 1,2 1,3 1,4 1,5 1,6 1,7 1,8 1,9 1,10 1,11 1,12 1,13 1,14 1,15 1,16 1,19 1,20 1,22 1,23 1,50 1,51 1,52 8.301}
{0 CHEMBL117894,1 1,2 1,3 1,4 1,5 1,6 1,7 1,8 1,9 1,10 1,11 1,12 1,13 1,14 1,15 1,16 1,19 1,20 1,22 1,23 1,35 1,36 1,51 1,52 8.301}
{0 CHEMBL117936,1 1,2 1,3 1,4 1,5 1,6 1,7 1,8 1,9 1,10 1,11 1,12 1,13 1,14 1,15 1,16 1,19 1,20 1,22 1,23 1,51 1,52 7.456}
{0 CHEMBL118022,1 1,2 1,3 1,4 1,5 1,6 1,7 1,8 1,9 1,10 1,11 1,12 1,13 1,14 1,15 1,16 1,19 1,20 1,22 1,23 1,51 1,52 7.553}
{0 CHEMBL118034,1 1,2 1,3 1,4 1,5 1,6 1,7 1,8 1,9 1,10 1,11 1,12 1,13 1,14 1,15 1,16 1,19 1,20 1,22 1,23 1,35 1,36 1,51 1,52 8.301}
{0 CHEMBL118074,1 1,2 1,3 1,4 1,5 1,6 1,7 1,8 1,9 1,10 1,11 1,12 1,13 1,14 1,15 1,16 1,19 1,20 1,22 1,23 1,35 1,36 1,51 1,52 7.651}
{0 CHEMBL118089,1 1,2 1,3 1,4 1,5 1,6 1,7 1,8 1,9 1,10 1,11 1,12 1,13 1,14 1,15 1,16 1,19 1,20 1,22 1,23 1,26 1,35 1,36 1,51 1,52 7.509}
{0 CHEMBL118113,1 1,2 1,3 1,4 1,5 1,6 1,7 1,8 1,9 1,10 1,11 1,12 1,13 1,14 1,15 1,16 1,19 1,20 1,22 1,23 1,26 1,33 1,50 1,51 1,52 8.699}
{0 CHEMBL118114,1 1,2 1,3 1,4 1,5 1,6 1,7 1,8 1,9 1,10 1,11 1,12 1,13 1,14 1,15 1,16 1,19 1,20 1,22 1,23 1,38 1,51 1,52 6}
{0 CHEMBL118299,1 1,2 1,3 1,4 1,5 1,6 1,7 1,8 1,9 1,10 1,11 1,12 1,13 1,14 1,15 1,16 1,19 1,20 1,22 1,23 1,25 1,35 1,36 1,51 1,52 7.678}
{0 CHEMBL118300,1 1,2 1,3 1,4 1,5 1,6 1,7 1,8 1,9 1,10 1,11 1,12 1,13 1,14 1,15 1,16 1,19 1,20 1,22 1,23 1,35 1,36 1,51 1,52 7.222}
{0 CHEMBL118358,1 1,2 1,3 1,4 1,5 1,6 1,7 1,8 1,9 1,10 1,11 1,12 1,13 1,14 1,15 1,16 1,19 1,20 1,22 1,23 1,34 1,35 1,36 1,38 1,51 1,52 6.081}
{0 CHEMBL118518,1 1,2 1,3 1,4 1,5 1,6 1,7 1,8 1,9 1,10 1,11 1,12 1,13 1,14 1,15 1,16 1,19 1,20 1,22 1,23 1,51 1,52 8.222}
{0 CHEMBL118886,1 1,2 1,3 1,4 1,5 1,6 1,7 1,8 1,9 1,10 1,11 1,12 1,13 1,14 1,15 1,16 1,19 1,20 1,22 1,23 1,51 1,52 8.097}
{0 CHEMBL119039,1 1,2 1,3 1,4 1,5 1,6 1,7 1,8 1,9 1,10 1,11 1,12 1,13 1,14 1,15 1,16 1,19 1,20 1,22 1,23 1,35 1,36 1,51 1,52 8.398}
{0 CHEMBL119091,1 1,2 1,3 1,4 1,5 1,6 1,7 1,8 1,9 1,10 1,11 1,12 1,13 1,14 1,15 1,16 1,19 1,20 1,22 1,23 1,25 1,36 1,51 1,52 7.509}
{0 CHEMBL119183,1 1,2 1,3 1,4 1,5 1,6 1,7 1,8 1,9 1,10 1,11 1,12 1,13 1,14 1,15 1,16 1,19 1,20 1,22 1,23 1,50 1,51 1,52 7.796}
{0 CHEMBL119335,1 1,2 1,3 1,4 1,5 1,6 1,7 1,8 1,9 1,10 1,11 1,12 1,13 1,14 1,15 1,16 1,19 1,20 1,22 1,23 1,25 1,26 1,35 1,36 1,51 1,52 8.553}
{0 CHEMBL119348,1 1,2 1,3 1,4 1,5 1,6 1,7 1,8 1,9 1,10 1,11 1,12 1,13 1,14 1,15 1,16 1,19 1,20 1,22 1,23 1,35 1,36 1,51 1,52 6.114}
{0 CHEMBL119501,1 1,2 1,3 1,4 1,5 1,6 1,7 1,8 1,9 1,10 1,11 1,12 1,13 1,14 1,15 1,16 1,19 1,20 1,22 1,23 1,35 1,36 1,51 1,52 9.155}
{0 CHEMBL119522,1 1,2 1,3 1,4 1,5 1,6 1,7 1,8 1,9 1,10 1,11 1,12 1,13 1,14 1,15 1,16 1,19 1,20 1,22 1,23 1,34 1,51 1,52 6.187}
{0 CHEMBL119523,1 1,2 1,3 1,4 1,5 1,6 1,7 1,8 1,9 1,10 1,11 1,12 1,13 1,14 1,15 1,16 1,19 1,20 1,22 1,23 1,36 1,51 1,52 6.678}
{0 CHEMBL119532,1 1,2 1,3 1,4 1,5 1,6 1,7 1,8 1,9 1,10 1,11 1,12 1,13 1,14 1,15 1,16 1,19 1,20 1,22 1,23 1,51 1,52 6.824}
{0 CHEMBL119599,1 1,2 1,3 1,4 1,5 1,6 1,7 1,8 1,9 1,10 1,12 1,13 1,14 1,15 1,16 1,19 1,20 1,22 1,23 1,31 1,51 1,52 6.959}
{0 CHEMBL119705,1 1,2 1,3 1,4 1,5 1,6 1,7 1,8 1,9 1,10 1,11 1,12 1,13 1,14 1,15 1,16 1,19 1,20 1,22 1,23 1,35 1,36 1,51 1,52 6.745}
{0 CHEMBL119711,1 1,2 1,3 1,4 1,5 1,6 1,7 1,8 1,9 1,10 1,11 1,12 1,13 1,14 1,15 1,16 1,19 1,20 1,22 1,23 1,34 1,35 1,36 1,44 1,51 1,52 6.222}
{0 CHEMBL119732,1 1,2 1,3 1,4 1,5 1,6 1,7 1,8 1,9 1,10 1,11 1,12 1,13 1,14 1,15 1,16 1,19 1,20 1,22 1,23 1,25 1,44 1,45 1,51 1,52 7.523}
{0 CHEMBL119733,1 1,2 1,3 1,4 1,5 1,6 1,7 1,8 1,9 1,10 1,11 1,12 1,13 1,14 1,15 1,16 1,19 1,20 1,22 1,23 1,51 1,52 9}
{0 CHEMBL119815,1 1,2 1,3 1,4 1,5 1,6 1,7 1,8 1,9 1,10 1,11 1,12 1,13 1,14 1,15 1,16 1,19 1,20 1,22 1,23 1,51 1,52 7.097}
{0 CHEMBL119836,17 1,18 1,21 1,24 1,25 1,26 1,27 1,28 1,29 1,30 1,31 1,32 1,33 1,34 1,38 1,43 1,52 4}
{0 CHEMBL119861,1 1,2 1,3 1,4 1,5 1,6 1,7 1,8 1,9 1,10 1,11 1,12 1,13 1,14 1,15 1,16 1,19 1,20 1,22 1,23 1,25 1,26 1,44 1,51 1,52 6.284}
{0 CHEMBL119886,1 1,2 1,3 1,4 1,5 1,6 1,7 1,8 1,9 1,10 1,11 1,12 1,13 1,14 1,15 1,16 1,19 1,20 1,22 1,23 1,36 1,51 1,52 6.921}
{0 CHEMBL119901,1 1,2 1,3 1,4 1,5 1,6 1,7 1,8 1,9 1,10 1,12 1,13 1,14 1,15 1,16 1,19 1,20 1,22 1,23 1,38 1,44 1,51 1,52 6}
{0 CHEMBL141886,17 1,18 1,21 1,24 1,25 1,26 1,27 1,28 1,29 1,30 1,31 1,32 1,33 1,37 1,38 1,40 1,41 1,42 1,52 4.097}
{0 CHEMBL142392,14 1,15 1,25 1,31 1,34 1,51 1,52 4.523}
{0 CHEMBL143702,14 1,15 1,25 1,31 1,34 1,51 1,52 5.18}
{0 CHEMBL143866,5 1,6 1,7 1,12 1,14 1,15 1,19 1,20 1,22 1,23 1,25 1,31 1,51 1,52 4.523}
{0 CHEMBL173041,14 1,15 1,17 1,18 1,19 1,21 1,24 1,25 1,26 1,27 1,28 1,29 1,30 1,31 1,32 1,33 1,37 1,38 1,39 1,40 1,41 1,42 1,46 1,51 1,52 5}
{0 CHEMBL1791424,17 1,18 1,21 1,25 1,26 1,27 1,28 1,29 1,30 1,31 1,32 1,33 1,34 1,38 1,41 1,43 1,52 5.509}
{0 CHEMBL1793853,12 1,17 1,18 1,19 1,20 1,21 1,24 1,25 1,26 1,27 1,28 1,29 1,30 1,31 1,32 1,33 1,34 1,37 1,38 1,39 1,41 1,43 1,44 1,45 1,46 1,47 1,51 1,52 4.495}
{0 CHEMBL2021325,12 1,17 1,18 1,20 1,21 1,24 1,25 1,26 1,27 1,28 1,29 1,30 1,31 1,32 1,33 1,37 1,38 1,39 1,40 1,41 1,42 1,46 1,47 1,51 1,52 4.387}
{0 CHEMBL2021326,12 1,17 1,18 1,20 1,21 1,24 1,25 1,26 1,27 1,28 1,29 1,30 1,31 1,32 1,33 1,37 1,38 1,39 1,40 1,41 1,42 1,46 1,47 1,51 1,52 4.31}
{0 CHEMBL2029023,17 1,18 1,21 1,25 1,26 1,29 1,30 1,32 1,33 1,34 1,38 1,43 1,52 4.886}
{0 CHEMBL2029024,17 1,18 1,21 1,25 1,26 1,29 1,30 1,32 1,33 1,34 1,38 1,43 1,52 5.824}
{0 CHEMBL2029065,17 1,18 1,21 1,24 1,25 1,26 1,27 1,28 1,29 1,30 1,31 1,32 1,33 1,37 1,38 1,39 1,40 1,41 1,42 1,46 1,52 4.463}
{0 CHEMBL216129,14 1,17 1,18 1,25 1,26 1,51 1,52 4.699}
{0 CHEMBL217490,14 1,15 1,17 1,18 1,25 1,26 1,51 1,52 4.553}
{0 CHEMBL220208,13 1,17 1,18 1,21 1,22 1,23 1,26 1,34 1,44 1,45 1,48 1,49 1,51 1,52 4.281}
{0 CHEMBL220255,17 1,18 1,21 1,34 1,44 1,45 1,48 1,51 1,52 6}
{0 CHEMBL220338,17 1,18 1,21 1,26 1,34 1,44 1,45 1,48 1,51 1,52 4.728}
{0 CHEMBL220340,13 1,17 1,18 1,21 1,22 1,23 1,34 1,44 1,45 1,48 1,49 1,51 1,52 4.243}
{0 CHEMBL220419,17 1,18 1,21 1,26 1,34 1,44 1,45 1,48 1,51 1,52 5.638}
{0 CHEMBL220560,17 1,18 1,21 1,26 1,34 1,44 1,45 1,48 1,51 1,52 5.886}
{0 CHEMBL220565,13 1,17 1,18 1,21 1,22 1,23 1,26 1,34 1,44 1,45 1,48 1,49 1,51 1,52 4.378}
{0 CHEMBL220720,13 1,17 1,18 1,19 1,21 1,22 1,23 1,44 1,45 1,48 1,49 1,51 1,52 4.804}
{0 CHEMBL220721,17 1,18 1,26 1,34 1,44 1,45 1,48 1,51 1,52 5.076}
{0 CHEMBL220828,17 1,18 1,21 1,34 1,44 1,45 1,48 1,51 1,52 5.31}
{0 CHEMBL220997,17 1,18 1,21 1,26 1,34 1,38 1,43 1,44 1,45 1,48 1,51 1,52 5.523}
{0 CHEMBL221111,17 1,18 1,26 1,34 1,44 1,45 1,48 1,51 1,52 5.076}
{0 CHEMBL221163,17 1,18 1,21 1,34 1,44 1,45 1,48 1,51 1,52 6.097}
{0 CHEMBL223009,13 1,17 1,18 1,21 1,22 1,23 1,34 1,44 1,45 1,48 1,49 1,51 1,52 4.313}
{0 CHEMBL223010,13 1,17 1,18 1,19 1,21 1,22 1,23 1,44 1,45 1,48 1,49 1,51 1,52 4.319}
{0 CHEMBL2303665,17 1,18 1,21 1,25 1,26 1,27 1,28 1,29 1,30 1,31 1,32 1,33 1,34 1,38 1,42 1,43 1,52 4.796}
{0 CHEMBL2303755,17 1,18 1,21 1,25 1,26 1,27 1,28 1,29 1,30 1,31 1,32 1,33 1,34 1,38 1,42 1,43 1,52 5.456}
{0 CHEMBL2303822,17 1,18 1,21 1,24 1,25 1,26 1,27 1,28 1,29 1,30 1,31 1,32 1,33 1,37 1,38 1,40 1,41 1,42 1,52 4.097}
{0 CHEMBL262570,1 1,2 1,3 1,4 1,5 1,6 1,7 1,8 1,9 1,11 1,12 1,13 1,14 1,15 1,16 1,18 1,20 1,22 1,23 1,25 1,51 1,52 7.26}
{0 CHEMBL263080,1 1,2 1,3 1,4 1,5 1,6 1,7 1,8 1,9 1,10 1,12 1,13 1,14 1,16 1,19 1,20 1,22 1,23 1,48 1,51 1,52 6.18}
{0 CHEMBL263081,1 1,2 1,3 1,4 1,5 1,6 1,7 1,8 1,9 1,10 1,11 1,12 1,13 1,14 1,15 1,16 1,19 1,20 1,22 1,23 1,51 1,52 6.886}
{0 CHEMBL266064,16 1,20 1,22 1,23 1,25 1,44 1,49 1,51 1,52 4.022}
{0 CHEMBL266073,12 1,17 1,18 1,19 1,20 1,21 1,24 1,25 1,26 1,27 1,28 1,29 1,30 1,31 1,32 1,33 1,34 1,37 1,38 1,39 1,40 1,41 1,42 1,43 1,44 1,45 1,46 1,47 1,51 1,52 4.222}
{0 CHEMBL266197,1 1,2 1,3 1,4 1,5 1,6 1,7 1,8 1,9 1,11 1,12 1,13 1,14 1,15 1,16 1,20 1,22 1,23 1,25 1,44 1,49 1,51 1,52 5.745}
{0 CHEMBL266198,1 1,2 1,3 1,4 1,5 1,6 1,7 1,8 1,9 1,10 1,11 1,12 1,13 1,14 1,15 1,16 1,19 1,20 1,22 1,23 1,51 1,52 8.301}
{0 CHEMBL266429,1 1,2 1,3 1,4 1,5 1,6 1,7 1,8 1,9 1,10 1,11 1,12 1,13 1,14 1,15 1,16 1,19 1,20 1,22 1,23 1,51 1,52 6.824}
{0 CHEMBL266460,1 1,2 1,3 1,4 1,5 1,6 1,7 1,8 1,9 1,11 1,12 1,13 1,14 1,15 1,16 1,20 1,22 1,23 1,51 1,52 5.398}
{0 CHEMBL266572,1 1,2 1,3 1,4 1,5 1,7 1,8 1,9 1,11 1,12 1,13 1,14 1,15 1,20 1,23 1,51 1,52 5.77}
{0 CHEMBL266708,1 1,2 1,3 1,4 1,5 1,6 1,7 1,8 1,9 1,11 1,12 1,13 1,14 1,15 1,16 1,20 1,22 1,23 1,25 1,51 1,52 6.854}
{0 CHEMBL266747,12 1,17 1,18 1,19 1,20 1,21 1,24 1,25 1,26 1,27 1,28 1,29 1,30 1,31 1,32 1,33 1,34 1,37 1,38 1,39 1,40 1,41 1,42 1,43 1,45 1,46 1,47 1,51 1,52 4.097}
{0 CHEMBL266798,6 1,7 1,9 1,10 1,11 1,12 1,13 1,14 1,15 1,16 1,19 1,20 1,22 1,23 1,48 1,51 1,52 5.398}
{0 CHEMBL266799,9 1,13 1,16 1,20 1,22 1,23 1,25 1,44 1,48 1,49 1,51 1,52 5.658}
{0 CHEMBL267125,1 1,2 1,3 1,4 1,5 1,6 1,7 1,8 1,9 1,10 1,11 1,12 1,13 1,14 1,15 1,16 1,19 1,20 1,22 1,23 1,51 1,52 7.886}
{0 CHEMBL267127,9 1,16 1,20 1,22 1,23 1,25 1,44 1,49 1,51 1,52 5.398}
{0 CHEMBL267456,1 1,2 1,3 1,4 1,5 1,6 1,7 1,8 1,9 1,10 1,11 1,12 1,13 1,14 1,15 1,16 1,19 1,20 1,22 1,23 1,51 1,52 7.699}
{0 CHEMBL267678,1 1,2 1,3 1,4 1,5 1,6 1,7 1,8 1,9 1,10 1,11 1,12 1,13 1,14 1,15 1,16 1,19 1,20 1,22 1,23 1,51 1,52 4.713}
{0 CHEMBL267914,7 1,9 1,10 1,11 1,13 1,14 1,15 1,16 1,19 1,20 1,22 1,23 1,51 1,52 4.796}
{0 CHEMBL267938,1 1,2 1,3 1,4 1,5 1,6 1,7 1,8 1,9 1,10 1,12 1,13 1,14 1,16 1,19 1,20 1,22 1,23 1,51 1,52 6.222}
{0 CHEMBL268070,1 1,2 1,3 1,4 1,5 1,6 1,7 1,8 1,9 1,10 1,12 1,13 1,14 1,16 1,19 1,20 1,22 1,23 1,51 1,52 4.824}
{0 CHEMBL268099,1 1,2 1,3 1,5 1,6 1,7 1,8 1,10 1,12 1,13 1,14 1,16 1,19 1,20 1,22 1,23 1,26 1,31 1,51 1,52 6}
{0 CHEMBL268530,1 1,2 1,3 1,4 1,5 1,6 1,7 1,8 1,9 1,11 1,12 1,13 1,14 1,15 1,16 1,20 1,22 1,23 1,51 1,52 6.699}
{0 CHEMBL268567,1 1,2 1,3 1,4 1,5 1,6 1,7 1,8 1,9 1,10 1,11 1,12 1,13 1,14 1,15 1,16 1,19 1,20 1,22 1,23 1,51 1,52 7.921}
{0 CHEMBL268667,1 1,2 1,3 1,5 1,6 1,7 1,8 1,10 1,12 1,13 1,14 1,16 1,19 1,20 1,22 1,23 1,51 1,52 5.398}
{0 CHEMBL269056,16 1,20 1,22 1,23 1,25 1,44 1,49 1,51 1,52 4.569}
{0 CHEMBL269075,1 1,2 1,3 1,4 1,5 1,6 1,7 1,8 1,9 1,10 1,11 1,12 1,13 1,14 1,15 1,16 1,19 1,20 1,22 1,23 1,32 1,48 1,51 1,52 7.056}
{0 CHEMBL269495,16 1,20 1,22 1,23 1,25 1,44 1,49 1,51 1,52 4.377}
{0 CHEMBL269497,1 1,2 1,3 1,4 1,5 1,6 1,7 1,8 1,9 1,10 1,11 1,12 1,13 1,14 1,15 1,16 1,19 1,20 1,22 1,23 1,51 1,52 7.347}
{0 CHEMBL269570,1 1,2 1,3 1,5 1,6 1,7 1,8 1,10 1,12 1,13 1,14 1,16 1,19 1,20 1,22 1,23 1,51 1,52 6.469}
{0 CHEMBL269598,1 1,2 1,3 1,4 1,5 1,6 1,7 1,8 1,9 1,10 1,11 1,12 1,13 1,14 1,15 1,16 1,19 1,20 1,22 1,23 1,51 1,52 7.495}
{0 CHEMBL293171,17 1,18 1,21 1,23 1,25 1,26 1,34 1,51 1,52 4}
{0 CHEMBL302139,17 1,18 1,21 1,23 1,25 1,26 1,31 1,34 1,51 1,52 4.523}
{0 CHEMBL305648,17 1,18 1,21 1,25 1,26 1,27 1,28 1,29 1,30 1,31 1,32 1,33 1,34 1,38 1,41 1,43 1,52 5.367}
{0 CHEMBL31535,12 1,17 1,18 1,21 1,24 1,25 1,26 1,27 1,28 1,29 1,30 1,31 1,32 1,33 1,34 1,37 1,38 1,39 1,40 1,41 1,42 1,43 1,45 1,46 1,52 5}
{0 CHEMBL323832,1 1,2 1,3 1,4 1,5 1,6 1,7 1,8 1,9 1,10 1,11 1,12 1,13 1,14 1,15 1,16 1,19 1,20 1,22 1,23 1,25 1,51 1,52 6.201}
{0 CHEMBL324133,1 1,2 1,3 1,4 1,5 1,6 1,7 1,8 1,9 1,11 1,12 1,13 1,14 1,15 1,16 1,20 1,22 1,23 1,51 1,52 7}
{0 CHEMBL324158,1 1,2 1,3 1,4 1,5 1,6 1,7 1,8 1,9 1,10 1,11 1,12 1,13 1,14 1,15 1,16 1,19 1,20 1,22 1,23 1,25 1,51 1,52 7.119}
{0 CHEMBL324824,1 1,2 1,3 1,4 1,5 1,6 1,7 1,8 1,9 1,10 1,11 1,12 1,13 1,14 1,15 1,16 1,19 1,20 1,22 1,23 1,35 1,36 1,51 1,52 6.523}
{0 CHEMBL325033,1 1,2 1,3 1,4 1,5 1,6 1,7 1,8 1,9 1,10 1,11 1,12 1,13 1,14 1,15 1,16 1,19 1,20 1,22 1,23 1,34 1,35 1,36 1,51 1,52 7.367}
{0 CHEMBL325184,1 1,2 1,3 1,4 1,5 1,6 1,7 1,8 1,9 1,10 1,11 1,12 1,13 1,14 1,15 1,16 1,18 1,19 1,20 1,22 1,23 1,35 1,36 1,51 1,52 8.699}
{0 CHEMBL325286,1 1,2 1,3 1,4 1,5 1,6 1,7 1,8 1,9 1,10 1,12 1,13 1,14 1,15 1,16 1,19 1,20 1,22 1,23 1,44 1,51 1,52 6.027}
{0 CHEMBL325618,1 1,2 1,3 1,4 1,5 1,6 1,7 1,8 1,9 1,10 1,11 1,12 1,13 1,14 1,15 1,16 1,19 1,20 1,22 1,23 1,35 1,36 1,45 1,51 1,52 6}
{0 CHEMBL325651,1 1,2 1,3 1,4 1,5 1,6 1,7 1,8 1,9 1,10 1,11 1,12 1,13 1,14 1,15 1,16 1,19 1,20 1,22 1,23 1,34 1,51 1,52 7.469}
{0 CHEMBL325893,1 1,2 1,3 1,4 1,5 1,6 1,7 1,8 1,9 1,10 1,11 1,12 1,13 1,14 1,15 1,16 1,19 1,20 1,22 1,23 1,51 1,52 6.097}
{0 CHEMBL326120,1 1,2 1,3 1,4 1,5 1,6 1,7 1,8 1,9 1,10 1,11 1,12 1,13 1,14 1,15 1,16 1,18 1,19 1,20 1,22 1,23 1,51 1,52 8.222}
{0 CHEMBL326271,1 1,2 1,3 1,4 1,5 1,6 1,7 1,8 1,9 1,10 1,11 1,12 1,13 1,14 1,15 1,16 1,19 1,20 1,22 1,23 1,35 1,36 1,51 1,52 8.155}
{0 CHEMBL326360,1 1,2 1,3 1,4 1,5 1,6 1,7 1,8 1,9 1,10 1,11 1,12 1,13 1,14 1,15 1,16 1,19 1,20 1,22 1,23 1,51 1,52 6}
{0 CHEMBL326712,1 1,2 1,3 1,4 1,5 1,6 1,7 1,8 1,9 1,10 1,11 1,12 1,13 1,14 1,15 1,16 1,19 1,20 1,22 1,23 1,35 1,36 1,51 1,52 6.959}
{0 CHEMBL326771,1 1,2 1,3 1,4 1,5 1,6 1,7 1,8 1,9 1,10 1,11 1,12 1,13 1,14 1,15 1,16 1,19 1,20 1,22 1,23 1,35 1,36 1,50 1,51 1,52 7.886}
{0 CHEMBL331055,1 1,2 1,3 1,4 1,5 1,6 1,7 1,8 1,9 1,10 1,11 1,12 1,13 1,14 1,15 1,16 1,19 1,20 1,22 1,23 1,35 1,36 1,51 1,52 6.824}
{0 CHEMBL331248,1 1,2 1,3 1,4 1,5 1,6 1,7 1,8 1,9 1,10 1,11 1,12 1,13 1,14 1,16 1,19 1,20 1,22 1,23 1,51 1,52 6}
{0 CHEMBL331584,1 1,2 1,3 1,4 1,5 1,6 1,7 1,8 1,9 1,10 1,11 1,12 1,13 1,14 1,15 1,16 1,19 1,20 1,22 1,23 1,35 1,36 1,50 1,51 1,52 8.155}
{0 CHEMBL331662,1 1,2 1,3 1,4 1,5 1,6 1,7 1,8 1,9 1,10 1,11 1,12 1,13 1,14 1,15 1,16 1,19 1,20 1,22 1,23 1,51 1,52 7.222}
{0 CHEMBL336269,5 1,6 1,7 1,12 1,14 1,18 1,19 1,20 1,22 1,23 1,25 1,31 1,48 1,51 1,52 5.481}
{0 CHEMBL368503,17 1,18 1,21 1,24 1,25 1,26 1,27 1,28 1,29 1,30 1,31 1,32 1,33 1,37 1,38 1,39 1,40 1,41 1,42 1,46 1,52 4.523}
{0 CHEMBL373592,13 1,17 1,18 1,19 1,22 1,23 1,45 1,48 1,51 1,52 4.212}
{0 CHEMBL374735,18 1,45 1,48 1,51 1,52 4.499}
{0 CHEMBL375763,13 1,17 1,18 1,19 1,21 1,22 1,23 1,44 1,45 1,48 1,49 1,51 1,52 5.013}
{0 CHEMBL376200,17 1,18 1,21 1,26 1,34 1,38 1,43 1,44 1,45 1,48 1,51 1,52 5.509}
{0 CHEMBL385486,14 1,15 1,17 1,18 1,25 1,26 1,51 1,52 4.456}
{0 CHEMBL386951,13 1,17 1,18 1,21 1,22 1,23 1,34 1,44 1,45 1,48 1,49 1,51 1,52 5.481}
{0 CHEMBL404794,5 1,6 1,12 1,14 1,15 1,19 1,20 1,22 1,23 1,25 1,31 1,35 1,36 1,51 1,52 5.854}
{0 CHEMBL415369,12 1,14 1,15 1,17 1,18 1,19 1,20 1,21 1,24 1,25 1,26 1,27 1,28 1,29 1,30 1,31 1,32 1,33 1,34 1,37 1,38 1,39 1,40 1,41 1,42 1,43 1,45 1,46 1,47 1,51 1,52 4.432}
{0 CHEMBL419046,1 1,2 1,3 1,4 1,5 1,6 1,7 1,8 1,9 1,10 1,11 1,12 1,13 1,14 1,15 1,16 1,19 1,20 1,22 1,23 1,51 1,52 7.602}
{0 CHEMBL421231,1 1,2 1,3 1,4 1,5 1,6 1,7 1,8 1,9 1,10 1,11 1,12 1,13 1,14 1,15 1,16 1,19 1,20 1,22 1,23 1,34 1,38 1,51 1,52 6.146}
{0 CHEMBL424929,17 1,18 1,34 1,44 1,45 1,48 1,51 1,52 5.06}
{0 CHEMBL426378,17 1,18 1,21 1,26 1,34 1,44 1,45 1,48 1,51 1,52 4.069}
{0 CHEMBL428508,1 1,2 1,3 1,4 1,5 1,6 1,7 1,8 1,9 1,10 1,11 1,12 1,13 1,14 1,15 1,16 1,19 1,20 1,22 1,23 1,36 1,38 1,51 1,52 6.208}
{0 CHEMBL434222,1 1,2 1,3 1,4 1,5 1,6 1,7 1,8 1,9 1,10 1,11 1,12 1,13 1,14 1,15 1,16 1,19 1,20 1,22 1,23 1,25 1,34 1,51 1,52 6.42}
{0 CHEMBL441009,12 1,17 1,18 1,19 1,20 1,21 1,24 1,25 1,26 1,27 1,28 1,29 1,30 1,31 1,32 1,33 1,34 1,37 1,38 1,39 1,40 1,41 1,42 1,43 1,45 1,46 1,47 1,50 1,51 1,52 4.523}
{0 CHEMBL53629,17 1,18 1,21 1,25 1,26 1,27 1,28 1,29 1,30 1,31 1,32 1,33 1,34 1,38 1,39 1,42 1,43 1,52 4}
{0 CHEMBL54190,17 1,18 1,21 1,25 1,26 1,27 1,28 1,29 1,30 1,31 1,32 1,33 1,34 1,38 1,42 1,43 1,52 5.456}
{0 CHEMBL6215,16 1,18 1,20 1,22 1,23 1,25 1,44 1,49 1,51 1,52 4}
{0 CHEMBL6229,9 1,16 1,20 1,22 1,23 1,25 1,44 1,49 1,51 1,52 5.523}
{0 CHEMBL6248,5 1,6 1,7 1,12 1,14 1,15 1,19 1,20 1,22 1,23 1,25 1,31 1,51 1,52 6.155}
{0 CHEMBL6249,1 1,2 1,3 1,4 1,5 1,6 1,7 1,8 1,9 1,11 1,12 1,13 1,14 1,15 1,16 1,20 1,22 1,23 1,31 1,51 1,52 5.398}
{0 CHEMBL6257,1 1,2 1,6 1,7 1,8 1,10 1,12 1,13 1,16 1,19 1,20 1,22 1,23 1,51 1,52 6.602}
{0 CHEMBL6258,1 1,2 1,3 1,4 1,5 1,6 1,7 1,8 1,9 1,10 1,11 1,12 1,13 1,14 1,15 1,16 1,18 1,20 1,22 1,23 1,51 1,52 5.824}
{0 CHEMBL6264,1 1,2 1,3 1,4 1,5 1,6 1,7 1,8 1,9 1,11 1,12 1,13 1,14 1,15 1,16 1,20 1,22 1,23 1,34 1,51 1,52 6.699}
{0 CHEMBL6275,1 1,2 1,3 1,4 1,5 1,6 1,7 1,8 1,9 1,10 1,11 1,12 1,13 1,14 1,16 1,19 1,20 1,22 1,23 1,51 1,52 5.398}
{0 CHEMBL6278,1 1,2 1,3 1,4 1,5 1,6 1,7 1,8 1,9 1,10 1,12 1,13 1,14 1,15 1,16 1,19 1,20 1,22 1,23 1,51 1,52 7.26}
{0 CHEMBL62853,17 1,18 1,21 1,22 1,23 1,25 1,26 1,34 1,51 1,52 4.699}
{0 CHEMBL6316,1 1,2 1,3 1,4 1,5 1,6 1,7 1,8 1,9 1,11 1,12 1,13 1,14 1,15 1,16 1,17 1,18 1,20 1,21 1,22 1,23 1,51 1,52 5.398}
{0 CHEMBL6320,1 1,2 1,6 1,7 1,8 1,10 1,12 1,13 1,16 1,19 1,20 1,22 1,23 1,51 1,52 5.398}
{0 CHEMBL6324,1 1,2 1,3 1,4 1,5 1,6 1,7 1,8 1,9 1,11 1,12 1,13 1,14 1,15 1,16 1,20 1,22 1,23 1,51 1,52 5.398}
{0 CHEMBL6369,1 1,2 1,3 1,4 1,5 1,6 1,7 1,8 1,9 1,11 1,12 1,13 1,14 1,15 1,16 1,20 1,22 1,23 1,51 1,52 5.076}
{0 CHEMBL6370,1 1,2 1,3 1,4 1,5 1,6 1,7 1,8 1,9 1,11 1,12 1,13 1,14 1,15 1,16 1,17 1,18 1,20 1,22 1,23 1,51 1,52 5.447}
{0 CHEMBL6371,1 1,2 1,3 1,4 1,5 1,6 1,7 1,8 1,9 1,11 1,12 1,13 1,14 1,15 1,16 1,20 1,22 1,23 1,51 1,52 6.301}
{0 CHEMBL6381,1 1,2 1,3 1,4 1,5 1,6 1,7 1,8 1,9 1,11 1,12 1,13 1,14 1,15 1,16 1,20 1,22 1,23 1,51 1,52 6.161}
{0 CHEMBL6417,1 1,2 1,3 1,4 1,5 1,6 1,7 1,8 1,9 1,10 1,11 1,12 1,13 1,14 1,15 1,16 1,19 1,20 1,22 1,23 1,51 1,52 4}
{0 CHEMBL6430,16 1,20 1,22 1,23 1,25 1,44 1,49 1,51 1,52 4.31}
{0 CHEMBL6442,5 1,6 1,7 1,9 1,10 1,11 1,12 1,14 1,15 1,16 1,19 1,20 1,22 1,23 1,51 1,52 4.77}
{0 CHEMBL6517,1 1,2 1,3 1,4 1,5 1,6 1,7 1,8 1,9 1,11 1,12 1,13 1,14 1,15 1,16 1,20 1,22 1,23 1,51 1,52 7.222}
{0 CHEMBL6523,9 1,11 1,14 1,15 1,16 1,20 1,22 1,23 1,25 1,44 1,49 1,51 1,52 4.658}
{0 CHEMBL6534,1 1,2 1,3 1,4 1,5 1,6 1,7 1,8 1,9 1,10 1,11 1,12 1,13 1,14 1,15 1,16 1,19 1,20 1,22 1,23 1,51 1,52 6}
{0 CHEMBL6542,1 1,2 1,3 1,4 1,5 1,6 1,7 1,8 1,9 1,10 1,11 1,12 1,13 1,14 1,15 1,16 1,19 1,20 1,22 1,23 1,51 1,52 7.357}
{0 CHEMBL6612,1 1,2 1,3 1,4 1,5 1,6 1,7 1,8 1,9 1,10 1,11 1,12 1,13 1,14 1,15 1,16 1,19 1,20 1,22 1,23 1,51 1,52 7}
{0 CHEMBL6762,1 1,2 1,3 1,4 1,5 1,6 1,7 1,8 1,9 1,10 1,11 1,12 1,13 1,14 1,15 1,16 1,19 1,20 1,22 1,23 1,26 1,36 1,51 1,52 5.398}
{0 CHEMBL6830,1 1,2 1,3 1,4 1,5 1,6 1,7 1,8 1,9 1,10 1,12 1,13 1,14 1,15 1,16 1,19 1,20 1,22 1,23 1,51 1,52 7.367}
