{
  "data_set_description": {
    "collection_date": "November 2013",
    "creator": "Dr Jeremy Besnard, Dr Ivan Olier, Dr Noureddin Sadawi, Dr Larisa Soldatova, Dr Crina Grosan, Prof Ross King, Dr Richard Bickerton, Prof Andrew Hopkins and Dr Willem van Hoorn",
    "default_target_attribute": "pXC50",
    "description": "This dataset contains QSAR data (from ChEMBL version 17) showing activity values (unit is pseudo-pCI50) of several compounds on drug target ChEMBL_ID: CHEMBL4037 (TID: 12948), and it has 16 rows and 1221 features (not including molecule IDs and class feature: molecule_id and pXC50). The features represent Molecular Descriptors which were generated from SMILES strings. Missing value imputation was applied to this dataset (By choosing the Median).",
    "description_version": "1",
    "file_id": "3675148",
    "format": "ARFF",
    "id": "39483",
    "licence": "Public",
    "md5_checksum": "22192effd708effd0b603091bee7ebb8",
    "minio_url": "https://data.openml.org/datasets/0003/39483/dataset_39483.pq",
    "name": "QSAR-DATASET-FOR-DRUG-TARGET-CHEMBL4037",
    "original_data_url": "https://www.ebi.ac.uk/chembl/target/inspect/CHEMBL4037",
    "parquet_url": "https://data.openml.org/datasets/0003/39483/dataset_39483.pq",
    "processing_date": "2018-10-04 06:31:30",
    "row_id_attribute": "molecule_id",
    "status": "deactivated",
    "tag": [
      "MetaQSAR",
      "study_13"
    ],
    "upload_date": "2016-07-16T08:05:43",
    "url": "https://api.openml.org/data/v1/download/3675148/QSAR-DATASET-FOR-DRUG-TARGET-CHEMBL4037.arff",
    "version": "12",
    "visibility": "public"
  }
}