"molecule_id","FCFP4_1024b936","FCFP4_1024b453","FCFP4_1024b576","FCFP4_1024b858","FCFP4_1024b167","FCFP4_1024b635","FCFP4_1024b113","FCFP4_1024b526","FCFP4_1024b1020","FCFP4_1024b245","FCFP4_1024b193","FCFP4_1024b108","FCFP4_1024b281","FCFP4_1024b724","FCFP4_1024b298","FCFP4_1024b663","FCFP4_1024b166","FCFP4_1024b924","FCFP4_1024b925","FCFP4_1024b971","FCFP4_1024b294","FCFP4_1024b606","FCFP4_1024b885","FCFP4_1024b271","FCFP4_1024b300","FCFP4_1024b170","FCFP4_1024b639","FCFP4_1024b54","FCFP4_1024b632","FCFP4_1024b768","FCFP4_1024b884","FCFP4_1024b965","FCFP4_1024b330","FCFP4_1024b196","FCFP4_1024b957","FCFP4_1024b362","FCFP4_1024b727","FCFP4_1024b855","FCFP4_1024b876","FCFP4_1024b311","FCFP4_1024b258","FCFP4_1024b764","FCFP4_1024b138","FCFP4_1024b150","FCFP4_1024b675","FCFP4_1024b845","FCFP4_1024b68","FCFP4_1024b695","FCFP4_1024b977","FCFP4_1024b87","FCFP4_1024b693","FCFP4_1024b728","FCFP4_1024b229","FCFP4_1024b537","FCFP4_1024b863","FCFP4_1024b655","FCFP4_1024b1","FCFP4_1024b10","FCFP4_1024b100","FCFP4_1024b1000","FCFP4_1024b1001","FCFP4_1024b1002","FCFP4_1024b1003","FCFP4_1024b1004","FCFP4_1024b1005","FCFP4_1024b1006","FCFP4_1024b1007","FCFP4_1024b1008","FCFP4_1024b1009","FCFP4_1024b101","FCFP4_1024b1010","FCFP4_1024b1011","FCFP4_1024b1012","FCFP4_1024b1013","FCFP4_1024b1014","FCFP4_1024b1015","FCFP4_1024b1016","FCFP4_1024b1017","FCFP4_1024b1018","FCFP4_1024b1019","FCFP4_1024b102","FCFP4_1024b1021","FCFP4_1024b1022","FCFP4_1024b1023","FCFP4_1024b1024","FCFP4_1024b103","FCFP4_1024b104","FCFP4_1024b105","FCFP4_1024b106","FCFP4_1024b107","FCFP4_1024b109","FCFP4_1024b11","FCFP4_1024b110","FCFP4_1024b111","FCFP4_1024b112","FCFP4_1024b114","FCFP4_1024b115","FCFP4_1024b116","FCFP4_1024b117","FCFP4_1024b118","FCFP4_1024b119","FCFP4_1024b12","pXC50"
{2 1,15 1,18 1,19 1,26 1,28 1,38 1,42 1,57 1,58 1,90 1,103 4.523}
{0 CHEMBL1080994,2 1,6 1,19 1,20 1,26 1,28 1,57 1,58 1,74 1,80 1,96 1,103 4.301}
{0 CHEMBL1080995,2 1,6 1,19 1,20 1,26 1,28 1,57 1,58 1,74 1,80 1,96 1,103 4.301}
{0 CHEMBL1086811,4 1,6 1,9 1,26 1,28 1,103 6.71}
{0 CHEMBL1088704,4 1,6 1,9 1,26 1,28 1,31 1,103 7.886}
{0 CHEMBL1091356,2 1,17 1,19 1,26 1,28 1,35 1,57 1,58 1,62 1,90 1,103 4.301}
{0 CHEMBL1094408,1 1,3 1,5 1,6 1,13 1,15 1,19 1,20 1,23 1,26 1,28 1,33 1,46 1,50 1,57 1,58 1,103 6.796}
{0 CHEMBL112050,4 1,19 1,24 1,26 1,32 1,34 1,35 1,57 1,58 1,103 6.357}
{0 CHEMBL112582,4 1,19 1,26 1,32 1,34 1,35 1,57 1,58 1,103 7.097}
{0 CHEMBL114250,8 1,9 1,21 1,24 1,28 1,29 1,36 1,37 1,40 1,48 1,57 1,103 4.125}
{0 CHEMBL115498,8 1,9 1,24 1,25 1,28 1,48 1,57 1,103 5.222}
{0 CHEMBL1170012,2 1,19 1,26 1,28 1,57 1,90 1,102 1,103 4.6}
{0 CHEMBL1170818,4 1,19 1,20 1,38 1,39 1,57 1,65 1,68 1,103 5.018}
{0 CHEMBL1171238,4 1,5 1,12 1,19 1,22 1,26 1,50 1,57 1,103 4.668}
{0 CHEMBL1171969,2 1,19 1,26 1,28 1,57 1,82 1,90 1,102 1,103 7}
{0 CHEMBL1171972,2 1,4 1,12 1,19 1,26 1,28 1,57 1,90 1,103 4.307}
{0 CHEMBL1172129,2 1,19 1,26 1,28 1,57 1,90 1,103 6.097}
{0 CHEMBL1172329,4 1,5 1,9 1,12 1,19 1,26 1,34 1,41 1,57 1,103 4.979}
{0 CHEMBL1222044,19 1,24 1,26 1,29 1,57 1,79 1,103 4}
{0 CHEMBL1230169,3 1,20 1,23 1,26 1,33 1,35 1,57 1,58 1,60 1,90 1,92 1,103 6.471}
{0 CHEMBL1230170,3 1,4 1,5 1,6 1,20 1,23 1,26 1,33 1,35 1,38 1,41 1,45 1,47 1,48 1,49 1,54 1,57 1,60 1,92 1,103 5.199}
{0 CHEMBL1230607,19 1,57 1,58 1,60 1,90 1,92 1,94 1,103 7.222}
{0 CHEMBL1234833,2 1,15 1,20 1,26 1,29 1,35 1,38 1,50 1,52 1,57 1,69 1,90 1,103 7.481}
{0 CHEMBL1242973,19 1,26 1,31 1,57 1,62 1,80 1,103 6.222}
{0 CHEMBL1269112,3 1,20 1,23 1,26 1,33 1,52 1,57 1,60 1,90 1,103 5.565}
{0 CHEMBL1269113,3 1,20 1,23 1,26 1,33 1,52 1,57 1,60 1,90 1,103 5.481}
{0 CHEMBL1271509,3 1,20 1,23 1,33 1,35 1,41 1,57 1,58 1,60 1,90 1,92 1,103 5.519}
{0 CHEMBL1271510,3 1,20 1,23 1,26 1,33 1,35 1,57 1,58 1,60 1,90 1,92 1,103 4.824}
{0 CHEMBL1271511,3 1,20 1,23 1,33 1,35 1,57 1,58 1,60 1,90 1,92 1,103 5.601}
{0 CHEMBL1271563,3 1,4 1,20 1,23 1,26 1,33 1,35 1,57 1,58 1,60 1,90 1,92 1,103 5.764}
{0 CHEMBL1271564,3 1,5 1,6 1,20 1,23 1,26 1,33 1,35 1,38 1,41 1,45 1,47 1,48 1,49 1,54 1,57 1,60 1,92 1,103 5.254}
{0 CHEMBL1271620,1 1,2 1,3 1,4 1,5 1,6 1,20 1,23 1,26 1,28 1,33 1,35 1,50 1,57 1,60 1,92 1,103 7.149}
{0 CHEMBL1271621,3 1,5 1,6 1,20 1,23 1,26 1,33 1,35 1,38 1,41 1,45 1,47 1,49 1,57 1,60 1,92 1,103 5.971}
{0 CHEMBL1271622,3 1,5 1,6 1,20 1,23 1,26 1,33 1,38 1,41 1,45 1,47 1,48 1,49 1,54 1,57 1,60 1,103 4.824}
{0 CHEMBL1271670,3 1,5 1,6 1,20 1,23 1,26 1,33 1,38 1,41 1,45 1,47 1,48 1,49 1,54 1,57 1,60 1,102 1,103 5.266}
{0 CHEMBL1271671,3 1,5 1,6 1,9 1,15 1,20 1,23 1,26 1,33 1,35 1,38 1,41 1,45 1,47 1,48 1,49 1,54 1,57 1,60 1,103 4.823}
{0 CHEMBL1271724,3 1,5 1,6 1,20 1,23 1,26 1,33 1,38 1,41 1,45 1,47 1,48 1,49 1,54 1,57 1,60 1,103 4.824}
{0 CHEMBL1271725,3 1,5 1,6 1,20 1,23 1,26 1,33 1,38 1,41 1,45 1,47 1,48 1,49 1,54 1,57 1,60 1,103 4.824}
{0 CHEMBL1271784,3 1,5 1,6 1,20 1,23 1,26 1,33 1,35 1,38 1,41 1,45 1,47 1,48 1,49 1,54 1,57 1,60 1,92 1,103 4.824}
{0 CHEMBL1271842,3 1,4 1,5 1,6 1,15 1,20 1,23 1,26 1,33 1,35 1,38 1,45 1,47 1,57 1,60 1,92 1,103 5.458}
{0 CHEMBL1271843,3 1,4 1,5 1,6 1,20 1,23 1,26 1,33 1,35 1,38 1,41 1,45 1,57 1,60 1,92 1,103 5.5}
{0 CHEMBL1271898,3 1,4 1,5 1,6 1,20 1,23 1,26 1,33 1,35 1,38 1,41 1,45 1,47 1,49 1,51 1,57 1,60 1,92 1,103 5.154}
{0 CHEMBL1271899,3 1,4 1,5 1,6 1,20 1,23 1,26 1,33 1,35 1,38 1,41 1,45 1,47 1,48 1,49 1,54 1,57 1,58 1,60 1,92 1,103 5.512}
{0 CHEMBL1271953,3 1,4 1,5 1,6 1,20 1,23 1,26 1,33 1,35 1,38 1,41 1,45 1,47 1,48 1,49 1,54 1,57 1,58 1,60 1,92 1,103 5.056}
{0 CHEMBL1271954,3 1,4 1,5 1,6 1,20 1,23 1,26 1,33 1,35 1,38 1,41 1,45 1,47 1,48 1,49 1,54 1,57 1,60 1,92 1,103 4.96}
{0 CHEMBL1272010,3 1,4 1,5 1,6 1,20 1,23 1,26 1,33 1,35 1,38 1,41 1,45 1,47 1,48 1,49 1,54 1,57 1,60 1,92 1,103 5.083}
{0 CHEMBL1272011,3 1,4 1,5 1,6 1,20 1,23 1,26 1,33 1,35 1,38 1,41 1,45 1,47 1,48 1,49 1,54 1,57 1,60 1,92 1,103 4.989}
{0 CHEMBL1272065,3 1,4 1,5 1,6 1,20 1,23 1,26 1,33 1,35 1,38 1,41 1,45 1,47 1,48 1,49 1,54 1,57 1,60 1,92 1,103 4.852}
{0 CHEMBL1272066,3 1,4 1,5 1,6 1,20 1,23 1,26 1,33 1,35 1,38 1,41 1,45 1,47 1,49 1,57 1,58 1,60 1,92 1,103 4.824}
{0 CHEMBL1272115,3 1,4 1,5 1,6 1,20 1,23 1,26 1,33 1,35 1,38 1,41 1,45 1,47 1,49 1,57 1,58 1,60 1,92 1,103 4.824}
{0 CHEMBL1272116,3 1,4 1,5 1,6 1,20 1,23 1,26 1,33 1,35 1,38 1,41 1,45 1,47 1,48 1,49 1,54 1,57 1,58 1,60 1,92 1,103 4.824}
{0 CHEMBL1272171,3 1,5 1,6 1,20 1,23 1,26 1,33 1,35 1,38 1,41 1,45 1,47 1,48 1,49 1,54 1,57 1,58 1,60 1,92 1,102 1,103 4.824}
{0 CHEMBL1272326,3 1,20 1,23 1,26 1,33 1,35 1,52 1,57 1,60 1,90 1,92 1,103 7.456}
{0 CHEMBL1272327,3 1,20 1,23 1,26 1,33 1,35 1,57 1,60 1,90 1,92 1,103 6.308}
{0 CHEMBL130395,26 1,34 1,35 1,55 1,57 1,58 1,103 4.788}
{0 CHEMBL132243,1 1,21 1,26 1,29 1,30 1,38 1,39 1,42 1,43 1,44 1,53 1,55 1,56 1,57 1,90 1,103 5.921}
{0 CHEMBL132687,21 1,26 1,29 1,38 1,39 1,42 1,53 1,55 1,56 1,57 1,90 1,103 5.602}
{0 CHEMBL132888,4 1,19 1,26 1,32 1,34 1,35 1,48 1,57 1,58 1,103 5.602}
{0 CHEMBL133498,4 1,19 1,26 1,32 1,34 1,35 1,57 1,58 1,103 6.886}
{0 CHEMBL133712,19 1,20 1,26 1,29 1,31 1,39 1,57 1,75 1,77 1,103 5.377}
{0 CHEMBL134003,21 1,26 1,29 1,38 1,39 1,42 1,53 1,55 1,56 1,57 1,90 1,103 5.523}
{0 CHEMBL134080,21 1,26 1,29 1,30 1,38 1,39 1,42 1,43 1,44 1,53 1,55 1,56 1,57 1,90 1,103 6.699}
{0 CHEMBL134233,21 1,26 1,29 1,38 1,39 1,42 1,53 1,55 1,56 1,57 1,90 1,103 5.523}
{0 CHEMBL134239,21 1,26 1,29 1,30 1,38 1,39 1,42 1,43 1,44 1,53 1,55 1,56 1,57 1,90 1,103 6.745}
{0 CHEMBL14762,21 1,26 1,29 1,38 1,39 1,42 1,53 1,55 1,56 1,57 1,90 1,103 6.402}
{0 CHEMBL162,12 1,19 1,26 1,29 1,57 1,97 1,103 8.886}
{0 CHEMBL1738758,1 1,3 1,5 1,6 1,13 1,15 1,19 1,20 1,23 1,26 1,28 1,33 1,46 1,50 1,57 1,58 1,79 1,103 5}
{0 CHEMBL179219,20 1,26 1,29 1,31 1,39 1,57 1,77 1,103 4}
{0 CHEMBL1802381,1 1,2 1,13 1,19 1,22 1,26 1,28 1,57 1,80 1,90 1,103 8}
{0 CHEMBL1802382,1 1,2 1,13 1,19 1,22 1,26 1,28 1,48 1,57 1,80 1,90 1,103 9}
{0 CHEMBL1802383,1 1,2 1,13 1,19 1,22 1,26 1,28 1,48 1,57 1,80 1,90 1,103 9}
{0 CHEMBL1802384,1 1,2 1,13 1,19 1,22 1,26 1,28 1,57 1,80 1,90 1,103 5.602}
{0 CHEMBL1802385,19 1,22 1,26 1,57 1,80 1,103 4.699}
{0 CHEMBL1802386,1 1,2 1,13 1,19 1,26 1,28 1,57 1,80 1,90 1,103 5.444}
{0 CHEMBL1802387,1 1,2 1,13 1,19 1,26 1,28 1,57 1,90 1,103 7.046}
{0 CHEMBL1802388,1 1,2 1,13 1,19 1,26 1,28 1,48 1,57 1,90 1,103 9}
{0 CHEMBL1802869,1 1,2 1,13 1,19 1,26 1,28 1,48 1,57 1,90 1,103 9}
{0 CHEMBL1802870,1 1,2 1,13 1,19 1,26 1,28 1,57 1,90 1,103 4.699}
{0 CHEMBL1802871,2 1,13 1,19 1,26 1,28 1,57 1,90 1,103 4.699}
{0 CHEMBL1802872,1 1,2 1,13 1,19 1,26 1,28 1,57 1,90 1,103 4.699}
{0 CHEMBL180341,1 1,2 1,3 1,4 1,5 1,6 1,19 1,20 1,26 1,28 1,29 1,31 1,34 1,35 1,50 1,51 1,52 1,57 1,103 5.712}
{0 CHEMBL180431,1 1,2 1,3 1,4 1,5 1,6 1,20 1,26 1,28 1,29 1,34 1,35 1,50 1,51 1,52 1,57 1,103 6.879}
{0 CHEMBL180993,1 1,2 1,3 1,4 1,5 1,6 1,20 1,26 1,28 1,29 1,31 1,34 1,35 1,51 1,52 1,57 1,103 6.09}
{0 CHEMBL181323,1 1,2 1,3 1,4 1,5 1,6 1,19 1,20 1,26 1,28 1,29 1,34 1,35 1,50 1,51 1,52 1,57 1,103 5.301}
{0 CHEMBL181416,1 1,2 1,3 1,4 1,5 1,6 1,20 1,26 1,28 1,29 1,34 1,35 1,50 1,51 1,52 1,57 1,103 6.4}
{0 CHEMBL181803,1 1,2 1,3 1,4 1,5 1,6 1,20 1,26 1,28 1,29 1,34 1,35 1,50 1,51 1,52 1,57 1,103 5.301}
{0 CHEMBL181834,1 1,2 1,3 1,4 1,5 1,6 1,19 1,20 1,26 1,28 1,29 1,34 1,35 1,50 1,51 1,52 1,57 1,103 5.301}
{0 CHEMBL182011,1 1,2 1,3 1,4 1,5 1,6 1,19 1,20 1,26 1,28 1,29 1,34 1,35 1,50 1,51 1,52 1,57 1,103 5.706}
{0 CHEMBL1821761,1 1,2 1,3 1,4 1,5 1,6 1,7 1,11 1,13 1,14 1,15 1,16 1,17 1,18 1,19 1,20 1,26 1,28 1,30 1,32 1,50 1,57 1,103 8.301}
{0 CHEMBL182498,1 1,2 1,3 1,4 1,5 1,6 1,20 1,26 1,28 1,29 1,34 1,35 1,51 1,52 1,57 1,103 6.129}
{0 CHEMBL1825089,1 1,2 1,3 1,4 1,5 1,6 1,7 1,11 1,13 1,14 1,15 1,16 1,17 1,18 1,19 1,20 1,26 1,28 1,30 1,32 1,50 1,57 1,58 1,103 7.638}
{0 CHEMBL1825090,1 1,2 1,3 1,4 1,5 1,6 1,7 1,11 1,13 1,14 1,15 1,16 1,17 1,18 1,19 1,20 1,26 1,28 1,30 1,32 1,50 1,57 1,58 1,103 8.301}
{0 CHEMBL1825091,1 1,2 1,3 1,4 1,5 1,6 1,7 1,11 1,13 1,14 1,15 1,16 1,17 1,18 1,19 1,20 1,26 1,28 1,30 1,32 1,50 1,57 1,103 8.222}
{0 CHEMBL1825092,1 1,2 1,3 1,4 1,5 1,6 1,7 1,11 1,13 1,14 1,15 1,16 1,17 1,18 1,19 1,20 1,26 1,28 1,30 1,32 1,50 1,57 1,103 7.046}
{0 CHEMBL1825093,1 1,2 1,3 1,4 1,5 1,6 1,7 1,11 1,13 1,14 1,15 1,16 1,17 1,18 1,19 1,20 1,26 1,28 1,30 1,32 1,50 1,57 1,103 8.301}
{0 CHEMBL1825094,1 1,2 1,3 1,4 1,5 1,6 1,7 1,11 1,13 1,14 1,15 1,16 1,17 1,18 1,19 1,20 1,26 1,28 1,30 1,32 1,50 1,57 1,103 7.638}
{0 CHEMBL1825095,1 1,2 1,3 1,4 1,5 1,6 1,7 1,11 1,13 1,14 1,15 1,16 1,17 1,18 1,19 1,20 1,26 1,28 1,30 1,32 1,50 1,57 1,58 1,103 8.222}
{0 CHEMBL1825096,1 1,2 1,3 1,5 1,6 1,7 1,11 1,13 1,14 1,15 1,17 1,18 1,19 1,20 1,26 1,28 1,30 1,32 1,38 1,41 1,47 1,57 1,90 1,103 8.155}
{0 CHEMBL1825097,1 1,2 1,3 1,5 1,6 1,7 1,11 1,13 1,14 1,15 1,16 1,17 1,18 1,19 1,20 1,26 1,28 1,30 1,32 1,57 1,58 1,103 7.509}
{0 CHEMBL1825098,1 1,2 1,3 1,5 1,6 1,7 1,11 1,13 1,14 1,15 1,16 1,17 1,18 1,19 1,20 1,26 1,28 1,30 1,32 1,57 1,58 1,103 8}
{0 CHEMBL1825099,1 1,2 1,3 1,5 1,6 1,7 1,11 1,13 1,14 1,15 1,16 1,17 1,18 1,19 1,20 1,26 1,28 1,30 1,32 1,57 1,58 1,103 8}
{0 CHEMBL1825100,1 1,2 1,3 1,5 1,6 1,7 1,11 1,13 1,14 1,15 1,16 1,17 1,18 1,19 1,20 1,26 1,28 1,30 1,32 1,57 1,103 8.398}
{0 CHEMBL1825101,1 1,2 1,3 1,5 1,6 1,7 1,11 1,13 1,14 1,15 1,16 1,17 1,18 1,19 1,20 1,26 1,28 1,30 1,32 1,57 1,103 8.523}
{0 CHEMBL1825102,1 1,2 1,3 1,5 1,6 1,7 1,11 1,13 1,14 1,15 1,16 1,17 1,18 1,19 1,20 1,26 1,28 1,30 1,32 1,57 1,103 7.886}
{0 CHEMBL1825103,3 1,5 1,6 1,7 1,11 1,13 1,14 1,15 1,16 1,17 1,18 1,19 1,20 1,26 1,30 1,32 1,38 1,41 1,45 1,47 1,48 1,49 1,54 1,57 1,103 5}
{0 CHEMBL182641,1 1,2 1,3 1,4 1,5 1,6 1,20 1,26 1,28 1,29 1,34 1,35 1,50 1,51 1,52 1,57 1,103 6.296}
{0 CHEMBL182843,1 1,2 1,3 1,4 1,5 1,6 1,20 1,26 1,28 1,29 1,34 1,35 1,51 1,52 1,57 1,103 6.67}
{0 CHEMBL183200,1 1,2 1,3 1,4 1,5 1,6 1,20 1,26 1,28 1,29 1,34 1,35 1,50 1,51 1,52 1,57 1,103 5.301}
{0 CHEMBL183269,1 1,2 1,3 1,4 1,5 1,6 1,20 1,26 1,28 1,29 1,34 1,35 1,50 1,51 1,52 1,57 1,103 5.301}
{0 CHEMBL183408,20 1,26 1,29 1,31 1,54 1,57 1,77 1,103 4.192}
{0 CHEMBL183455,1 1,2 1,3 1,4 1,5 1,6 1,20 1,26 1,28 1,29 1,34 1,35 1,51 1,52 1,57 1,103 6.096}
{0 CHEMBL183511,1 1,2 1,3 1,4 1,5 1,6 1,20 1,26 1,28 1,29 1,34 1,35 1,50 1,51 1,52 1,57 1,103 5.886}
{0 CHEMBL183855,1 1,2 1,3 1,4 1,5 1,6 1,20 1,26 1,28 1,29 1,34 1,35 1,50 1,51 1,52 1,57 1,103 5.301}
{0 CHEMBL1921805,20 1,21 1,26 1,29 1,38 1,39 1,42 1,53 1,55 1,56 1,57 1,59 1,90 1,103 4.62}
{0 CHEMBL1922114,20 1,21 1,26 1,29 1,38 1,39 1,42 1,53 1,55 1,56 1,57 1,59 1,90 1,103 4.409}
{0 CHEMBL1922115,20 1,21 1,26 1,29 1,38 1,39 1,42 1,53 1,55 1,56 1,57 1,59 1,90 1,103 4.456}
{0 CHEMBL1922116,20 1,21 1,26 1,29 1,38 1,39 1,42 1,53 1,55 1,56 1,57 1,59 1,90 1,103 4.076}
{0 CHEMBL1922118,20 1,21 1,26 1,29 1,38 1,39 1,42 1,53 1,55 1,56 1,57 1,59 1,90 1,103 4.357}
{0 CHEMBL1922119,20 1,21 1,26 1,29 1,38 1,39 1,42 1,53 1,55 1,56 1,57 1,90 1,103 5.31}
{0 CHEMBL1922120,20 1,21 1,26 1,29 1,38 1,39 1,42 1,53 1,55 1,56 1,57 1,90 1,103 4.921}
{0 CHEMBL1922121,20 1,21 1,26 1,29 1,38 1,39 1,42 1,53 1,55 1,56 1,57 1,90 1,103 4.699}
{0 CHEMBL1922122,20 1,21 1,22 1,26 1,29 1,38 1,39 1,42 1,53 1,55 1,56 1,57 1,90 1,103 4.638}
{0 CHEMBL1922123,20 1,21 1,26 1,29 1,38 1,39 1,42 1,53 1,55 1,56 1,57 1,90 1,103 5.208}
{0 CHEMBL1922199,21 1,26 1,29 1,38 1,39 1,42 1,53 1,55 1,56 1,57 1,90 1,103 4.745}
{0 CHEMBL1922200,21 1,26 1,29 1,38 1,39 1,42 1,53 1,55 1,56 1,57 1,90 1,103 4.658}
{0 CHEMBL1922201,21 1,26 1,29 1,38 1,39 1,42 1,53 1,55 1,56 1,57 1,90 1,103 4.553}
{0 CHEMBL1922202,21 1,22 1,26 1,29 1,38 1,39 1,42 1,53 1,55 1,56 1,57 1,90 1,103 4.523}
{0 CHEMBL1922203,21 1,26 1,29 1,38 1,39 1,42 1,53 1,55 1,56 1,57 1,90 1,103 4.77}
{0 CHEMBL1922204,20 1,21 1,26 1,29 1,38 1,39 1,42 1,53 1,55 1,56 1,57 1,59 1,90 1,103 5.051}
{0 CHEMBL1922205,20 1,21 1,26 1,29 1,38 1,39 1,42 1,53 1,55 1,56 1,57 1,59 1,90 1,103 4.398}
{0 CHEMBL1922208,20 1,21 1,26 1,29 1,38 1,39 1,42 1,53 1,55 1,56 1,57 1,90 1,103 5.658}
{0 CHEMBL1922209,20 1,21 1,26 1,29 1,38 1,39 1,42 1,53 1,55 1,56 1,57 1,90 1,103 4.886}
{0 CHEMBL1922210,20 1,21 1,26 1,29 1,38 1,39 1,42 1,53 1,55 1,56 1,57 1,90 1,103 4.658}
{0 CHEMBL1922211,20 1,21 1,22 1,26 1,29 1,38 1,39 1,42 1,53 1,55 1,56 1,57 1,90 1,103 4.678}
{0 CHEMBL1922212,20 1,21 1,26 1,29 1,38 1,39 1,42 1,53 1,55 1,56 1,57 1,90 1,103 5.357}
{0 CHEMBL1922213,21 1,26 1,29 1,38 1,39 1,42 1,53 1,55 1,56 1,57 1,90 1,103 5.032}
{0 CHEMBL1922214,21 1,26 1,29 1,38 1,39 1,42 1,53 1,55 1,56 1,57 1,90 1,103 4.721}
{0 CHEMBL1922215,21 1,26 1,29 1,38 1,39 1,42 1,53 1,55 1,56 1,57 1,90 1,103 4.469}
{0 CHEMBL1922216,21 1,22 1,26 1,29 1,38 1,39 1,42 1,53 1,55 1,56 1,57 1,90 1,103 4.347}
{0 CHEMBL1922217,21 1,26 1,29 1,38 1,39 1,42 1,53 1,55 1,56 1,57 1,90 1,103 5.041}
{0 CHEMBL1923087,4 1,9 1,19 1,38 1,39 1,57 1,68 1,84 1,103 8.854}
{0 CHEMBL1923095,9 1,19 1,20 1,25 1,26 1,33 1,38 1,39 1,57 1,58 1,84 1,103 4}
{0 CHEMBL1923096,9 1,19 1,20 1,25 1,26 1,33 1,38 1,39 1,57 1,58 1,84 1,103 4}
{0 CHEMBL1923097,4 1,9 1,19 1,25 1,26 1,33 1,38 1,39 1,57 1,58 1,84 1,103 4}
{0 CHEMBL1929238,2 1,19 1,26 1,28 1,38 1,48 1,57 1,58 1,62 1,90 1,103 4.523}
{0 CHEMBL1933576,1 1,3 1,5 1,6 1,19 1,20 1,23 1,26 1,28 1,33 1,50 1,57 1,58 1,103 5}
{0 CHEMBL1933582,1 1,3 1,5 1,6 1,19 1,20 1,23 1,26 1,28 1,33 1,50 1,57 1,58 1,60 1,103 5}
{0 CHEMBL2017214,2 1,6 1,26 1,28 1,29 1,38 1,39 1,42 1,54 1,57 1,90 1,103 4.398}
{0 CHEMBL2035810,2 1,4 1,6 1,9 1,19 1,20 1,26 1,28 1,38 1,39 1,57 1,103 5.523}
{0 CHEMBL2063926,2 1,6 1,26 1,28 1,29 1,38 1,39 1,42 1,54 1,57 1,58 1,90 1,103 5}
{0 CHEMBL206627,19 1,20 1,25 1,26 1,29 1,45 1,53 1,57 1,103 4}
{0 CHEMBL2088826,1 1,2 1,3 1,4 1,5 1,6 1,13 1,15 1,19 1,20 1,23 1,26 1,28 1,29 1,33 1,57 1,103 7.018}
{0 CHEMBL2088827,1 1,2 1,3 1,4 1,5 1,6 1,13 1,15 1,19 1,20 1,23 1,26 1,28 1,29 1,33 1,57 1,103 7.215}
{0 CHEMBL2088828,1 1,2 1,3 1,4 1,5 1,6 1,13 1,15 1,19 1,20 1,23 1,26 1,28 1,29 1,30 1,33 1,57 1,103 7.26}
{0 CHEMBL2088829,1 1,2 1,3 1,4 1,5 1,6 1,13 1,15 1,19 1,20 1,23 1,26 1,28 1,29 1,30 1,33 1,57 1,103 6.327}
{0 CHEMBL2088835,1 1,2 1,3 1,4 1,5 1,6 1,13 1,15 1,19 1,20 1,23 1,26 1,28 1,29 1,30 1,33 1,57 1,103 6.896}
{0 CHEMBL2088836,1 1,2 1,3 1,4 1,5 1,6 1,13 1,15 1,19 1,20 1,23 1,26 1,28 1,29 1,30 1,33 1,57 1,103 6.025}
{0 CHEMBL2088837,1 1,2 1,3 1,4 1,5 1,6 1,13 1,15 1,19 1,20 1,23 1,26 1,28 1,29 1,33 1,57 1,103 6.542}
{0 CHEMBL2088838,1 1,2 1,3 1,4 1,5 1,6 1,13 1,15 1,19 1,20 1,23 1,26 1,28 1,29 1,33 1,57 1,103 5.344}
{0 CHEMBL2088839,1 1,2 1,3 1,4 1,5 1,6 1,7 1,15 1,19 1,20 1,26 1,28 1,29 1,51 1,57 1,103 7.553}
{0 CHEMBL2088840,1 1,2 1,3 1,4 1,5 1,6 1,7 1,15 1,19 1,20 1,26 1,28 1,29 1,51 1,57 1,103 7.276}
{0 CHEMBL2089057,13 1,15 1,19 1,26 1,28 1,57 1,58 1,62 1,103 4.824}
{0 CHEMBL2089062,19 1,20 1,26 1,28 1,29 1,33 1,50 1,57 1,58 1,86 1,103 5.051}
{0 CHEMBL2089063,19 1,20 1,26 1,28 1,29 1,33 1,50 1,57 1,58 1,86 1,103 5.921}
{0 CHEMBL2089064,19 1,20 1,26 1,28 1,33 1,57 1,58 1,103 4.824}
{0 CHEMBL2089065,19 1,20 1,23 1,26 1,28 1,57 1,58 1,62 1,103 5.252}
{0 CHEMBL2089066,13 1,15 1,19 1,20 1,26 1,28 1,29 1,33 1,50 1,57 1,58 1,86 1,103 4.824}
{0 CHEMBL215919,2 1,4 1,6 1,20 1,21 1,26 1,27 1,28 1,29 1,33 1,38 1,39 1,42 1,53 1,55 1,56 1,57 1,90 1,103 6.658}
{0 CHEMBL2312182,1 1,2 1,3 1,4 1,5 1,6 1,10 1,12 1,20 1,22 1,23 1,26 1,27 1,28 1,31 1,33 1,46 1,57 1,58 1,90 1,103 8.222}
{0 CHEMBL2312183,1 1,2 1,3 1,4 1,5 1,6 1,10 1,12 1,19 1,20 1,22 1,23 1,26 1,27 1,28 1,31 1,33 1,46 1,57 1,58 1,90 1,103 7.921}
{0 CHEMBL2312185,1 1,2 1,3 1,4 1,5 1,6 1,10 1,12 1,20 1,22 1,23 1,26 1,27 1,28 1,31 1,33 1,46 1,50 1,57 1,58 1,90 1,103 6.726}
{0 CHEMBL2312193,1 1,2 1,3 1,4 1,5 1,6 1,10 1,12 1,20 1,23 1,26 1,27 1,28 1,33 1,57 1,90 1,103 5.301}
{0 CHEMBL2335927,8 1,9 1,21 1,24 1,29 1,39 1,42 1,53 1,57 1,103 4.418}
{0 CHEMBL2335928,8 1,9 1,21 1,24 1,29 1,39 1,42 1,53 1,57 1,103 4.253}
{0 CHEMBL2335929,8 1,9 1,21 1,24 1,29 1,39 1,42 1,53 1,55 1,56 1,57 1,103 4.83}
{0 CHEMBL2335930,8 1,9 1,21 1,24 1,29 1,39 1,42 1,53 1,57 1,103 4}
{0 CHEMBL2335931,8 1,9 1,21 1,24 1,29 1,39 1,42 1,53 1,57 1,103 4.9}
{0 CHEMBL2335932,8 1,9 1,21 1,29 1,38 1,39 1,42 1,53 1,57 1,90 1,103 4}
{0 CHEMBL2335933,8 1,9 1,21 1,29 1,38 1,39 1,42 1,53 1,57 1,90 1,103 4}
{0 CHEMBL2336367,8 1,9 1,21 1,24 1,29 1,39 1,42 1,53 1,57 1,103 4.301}
{0 CHEMBL2336368,8 1,9 1,21 1,29 1,38 1,39 1,42 1,53 1,57 1,58 1,90 1,103 4}
{0 CHEMBL2336369,21 1,29 1,39 1,42 1,53 1,57 1,103 4}
{0 CHEMBL2336370,8 1,9 1,21 1,29 1,38 1,39 1,42 1,53 1,55 1,56 1,57 1,103 4.188}
{0 CHEMBL2336371,8 1,9 1,21 1,29 1,38 1,39 1,42 1,53 1,57 1,103 4.426}
{0 CHEMBL2336372,8 1,9 1,21 1,24 1,29 1,39 1,42 1,53 1,57 1,58 1,103 4}
{0 CHEMBL2336373,21 1,24 1,29 1,39 1,42 1,53 1,55 1,56 1,57 1,90 1,103 4.821}
{0 CHEMBL2336374,21 1,24 1,29 1,39 1,42 1,53 1,55 1,56 1,57 1,90 1,103 5.387}
{0 CHEMBL2336375,21 1,24 1,29 1,39 1,42 1,53 1,55 1,56 1,57 1,90 1,103 5.377}
{0 CHEMBL2336376,21 1,29 1,39 1,42 1,53 1,55 1,56 1,57 1,103 4.322}
{0 CHEMBL2336377,21 1,24 1,29 1,39 1,42 1,53 1,55 1,56 1,57 1,90 1,103 5.678}
{0 CHEMBL2336378,21 1,29 1,39 1,42 1,53 1,55 1,56 1,57 1,103 5.092}
{0 CHEMBL2336379,21 1,24 1,29 1,39 1,42 1,53 1,55 1,56 1,57 1,90 1,103 6.046}
{0 CHEMBL2336380,21 1,29 1,39 1,42 1,53 1,55 1,56 1,57 1,103 4.807}
{0 CHEMBL2336381,21 1,24 1,29 1,39 1,42 1,53 1,55 1,56 1,57 1,90 1,103 5.699}
{0 CHEMBL2336382,21 1,29 1,39 1,42 1,53 1,55 1,56 1,57 1,103 5.959}
{0 CHEMBL2336383,21 1,24 1,29 1,39 1,42 1,53 1,55 1,56 1,57 1,90 1,103 5.959}
{0 CHEMBL2336384,21 1,24 1,29 1,39 1,42 1,52 1,53 1,55 1,56 1,57 1,90 1,103 5.194}
{0 CHEMBL2336385,21 1,29 1,39 1,42 1,52 1,53 1,55 1,56 1,57 1,103 4}
{0 CHEMBL2336386,21 1,29 1,39 1,42 1,53 1,55 1,56 1,57 1,103 5.824}
{0 CHEMBL2336387,21 1,29 1,39 1,42 1,52 1,53 1,55 1,56 1,57 1,103 4.089}
{0 CHEMBL2336388,21 1,29 1,39 1,42 1,53 1,55 1,56 1,57 1,103 5.208}
{0 CHEMBL2347594,1 1,2 1,3 1,4 1,5 1,6 1,10 1,12 1,19 1,20 1,22 1,23 1,26 1,27 1,28 1,31 1,33 1,57 1,90 1,103 5.846}
{0 CHEMBL2347595,1 1,2 1,3 1,4 1,5 1,6 1,10 1,12 1,19 1,20 1,22 1,23 1,26 1,27 1,28 1,31 1,33 1,57 1,90 1,103 8.222}
{0 CHEMBL2347596,1 1,2 1,3 1,4 1,5 1,6 1,10 1,12 1,19 1,20 1,22 1,23 1,26 1,27 1,28 1,31 1,33 1,57 1,90 1,103 5.301}
{0 CHEMBL2347597,1 1,2 1,3 1,4 1,5 1,6 1,10 1,12 1,19 1,20 1,22 1,23 1,26 1,27 1,28 1,31 1,33 1,57 1,90 1,103 8.398}
{0 CHEMBL2348637,1 1,2 1,3 1,4 1,5 1,6 1,10 1,12 1,19 1,20 1,22 1,23 1,26 1,27 1,28 1,31 1,33 1,57 1,90 1,103 7.721}
{0 CHEMBL2348638,1 1,2 1,3 1,4 1,5 1,6 1,10 1,12 1,19 1,20 1,22 1,23 1,26 1,27 1,28 1,31 1,33 1,46 1,57 1,90 1,103 7.208}
{0 CHEMBL2348639,1 1,2 1,3 1,4 1,5 1,6 1,10 1,12 1,19 1,20 1,22 1,23 1,26 1,27 1,28 1,31 1,33 1,46 1,57 1,90 1,103 6.103}
{0 CHEMBL2348641,1 1,2 1,3 1,4 1,5 1,6 1,10 1,12 1,19 1,20 1,22 1,23 1,26 1,27 1,28 1,31 1,33 1,46 1,50 1,57 1,58 1,90 1,103 7.367}
{0 CHEMBL2348642,1 1,2 1,3 1,4 1,5 1,6 1,10 1,12 1,20 1,22 1,23 1,26 1,27 1,28 1,31 1,33 1,46 1,50 1,57 1,58 1,90 1,103 7.377}
{0 CHEMBL2348643,1 1,2 1,3 1,4 1,5 1,6 1,10 1,12 1,19 1,20 1,22 1,23 1,26 1,27 1,28 1,31 1,33 1,46 1,50 1,57 1,58 1,90 1,103 7.347}
{0 CHEMBL2348644,1 1,2 1,3 1,4 1,5 1,6 1,10 1,12 1,20 1,22 1,23 1,26 1,27 1,28 1,31 1,33 1,46 1,50 1,57 1,58 1,90 1,103 7.102}
{0 CHEMBL2348645,1 1,2 1,3 1,4 1,5 1,6 1,10 1,12 1,20 1,22 1,23 1,26 1,27 1,28 1,31 1,33 1,46 1,50 1,57 1,58 1,90 1,103 7.456}
{0 CHEMBL2348646,1 1,2 1,3 1,4 1,5 1,6 1,10 1,12 1,19 1,20 1,22 1,23 1,26 1,27 1,28 1,31 1,33 1,50 1,57 1,90 1,103 7.585}
{0 CHEMBL2348647,1 1,2 1,3 1,4 1,5 1,6 1,10 1,12 1,20 1,22 1,23 1,26 1,27 1,28 1,31 1,33 1,50 1,57 1,90 1,103 7.62}
{0 CHEMBL2348648,1 1,2 1,3 1,4 1,5 1,6 1,10 1,12 1,19 1,20 1,22 1,23 1,26 1,27 1,28 1,31 1,33 1,50 1,57 1,90 1,103 7.745}
{0 CHEMBL2348649,1 1,2 1,3 1,4 1,5 1,6 1,10 1,12 1,20 1,22 1,23 1,26 1,27 1,28 1,31 1,33 1,50 1,57 1,90 1,103 7.056}
{0 CHEMBL2348650,1 1,2 1,3 1,4 1,5 1,6 1,10 1,12 1,20 1,22 1,23 1,26 1,27 1,28 1,31 1,33 1,50 1,57 1,90 1,103 7.328}
{0 CHEMBL2348651,1 1,2 1,3 1,4 1,5 1,6 1,10 1,12 1,19 1,20 1,22 1,23 1,26 1,27 1,28 1,31 1,33 1,46 1,48 1,50 1,57 1,58 1,90 1,103 7.041}
{0 CHEMBL2348652,1 1,2 1,3 1,4 1,5 1,6 1,10 1,12 1,20 1,22 1,23 1,26 1,27 1,28 1,31 1,33 1,50 1,57 1,90 1,103 6.71}
{0 CHEMBL2348653,1 1,2 1,3 1,4 1,5 1,6 1,10 1,12 1,20 1,22 1,23 1,26 1,28 1,31 1,33 1,57 1,90 1,103 5.301}
{0 CHEMBL2348654,1 1,2 1,3 1,4 1,5 1,6 1,10 1,12 1,20 1,22 1,23 1,26 1,28 1,31 1,33 1,57 1,90 1,103 6.255}
{0 CHEMBL2348840,1 1,2 1,3 1,4 1,5 1,6 1,10 1,12 1,20 1,22 1,23 1,26 1,28 1,31 1,33 1,57 1,90 1,103 6.476}
{0 CHEMBL2348841,1 1,2 1,3 1,4 1,5 1,6 1,10 1,12 1,19 1,20 1,22 1,23 1,26 1,28 1,31 1,33 1,57 1,90 1,103 6.812}
{0 CHEMBL2348842,1 1,2 1,3 1,4 1,5 1,6 1,10 1,12 1,19 1,20 1,22 1,23 1,26 1,28 1,31 1,33 1,57 1,90 1,102 1,103 8.824}
{0 CHEMBL2348843,1 1,2 1,3 1,4 1,5 1,6 1,10 1,12 1,19 1,20 1,22 1,23 1,26 1,28 1,31 1,33 1,57 1,90 1,102 1,103 9.301}
{0 CHEMBL2348844,1 1,2 1,3 1,4 1,5 1,6 1,10 1,12 1,19 1,20 1,23 1,26 1,28 1,33 1,57 1,90 1,103 9}
{0 CHEMBL2348845,1 1,2 1,3 1,4 1,5 1,6 1,10 1,12 1,19 1,20 1,23 1,26 1,28 1,33 1,57 1,90 1,103 8.398}
{0 CHEMBL2348846,1 1,2 1,3 1,4 1,5 1,6 1,10 1,12 1,19 1,20 1,22 1,23 1,26 1,28 1,31 1,33 1,35 1,57 1,90 1,103 7.745}
{0 CHEMBL2348847,1 1,2 1,3 1,4 1,5 1,6 1,10 1,12 1,19 1,20 1,22 1,23 1,26 1,28 1,31 1,33 1,35 1,57 1,90 1,103 8.699}
{0 CHEMBL2348848,1 1,2 1,3 1,4 1,5 1,6 1,10 1,12 1,20 1,22 1,23 1,26 1,28 1,31 1,33 1,35 1,50 1,57 1,90 1,103 6.754}
{0 CHEMBL259244,8 1,9 1,21 1,24 1,28 1,29 1,36 1,37 1,40 1,48 1,57 1,103 4.569}
{0 CHEMBL261644,6 1,19 1,20 1,26 1,29 1,53 1,57 1,103 7.456}
{0 CHEMBL26564,21 1,26 1,29 1,30 1,38 1,39 1,42 1,43 1,44 1,53 1,55 1,56 1,57 1,90 1,103 6.699}
{0 CHEMBL269872,8 1,9 1,21 1,24 1,25 1,28 1,29 1,36 1,37 1,40 1,48 1,57 1,66 1,103 4.678}
{0 CHEMBL269881,8 1,9 1,24 1,25 1,28 1,48 1,57 1,103 5.228}
{0 CHEMBL270483,8 1,9 1,24 1,25 1,28 1,48 1,57 1,103 4.041}
{0 CHEMBL270945,8 1,9 1,21 1,24 1,25 1,28 1,29 1,36 1,37 1,40 1,48 1,57 1,103 4.208}
{0 CHEMBL270946,8 1,9 1,21 1,24 1,25 1,28 1,29 1,36 1,37 1,40 1,48 1,57 1,103 4.495}
{0 CHEMBL270979,8 1,9 1,24 1,25 1,28 1,48 1,57 1,66 1,103 4.432}
{0 CHEMBL270980,8 1,9 1,21 1,24 1,25 1,28 1,29 1,36 1,37 1,40 1,48 1,57 1,103 4.347}
{0 CHEMBL270982,8 1,9 1,21 1,24 1,25 1,28 1,29 1,36 1,37 1,40 1,48 1,57 1,75 1,103 4.721}
{0 CHEMBL271564,8 1,9 1,21 1,24 1,25 1,28 1,29 1,36 1,37 1,40 1,48 1,57 1,103 4.119}
{0 CHEMBL271593,8 1,9 1,24 1,25 1,28 1,48 1,57 1,103 4.824}
{0 CHEMBL272186,19 1,26 1,28 1,40 1,57 1,103 4.824}
{0 CHEMBL272399,19 1,26 1,28 1,57 1,103 4}
{0 CHEMBL272400,19 1,26 1,28 1,57 1,89 1,103 4}
{0 CHEMBL272692,8 1,9 1,21 1,24 1,25 1,28 1,29 1,36 1,37 1,40 1,48 1,57 1,103 4.125}
{0 CHEMBL272872,8 1,9 1,24 1,25 1,28 1,48 1,57 1,103 4.387}
{0 CHEMBL280074,21 1,26 1,29 1,38 1,39 1,42 1,53 1,57 1,90 1,103 5.155}
{0 CHEMBL296586,2 1,13 1,19 1,26 1,28 1,57 1,90 1,103 6.398}
{0 CHEMBL303379,6 1,8 1,9 1,24 1,25 1,38 1,57 1,79 1,103 5.398}
{0 CHEMBL303958,6 1,8 1,9 1,24 1,25 1,38 1,57 1,79 1,103 5.538}
{0 CHEMBL323015,4 1,19 1,26 1,32 1,34 1,35 1,57 1,58 1,103 5.194}
{0 CHEMBL325053,8 1,9 1,24 1,25 1,28 1,48 1,49 1,57 1,58 1,103 4.167}
{0 CHEMBL326843,4 1,19 1,26 1,32 1,34 1,35 1,57 1,58 1,103 6.337}
{0 CHEMBL334050,8 1,9 1,24 1,25 1,26 1,28 1,48 1,57 1,103 4.602}
{0 CHEMBL334881,4 1,19 1,26 1,32 1,34 1,35 1,57 1,58 1,103 5.215}
{0 CHEMBL335069,21 1,26 1,29 1,38 1,39 1,42 1,53 1,55 1,56 1,57 1,90 1,103 5.347}
{0 CHEMBL335852,21 1,26 1,29 1,38 1,39 1,42 1,53 1,55 1,56 1,57 1,90 1,103 5.553}
{0 CHEMBL336351,21 1,26 1,29 1,30 1,38 1,39 1,42 1,43 1,44 1,53 1,55 1,56 1,57 1,90 1,103 6.222}
{0 CHEMBL336776,21 1,26 1,29 1,30 1,38 1,39 1,42 1,43 1,44 1,53 1,55 1,56 1,57 1,90 1,103 6.301}
{0 CHEMBL337411,21 1,26 1,29 1,30 1,38 1,39 1,42 1,43 1,44 1,53 1,55 1,56 1,57 1,90 1,103 6.456}
{0 CHEMBL338924,21 1,26 1,29 1,38 1,39 1,42 1,53 1,55 1,56 1,57 1,90 1,103 5.886}
{0 CHEMBL352516,21 1,26 1,29 1,38 1,39 1,42 1,53 1,55 1,56 1,57 1,90 1,103 6}
{0 CHEMBL359679,1 1,2 1,3 1,4 1,5 1,6 1,20 1,26 1,28 1,29 1,34 1,35 1,51 1,52 1,57 1,103 5.983}
{0 CHEMBL359951,1 1,2 1,3 1,4 1,5 1,6 1,19 1,20 1,26 1,28 1,29 1,34 1,35 1,50 1,51 1,52 1,57 1,103 6.569}
{0 CHEMBL360250,1 1,2 1,3 1,4 1,5 1,6 1,19 1,20 1,26 1,28 1,29 1,34 1,35 1,50 1,51 1,52 1,57 1,103 6.097}
{0 CHEMBL360342,1 1,2 1,3 1,4 1,5 1,6 1,20 1,26 1,28 1,29 1,31 1,34 1,35 1,50 1,51 1,52 1,57 1,103 7.523}
{0 CHEMBL360675,1 1,2 1,3 1,4 1,5 1,6 1,19 1,20 1,24 1,26 1,28 1,50 1,57 1,61 1,103 5.301}
{0 CHEMBL361537,20 1,26 1,29 1,31 1,54 1,57 1,77 1,103 4}
{0 CHEMBL361565,20 1,26 1,29 1,31 1,77 1,103 4}
{0 CHEMBL361573,20 1,26 1,29 1,31 1,77 1,103 4.151}
{0 CHEMBL361621,1 1,2 1,3 1,4 1,5 1,6 1,20 1,26 1,28 1,29 1,34 1,35 1,50 1,51 1,52 1,57 1,103 5.301}
{0 CHEMBL361708,6 1,19 1,26 1,57 1,103 7.658}
{0 CHEMBL361769,1 1,2 1,3 1,4 1,5 1,6 1,20 1,26 1,28 1,29 1,34 1,35 1,50 1,51 1,52 1,57 1,103 5.301}
{0 CHEMBL361958,1 1,2 1,3 1,4 1,5 1,6 1,19 1,20 1,26 1,28 1,29 1,34 1,35 1,50 1,51 1,52 1,57 1,103 5.799}
{0 CHEMBL361987,1 1,2 1,3 1,4 1,5 1,6 1,20 1,26 1,28 1,29 1,31 1,34 1,35 1,51 1,52 1,57 1,103 6.119}
{0 CHEMBL37139,19 1,20 1,25 1,26 1,29 1,57 1,71 1,82 1,103 5}
{0 CHEMBL402453,8 1,9 1,21 1,24 1,25 1,28 1,29 1,36 1,37 1,40 1,48 1,57 1,103 4.77}
{0 CHEMBL405197,8 1,9 1,19 1,21 1,24 1,25 1,28 1,29 1,36 1,37 1,40 1,48 1,57 1,103 4.721}
{0 CHEMBL405259,8 1,9 1,24 1,25 1,28 1,48 1,57 1,93 1,103 4.721}
{0 CHEMBL405533,8 1,9 1,19 1,21 1,24 1,25 1,28 1,29 1,36 1,37 1,40 1,48 1,57 1,103 4.444}
{0 CHEMBL406495,8 1,9 1,21 1,24 1,25 1,28 1,29 1,36 1,37 1,40 1,48 1,57 1,103 4.432}
{0 CHEMBL407018,19 1,26 1,28 1,57 1,103 4}
{0 CHEMBL407486,19 1,26 1,28 1,57 1,103 4}
{0 CHEMBL407487,19 1,26 1,28 1,57 1,103 4}
{0 CHEMBL407874,8 1,9 1,24 1,26 1,28 1,48 1,57 1,103 4.62}
{0 CHEMBL407876,8 1,9 1,21 1,24 1,25 1,28 1,29 1,36 1,37 1,40 1,48 1,57 1,103 4.495}
{0 CHEMBL407877,8 1,9 1,21 1,24 1,25 1,28 1,29 1,36 1,37 1,40 1,48 1,57 1,103 4.959}
{0 CHEMBL408543,19 1,24 1,26 1,28 1,57 1,103 4}
{0 CHEMBL420860,8 1,9 1,19 1,21 1,24 1,25 1,28 1,29 1,36 1,37 1,40 1,48 1,57 1,103 4.444}
{0 CHEMBL428690,19 1,26 1,34 1,35 1,57 1,58 1,103 6.699}
{0 CHEMBL429409,8 1,9 1,24 1,25 1,28 1,48 1,57 1,93 1,103 4.959}
{0 CHEMBL429744,3 1,8 1,9 1,19 1,21 1,24 1,25 1,28 1,29 1,36 1,37 1,40 1,42 1,48 1,57 1,103 4.409}
{0 CHEMBL430574,2 1,13 1,19 1,26 1,28 1,57 1,90 1,103 5.155}
{0 CHEMBL431579,6 1,8 1,9 1,19 1,24 1,25 1,38 1,57 1,79 1,103 4.244}
{0 CHEMBL445125,21 1,26 1,29 1,30 1,38 1,39 1,42 1,43 1,44 1,53 1,55 1,56 1,57 1,90 1,103 6.301}
{0 CHEMBL446625,8 1,9 1,24 1,25 1,26 1,28 1,48 1,57 1,103 4.229}
{0 CHEMBL454617,20 1,21 1,26 1,29 1,38 1,39 1,42 1,53 1,55 1,56 1,57 1,59 1,90 1,103 5.409}
{0 CHEMBL455389,20 1,21 1,26 1,29 1,38 1,39 1,42 1,53 1,55 1,56 1,57 1,90 1,103 5.131}
{0 CHEMBL455641,20 1,21 1,26 1,29 1,38 1,39 1,42 1,53 1,55 1,56 1,57 1,90 1,103 4.553}
{0 CHEMBL46429,1 1,2 1,3 1,4 1,5 1,6 1,10 1,12 1,20 1,22 1,23 1,26 1,27 1,28 1,31 1,33 1,57 1,90 1,103 8.301}
{0 CHEMBL476124,19 1,26 1,29 1,57 1,79 1,102 1,103 4}
{0 CHEMBL482967,1 1,2 1,3 1,4 1,5 1,6 1,8 1,9 1,19 1,20 1,22 1,23 1,26 1,27 1,28 1,31 1,33 1,50 1,57 1,103 5}
{0 CHEMBL50,19 1,26 1,31 1,57 1,84 1,103 4.699}
{0 CHEMBL52387,21 1,26 1,29 1,38 1,39 1,42 1,53 1,55 1,56 1,57 1,90 1,103 5.62}
{0 CHEMBL591228,1 1,2 1,3 1,4 1,5 1,6 1,20 1,26 1,28 1,29 1,34 1,51 1,57 1,103 5.77}
{0 CHEMBL596953,3 1,20 1,26 1,29 1,34 1,51 1,57 1,76 1,90 1,103 5}
{0 CHEMBL597359,20 1,26 1,29 1,51 1,57 1,103 5.125}
{0 CHEMBL597754,3 1,11 1,12 1,13 1,15 1,19 1,20 1,23 1,33 1,46 1,48 1,57 1,58 1,90 1,103 8.222}
{0 CHEMBL598166,1 1,2 1,3 1,4 1,5 1,6 1,8 1,9 1,20 1,22 1,23 1,26 1,28 1,31 1,33 1,46 1,50 1,57 1,103 7.009}
{0 CHEMBL598992,1 1,2 1,3 1,4 1,5 1,6 1,8 1,9 1,20 1,22 1,23 1,26 1,28 1,31 1,33 1,46 1,57 1,103 7.745}
{0 CHEMBL598993,1 1,2 1,3 1,4 1,5 1,6 1,19 1,20 1,23 1,26 1,28 1,29 1,31 1,33 1,46 1,50 1,57 1,103 4.824}
{0 CHEMBL598994,1 1,2 1,3 1,5 1,6 1,19 1,20 1,23 1,26 1,28 1,29 1,31 1,33 1,46 1,57 1,103 7.108}
{0 CHEMBL599224,3 1,13 1,15 1,19 1,20 1,23 1,33 1,46 1,48 1,57 1,90 1,103 8.301}
{0 CHEMBL599428,3 1,13 1,15 1,19 1,20 1,23 1,26 1,33 1,46 1,48 1,57 1,90 1,103 8.222}
{0 CHEMBL599804,1 1,2 1,3 1,4 1,5 1,6 1,8 1,9 1,20 1,22 1,23 1,26 1,28 1,31 1,33 1,46 1,57 1,103 6.201}
{0 CHEMBL599805,1 1,2 1,3 1,4 1,5 1,6 1,20 1,23 1,26 1,28 1,29 1,31 1,33 1,46 1,57 1,102 1,103 6.018}
{0 CHEMBL599806,1 1,2 1,3 1,4 1,5 1,6 1,20 1,23 1,26 1,28 1,29 1,31 1,33 1,46 1,57 1,103 6.509}
{0 CHEMBL601064,1 1,2 1,3 1,4 1,5 1,6 1,20 1,23 1,26 1,28 1,29 1,31 1,33 1,46 1,57 1,103 6.495}
{0 CHEMBL601088,1 1,2 1,3 1,4 1,5 1,6 1,19 1,20 1,23 1,26 1,28 1,29 1,31 1,33 1,46 1,57 1,103 6.155}
{0 CHEMBL601705,1 1,2 1,3 1,4 1,5 1,6 1,20 1,23 1,26 1,28 1,29 1,31 1,33 1,46 1,57 1,103 6.125}
{0 CHEMBL602746,3 1,19 1,20 1,26 1,29 1,34 1,51 1,57 1,90 1,103 5}
{0 CHEMBL604712,19 1,26 1,57 1,60 1,90 1,92 1,103 6.347}
{0 CHEMBL605635,1 1,2 1,3 1,4 1,5 1,6 1,20 1,23 1,26 1,28 1,29 1,31 1,33 1,46 1,57 1,103 6.699}
{0 CHEMBL606176,20 1,26 1,29 1,31 1,33 1,46 1,57 1,103 5.569}
{0 CHEMBL609322,1 1,2 1,3 1,4 1,5 1,6 1,19 1,20 1,23 1,26 1,28 1,29 1,31 1,33 1,46 1,57 1,103 7.721}
{0 CHEMBL609915,1 1,2 1,3 1,4 1,5 1,6 1,20 1,23 1,26 1,28 1,29 1,31 1,33 1,46 1,50 1,57 1,103 5.602}
{0 CHEMBL611074,3 1,8 1,9 1,20 1,23 1,29 1,31 1,33 1,46 1,57 1,103 5}
{0 CHEMBL611995,1 1,2 1,3 1,4 1,5 1,6 1,20 1,23 1,26 1,28 1,29 1,31 1,33 1,46 1,57 1,103 6.444}
{0 CHEMBL68975,6 1,8 1,9 1,24 1,25 1,38 1,57 1,66 1,79 1,103 4.921}
{0 CHEMBL71484,6 1,8 1,9 1,24 1,26 1,38 1,57 1,79 1,103 4.569}
{0 CHEMBL81714,19 1,20 1,25 1,26 1,29 1,31 1,57 1,71 1,103 5}
