"molecule_id","ATSC6v","SpMin7_Bh.i.","ATSC7m","AAC","AECC","ALOGP","ALOGP2","AMR","AMW","ARR","ATS1e","ATS1i","ATS1m","ATS1p","ATS1s","ATS1v","ATS2e","ATS2i","ATS2m","ATS2p","ATS2s","ATS2v","ATS3e","ATS3i","ATS3m","ATS3p","ATS3s","ATS3v","ATS4e","ATS4i","ATS4m","ATS4p","ATS4s","ATS4v","ATS5e","ATS5i","ATS5m","ATS5p","ATS5s","ATS5v","ATS6e","ATS6i","ATS6m","ATS6p","ATS6s","ATS6v","ATS7e","ATS7i","ATS7m","ATS7p","ATS7s","ATS7v","ATS8e","ATS8i","ATS8m","ATS8p","ATS8s","ATS8v","ATSC1e","ATSC1i","ATSC1m","ATSC1p","ATSC1s","ATSC1v","ATSC2e","ATSC2i","ATSC2m","ATSC2p","ATSC2s","ATSC2v","ATSC3e","ATSC3i","ATSC3m","ATSC3p","ATSC3s","ATSC3v","ATSC4e","ATSC4i","ATSC4m","ATSC4p","ATSC4s","ATSC4v","ATSC5e","ATSC5i","ATSC5m","ATSC5p","ATSC5s","ATSC5v","ATSC6e","ATSC6i","ATSC6m","ATSC6p","ATSC6s","ATSC7e","ATSC7i","ATSC7p","ATSC7s","ATSC7v","ATSC8e","ATSC8i","ATSC8m","ATSC8p","ATSC8s","ATSC8v","BAC","BBI","BIC0","BIC1","BIC2","BIC3","BIC4","BIC5","BID","BLI","BLTA96","BLTD48","BLTF96","Br.094","C.","C.001","C.002","C.003","C.004","C.005","C.006","C.008","C.009","C.011","C.012","C.013","C.015","C.016","C.017","C.019","C.021","C.022","C.024","C.025","C.026","C.027","C.028","C.029","C.030","C.031","C.032","C.033","C.034","C.035","C.039","C.040","C.041","C.042","C.043","C.044","CATS2D_00_DD","CATS2D_00_DP","CATS2D_00_PP","CATS2D_01_AA","CATS2D_01_AN","CATS2D_01_DA","CATS2D_01_DN","CATS2D_01_LL","CATS2D_01_NL","CATS2D_02_AA","CATS2D_02_AL","CATS2D_02_AP","CATS2D_02_DA","CATS2D_02_DD","CATS2D_02_DL","CATS2D_02_LL","CATS2D_02_NL","CATS2D_02_PL","CATS2D_03_AA","CATS2D_03_AL","CATS2D_03_AP","CATS2D_03_DA","CATS2D_03_DD","CATS2D_03_DL","CATS2D_03_DP","CATS2D_03_LL","CATS2D_03_NL","CATS2D_03_PL","CATS2D_04_AA","CATS2D_04_AL","CATS2D_04_AP","CATS2D_04_DA","CATS2D_04_DD","CATS2D_04_DL","CATS2D_04_DP","CATS2D_04_LL","CATS2D_04_PL","CATS2D_04_PP","CATS2D_05_AA","CATS2D_05_AL","pXC50"
{1 9.636,2 0.821,3 16.215,4 1.682,5 10.037,6 3.884,7 15.085,8 105.742,9 8.778,10 0.767,11 3.876,12 3.969,13 3.685,14 3.557,15 5.067,16 3.514,17 4.342,18 4.468,19 3.966,20 3.915,21 5.557,22 3.863,23 4.56,24 4.722,25 3.994,26 3.994,27 5.781,28 3.931,29 4.58,30 4.762,31 3.908,32 3.95,33 5.751,34 3.886,35 4.601,36 4.819,37 3.857,38 3.946,39 5.646,40 3.871,41 4.499,42 4.692,43 3.898,44 3.935,45 5.602,46 3.856,47 4.493,48 4.659,49 3.897,50 3.953,51 5.719,52 3.858,53 4.594,54 4.821,55 3.718,56 3.862,57 5.71,58 3.742,59 0.057,60 0.666,61 7.483,62 3.94,63 8.578,64 4.237,65 0.115,66 1.074,67 14.667,68 6.738,69 15.682,70 7.342,71 0.247,72 1.318,73 18.974,74 8.268,75 43.026,76 8.97,77 0.275,78 1.334,79 19.434,80 7.928,81 40.885,82 8.824,83 0.302,84 1.29,85 19.997,86 7.981,87 39.294,88 9.967,89 0.252,90 1.223,91 17.439,92 7.486,93 31.067,94 0.242,95 1.216,96 7.987,97 27.859,98 9.813,99 0.261,100 1.31,101 21.198,102 8.944,103 39.575,104 10.966,105 11,106 42,107 0.287,108 0.569,109 0.703,110 0.795,111 0.81,112 0.81,113 3.341,114 0.988,115 -4.92,116 -4.83,117 -4.53,119 48.8,124 1,137 10,138 3,139 2,140 2,141 1,147 1,153 1,162 10,165 4,167 1,169 2,170 9,174 8,178 5,180 5,184 8,188 4,190 6,194 1,195 5}
{0 CHEMBL101253,1 7.282,2 0.821,3 15.408,4 1.496,5 10.4,6 4.705,7 22.138,8 100.976,9 8.671,10 0.821,11 3.803,12 3.913,13 3.514,14 3.464,15 4.975,16 3.437,17 4.262,18 4.398,19 3.86,20 3.837,21 5.382,22 3.788,23 4.511,24 4.697,25 3.901,26 3.938,27 5.564,28 3.861,29 4.515,30 4.732,31 3.756,32 3.84,33 5.52,34 3.754,35 4.451,36 4.676,37 3.759,38 3.782,39 5.493,40 3.723,41 4.382,42 4.579,43 3.717,44 3.806,45 5.456,46 3.734,47 4.37,48 4.573,49 3.668,50 3.781,51 5.403,52 3.675,53 4.285,54 4.512,55 3.486,56 3.609,57 5.255,58 3.465,59 0.036,60 0.569,61 5.871,62 3.065,63 6.797,64 3.852,65 0.051,66 0.892,67 10.545,68 5.141,69 10.565,70 6.527,71 0.15,72 1.134,73 18.583,74 7.031,75 22.023,76 8.915,77 0.152,78 1.147,79 19.99,80 7.228,81 24.391,82 9.299,83 0.206,84 1.11,85 17.499,86 6.324,87 25.7,88 8.142,89 0.186,90 1.026,91 15.521,92 5.816,93 22.825,94 0.139,95 0.952,96 6.574,97 20.483,98 8.757,99 0.115,100 0.837,101 16.149,102 6.477,103 20.375,104 8.711,105 2,106 38,107 0.259,108 0.558,109 0.709,110 0.819,111 0.836,112 0.845,113 3.267,114 0.893,115 -5.43,116 -5.31,117 -4.96,119 50,121 1,137 10,138 3,139 2,140 2,141 1,142 1,158 1,162 11,165 5,167 1,169 3,170 14,174 7,176 1,178 4,180 10,184 10,188 2,190 8,194 8,195 5}
{0 CHEMBL103667,1 18.535,2 1.295,3 41.436,4 1.476,5 15.333,6 5.907,7 34.897,8 153.448,9 6.944,10 0.512,11 4.416,12 4.543,13 3.928,14 3.926,15 5.446,16 3.899,17 4.975,18 5.161,19 4.296,20 4.324,21 5.966,22 4.279,23 5.224,24 5.428,25 4.344,26 4.489,27 6.191,28 4.408,29 5.354,30 5.615,31 4.314,32 4.494,33 6.25,34 4.385,35 5.289,36 5.537,37 4.298,38 4.402,39 6.266,40 4.322,41 5.161,42 5.377,43 4.272,44 4.38,45 6.186,46 4.313,47 5.213,48 5.426,49 4.329,50 4.471,51 6.285,52 4.385,53 5.328,54 5.566,55 4.237,56 4.518,57 6.285,58 4.402,59 0.071,60 1.114,61 17.099,62 7.024,63 11.85,64 9.626,65 0.407,66 1.786,67 32.2,68 11.499,69 38.337,70 16.193,71 0.522,72 2.215,73 41.95,74 14.363,75 49.844,76 20.619,77 0.467,78 2.375,79 49.157,80 16.419,81 58.81,82 24.524,83 0.653,84 2.184,85 46.823,86 14.355,87 69.806,88 21.162,89 0.568,90 2.014,91 40.251,92 12.847,93 62.036,94 0.461,95 2.159,96 14.686,97 73.226,98 21.166,99 0.588,100 2.318,101 47.773,102 16.237,103 80.539,104 23.357,105 27,106 61,107 0.226,108 0.537,109 0.702,110 0.788,111 0.812,112 0.816,113 3.693,114 0.941,115 -5.07,116 -4.97,117 -4.65,119 40.8,120 4,123 1,125 6,137 11,138 3,139 3,141 1,148 1,151 1,158 1,162 15,165 7,167 3,168 1,169 3,170 18,173 2,174 11,176 1,178 3,180 14,183 1,184 11,186 1,188 8,190 6,193 1,194 8,195 5}
{0 CHEMBL105442,1 6.804,2 0.824,3 11.633,4 1.983,5 9.88,6 4.908,7 24.087,8 99.228,9 12.274,10 0.444,11 3.792,12 3.884,13 3.775,14 3.435,15 5.022,16 3.394,17 4.273,18 4.4,19 4.197,20 3.786,21 5.534,22 3.708,23 4.519,24 4.69,25 4.354,26 3.863,27 6.008,28 3.773,29 4.473,30 4.655,31 4.497,32 3.765,33 5.852,34 3.678,35 4.37,36 4.525,37 4.097,38 3.624,39 5.907,40 3.633,41 4.392,42 4.524,43 4.225,44 3.733,45 6.046,46 3.707,47 4.409,48 4.554,49 4.266,50 3.714,51 5.974,52 3.646,53 4.31,54 4.504,55 4.362,56 3.646,57 5.56,58 3.482,59 0.19,60 0.668,61 0.871,62 3.405,63 18.075,64 3.508,65 0.379,66 1.031,67 4.693,68 6.413,69 38.569,70 6.332,71 0.857,72 1.404,73 33.685,74 9.985,75 101.366,76 8.732,77 0.789,78 1.191,79 46.152,80 9.47,81 78.619,82 7.529,83 0.793,84 1.123,85 12.827,86 6.22,87 106.151,88 5.258,89 0.863,90 1.152,91 19.438,92 7.893,93 106.636,94 0.91,95 1.123,96 7.74,97 109.321,98 6.234,99 0.65,100 1.068,101 22.075,102 9.053,103 79.569,104 7.243,105 26,106 38,107 0.355,108 0.704,109 0.829,110 0.891,111 0.891,112 0.891,113 3.267,114 1.004,115 -5.59,116 -5.46,117 -5.09,119 43.6,121 2,122 1,125 1,137 5,138 1,139 6,150 1,160 1,162 6,165 2,167 1,169 3,170 5,173 1,174 4,178 6,180 3,184 2,186 1,187 1,188 4,190 3,194 2,195 5}
{0 CHEMBL1173655,1 13.739,2 1.208,3 33.344,4 1.772,5 12.294,6 3.917,7 15.346,8 129.707,9 8.237,10 0.459,11 4.189,12 4.302,13 3.832,14 3.687,15 5.339,16 3.692,17 4.726,18 4.893,19 4.197,20 4.056,21 5.876,22 4.048,23 4.942,24 5.121,25 4.274,26 4.171,27 6.139,28 4.13,29 4.967,30 5.208,31 4.165,32 4.132,33 6.015,34 4.071,35 4.859,36 5.044,37 4.213,38 4.152,39 6.044,40 4.113,41 4.952,42 5.142,43 4.295,44 4.21,45 6.103,46 4.177,47 5.02,48 5.215,49 4.308,50 4.226,51 6.246,52 4.183,53 4.972,54 5.17,55 4.257,56 4.155,57 6.172,58 4.11,59 0.126,60 0.934,61 10.471,62 5.109,63 11.754,64 6.243,65 0.505,66 1.435,67 22.484,68 8.349,69 37.14,70 10.323,71 0.846,72 1.652,73 32.099,74 10.804,75 74.613,76 13.267,77 0.744,78 1.618,79 35.818,80 11.177,81 69.081,82 15.245,83 0.694,84 1.557,85 28.054,86 10.023,87 61.354,88 13.071,89 0.675,90 1.688,91 29.735,92 10.483,93 57.05,94 0.913,95 1.738,96 10.965,97 99.041,98 14.109,99 0.789,100 1.647,101 34.542,102 11.01,103 79.644,104 14.064,105 32,106 51,107 0.287,108 0.661,109 0.834,110 0.882,111 0.882,112 0.882,113 3.561,114 0.903,115 -4.06,116 -4.01,117 -3.8,119 40.7,121 1,124 2,125 3,126 1,132 2,137 5,138 1,139 5,141 1,142 1,143 1,150 1,162 3,164 1,165 8,167 2,169 5,170 3,173 1,174 5,176 1,178 5,180 3,183 1,184 5,186 1,188 2,190 5,193 2,194 5,195 5}
{0 CHEMBL119385,1 4.465,2 0.825,3 14.148,4 2.02,5 10.857,6 5.899,7 34.795,8 108.721,9 11.791,10 0.387,11 3.774,12 3.838,13 3.754,14 3.491,15 5.111,16 3.475,17 4.233,18 4.313,19 4.208,20 3.877,21 5.662,22 3.854,23 4.482,24 4.592,25 4.384,26 4.012,27 5.898,28 3.974,29 4.438,30 4.536,31 4.398,32 3.951,33 6.022,34 3.907,35 4.407,36 4.505,37 4.383,38 3.838,39 6.04,40 3.841,41 4.352,42 4.493,43 4.1,44 3.765,45 5.776,46 3.725,47 4.206,48 4.376,49 3.773,50 3.576,51 5.546,52 3.494,53 3.952,54 4.131,55 3.814,56 3.378,57 5.329,58 3.275,59 0.206,60 0.631,61 0.365,62 2.485,63 21.925,64 2.257,65 0.385,66 1.026,67 1.321,68 4.245,69 37.279,70 3.606,71 0.661,72 1.354,73 13.947,74 7.433,75 83.324,76 5.947,77 0.817,78 1.307,79 16.405,80 7.013,81 110.113,82 5.367,83 0.753,84 1.119,85 12.655,86 6.115,87 80.618,88 4.523,89 0.674,90 1.044,91 9.362,92 5.601,93 70.44,94 0.581,95 0.955,96 5.842,97 62.946,98 5.374,99 0.47,100 0.837,101 15.059,102 5.159,103 56.905,104 4.94,105 26,106 45,107 0.356,108 0.661,109 0.797,110 0.88,111 0.88,112 0.88,113 3.375,114 0.917,115 -6.72,116 -6.54,117 -6.06,119 51.4,132 2,133 1,134 1,137 6,138 1,139 5,150 3,158 1,162 5,164 2,165 6,170 11,173 1,174 7,180 13,183 1,184 4,190 6,193 1,194 18,195 5}
{0 CHEMBL1230020,1 6.642,2 0.814,3 14.778,4 2.082,5 10,6 3.768,7 14.197,8 98.861,9 10.094,10 0.552,11 3.85,12 3.929,13 3.793,14 3.455,15 5.092,16 3.441,17 4.377,18 4.493,19 4.109,20 3.831,21 5.867,22 3.816,23 4.639,24 4.795,25 4.219,26 3.907,27 6.08,28 3.898,29 4.633,30 4.775,31 4.268,32 3.839,33 6.398,34 3.861,35 4.566,36 4.696,37 4.176,38 3.776,39 6.311,40 3.796,41 4.493,42 4.637,43 4.131,44 3.713,45 6.047,46 3.736,47 4.464,48 4.621,49 4.02,50 3.632,51 6.303,52 3.635,53 4.354,54 4.54,55 3.938,56 3.524,57 5.865,58 3.479,59 0.225,60 0.758,61 5.948,62 3.96,63 39.021,64 3.501,65 0.571,66 1.185,67 13.505,68 7.01,69 90.283,70 6.806,71 0.941,72 1.471,73 23.616,74 9.001,75 143.309,76 8.416,77 1.292,78 1.6,79 24.487,80 9.13,81 227.35,82 7.35,83 1.187,84 1.303,85 17.657,86 7.732,87 198.265,88 6.459,89 0.968,90 1.433,91 19.899,92 7.853,93 154.093,94 1.18,95 1.35,96 7.11,97 213.546,98 6.515,99 0.907,100 1.03,101 20.115,102 7.122,103 129.051,104 6.493,105 54,106 43,107 0.362,108 0.736,109 0.857,110 0.885,111 0.885,112 0.885,113 3.341,114 1.026,115 -3.76,116 -3.72,117 -3.54,119 41.5,120 1,121 1,125 1,137 3,138 3,139 4,140 1,146 1,149 1,153 1,162 4,164 1,165 3,167 3,169 3,170 4,174 6,178 4,180 3,184 6,186 1,188 2,190 3,193 1,194 6,195 5}
{0 CHEMBL1236107,1 5.218,2 0.904,3 14.677,4 1.623,5 10.731,6 3.403,7 11.578,8 103.098,9 9.217,10 0.867,11 3.829,12 3.94,13 3.642,14 3.455,15 5.026,16 3.437,17 4.294,18 4.44,19 4.046,20 3.831,21 5.445,22 3.809,23 4.428,24 4.597,25 4.039,26 3.91,27 5.552,28 3.836,29 4.391,30 4.585,31 3.875,32 3.811,33 5.447,34 3.719,35 4.291,36 4.491,37 3.827,38 3.7,39 5.335,40 3.618,41 4.228,42 4.422,43 3.757,44 3.628,45 5.318,46 3.567,47 4.165,48 4.358,49 3.696,50 3.532,51 5.303,52 3.485,53 4.023,54 4.213,55 3.466,56 3.445,57 5.121,58 3.387,59 0.097,60 0.691,61 5.169,62 3.012,63 6.507,64 3.276,65 0.186,66 1.1,67 11.121,68 4.777,69 10.517,70 5.044,71 0.242,72 1.226,73 16.502,74 6.462,75 20.241,76 6.669,77 0.225,78 1.132,79 15.46,80 6.453,81 19.77,82 7.127,83 0.239,84 1.046,85 16.434,86 5.982,87 16.004,88 6.385,89 0.197,90 0.988,91 14.325,92 5.214,93 17.168,94 0.321,95 0.968,96 4.658,97 19.123,98 4.673,99 0.143,100 0.762,101 8.904,102 4.082,103 13.225,104 4.966,105 2,106 43,107 0.28,108 0.629,109 0.794,110 0.889,111 0.889,112 0.889,113 3.305,114 0.882,115 -4.86,116 -4.77,117 -4.48,119 46.2,124 1,137 7,138 2,139 1,140 2,141 2,146 1,153 1,154 1,158 3,162 5,164 2,165 11,170 7,173 2,174 10,180 7,183 2,184 7,190 4,193 2,194 13,195 5}
{0 CHEMBL1240703,1 34.694,2 1.322,3 75.265,4 1.529,5 10.955,6 4.94,7 24.402,8 162.643,9 7.928,10 0.577,11 4.452,12 4.549,13 4.09,14 4.028,15 5.543,16 4.027,17 5.039,18 5.174,19 4.574,20 4.499,21 6.116,22 4.496,23 5.354,24 5.503,25 4.807,26 4.747,27 6.415,28 4.739,29 5.555,30 5.708,31 4.955,32 4.916,33 6.651,34 4.899,35 5.712,36 5.88,37 5.019,38 5.024,39 6.785,40 4.991,41 5.807,42 5.998,43 5.004,44 5.077,45 6.861,46 5.016,47 5.835,48 6.046,49 4.881,50 5.022,51 6.889,52 4.938,53 5.703,54 5.922,55 4.64,56 4.855,57 6.751,58 4.751,59 0.074,60 1.064,61 13.58,62 6.747,63 16.837,64 7.968,65 0.531,66 1.884,67 28.133,68 11.685,69 41.046,70 14.14,71 0.695,72 2.532,73 40.329,74 16.193,75 56.058,76 19.403,77 0.778,78 3.064,79 49.956,80 20.238,81 96.563,82 24.274,83 1.043,84 3.566,85 60.228,86 23.585,87 96.073,88 28.642,89 1.038,90 3.852,91 68.795,92 27.353,93 109.954,94 1.207,95 3.83,96 28.908,97 156.498,98 36.875,99 1.098,100 3.326,101 67.314,102 25.466,103 138.141,104 32.452,105 38,106 83,107 0.231,108 0.568,109 0.737,110 0.827,111 0.863,112 0.879,113 3.812,114 0.859,115 -4.59,116 -4.51,117 -4.24,119 47.3,120 1,121 1,124 2,126 2,127 2,129 1,137 13,138 7,147 4,150 2,162 19,164 3,165 14,167 1,168 1,169 3,170 20,173 4,174 16,178 4,180 16,183 3,184 22,186 1,188 4,190 18,193 3,194 18,195 5}
{0 CHEMBL1241674,1 7.339,2 0.804,3 20.418,4 1.606,5 8.043,6 2.744,7 7.527,8 89.221,9 7.907,10 0.769,11 3.809,12 3.94,13 3.427,14 3.316,15 4.998,16 3.326,17 4.295,18 4.466,19 3.836,20 3.718,21 5.44,22 3.717,23 4.504,24 4.699,25 3.871,26 3.811,27 5.636,28 3.793,29 4.592,30 4.824,31 3.845,32 3.812,33 5.701,34 3.771,35 4.484,36 4.702,37 3.686,38 3.731,39 5.562,40 3.674,41 4.411,42 4.62,43 3.621,44 3.669,45 5.521,46 3.617,47 4.498,48 4.765,49 3.399,50 3.616,51 5.519,52 3.508,53 4.324,54 4.618,55 3.148,56 3.372,57 5.26,58 3.239,59 0.1,60 0.657,61 7.475,62 2.975,63 11.951,64 3.847,65 0.171,66 1.031,67 13.36,68 5.062,69 18.42,70 6.93,71 0.28,72 1.193,73 17.675,74 5.714,75 26.54,76 7.973,77 0.4,78 1.242,79 20.893,80 6.472,81 37.848,82 9.343,83 0.359,84 1.111,85 18.105,86 5.797,87 31.978,88 8.239,89 0.224,90 1.06,91 16.204,92 5.097,93 27.427,94 0.372,95 1.019,96 5.868,97 41.837,98 8.859,99 0.277,100 0.775,101 18.592,102 5.846,103 29.432,104 8.887,105 18,106 39,107 0.282,108 0.702,109 0.803,110 0.839,111 0.839,112 0.839,113 3.19,114 0.848,115 -4.06,116 -4.01,117 -3.79,119 41,120 2,126 1,137 4,138 2,139 1,141 1,142 1,143 1,147 2,153 1,155 1,156 1,157 1,158 1,162 3,164 2,165 6,166 1,167 1,169 6,170 4,172 1,173 1,174 3,176 1,178 5,180 4,183 2,184 4,185 3,186 4,188 1,190 4,194 5,195 5}
{0 CHEMBL124660,1 25.38,2 1.3,3 49.652,4 1.513,5 18.659,6 4.674,7 21.849,8 160.828,9 6.781,10 0.378,11 4.504,12 4.634,13 3.996,14 3.959,15 5.494,16 3.939,17 5.097,18 5.3,19 4.334,20 4.349,21 6.041,22 4.305,23 5.358,24 5.586,25 4.406,26 4.521,27 6.247,28 4.445,29 5.406,30 5.651,31 4.362,32 4.536,33 6.305,34 4.436,35 5.403,36 5.647,37 4.34,38 4.538,39 6.32,40 4.425,41 5.395,42 5.648,43 4.265,44 4.494,45 6.233,46 4.371,47 5.334,48 5.596,49 4.214,50 4.386,51 6.216,52 4.276,53 5.196,54 5.433,55 4.174,56 4.308,57 6.094,58 4.223,59 0.024,60 1.222,61 19.498,62 7.398,63 11.437,64 10.634,65 0.525,66 1.928,67 37.858,68 11.851,69 41.638,70 17.627,71 0.686,72 2.317,73 49.892,74 15.383,75 52.388,76 23.063,77 0.658,78 2.371,79 52.334,80 16.533,81 64.144,82 24.92,83 0.805,84 2.338,85 52.247,86 17.276,87 75.439,88 25.516,89 0.566,90 2.283,91 51.688,92 16.851,93 57.591,94 0.884,95 2.115,96 14.519,97 73.048,98 22.414,99 0.548,100 1.914,101 42.617,102 12.756,103 48.867,104 19.345,105 22,106 61,107 0.229,108 0.508,109 0.715,110 0.799,111 0.824,112 0.824,113 3.741,114 0.984,115 -4.15,116 -4.09,117 -3.87,119 37.3,120 2,121 4,124 1,125 8,126 1,137 6,138 1,139 4,141 1,142 1,143 1,151 1,162 5,164 3,165 14,167 2,169 2,170 5,173 2,174 9,178 2,180 3,183 3,184 7,190 7,193 5,194 6,195 5}
{0 CHEMBL1287853,1 17.495,2 1.384,3 39.463,4 1.604,5 16.351,6 5.318,7 28.281,8 147.876,9 7.188,10 0.45,11 4.371,12 4.497,13 4.019,14 3.889,15 5.369,16 3.842,17 4.938,18 5.128,19 4.328,20 4.271,21 6.08,22 4.207,23 5.195,24 5.411,25 4.346,26 4.419,27 6.197,28 4.302,29 5.303,30 5.572,31 4.288,32 4.382,33 6.295,34 4.254,35 5.17,36 5.392,37 4.201,38 4.294,39 6.317,40 4.214,41 5.038,42 5.252,43 4.156,44 4.306,45 6.029,46 4.205,47 5.106,48 5.353,49 4.197,50 4.337,51 6.073,52 4.205,53 5.076,54 5.315,55 4.098,56 4.27,57 6.039,58 4.136,59 0.096,60 1.121,61 19.611,62 6.83,63 18.6,64 9.228,65 0.49,66 1.759,67 33.291,68 11.432,69 69.127,70 15.683,71 0.453,72 2.131,73 45.659,74 14.336,75 62.867,76 19.753,77 0.609,78 2.129,79 58.518,80 16.676,81 88.167,82 22.658,83 0.859,84 1.86,85 44.316,86 13.074,87 119.388,88 17.925,89 0.37,90 1.832,91 35.993,92 12.133,93 53.078,94 0.467,95 1.916,96 13.852,97 57.019,98 19.972,99 0.319,100 1.843,101 41.493,102 13.165,103 49.703,104 18.833,105 40,106 57,107 0.249,108 0.563,109 0.739,110 0.802,111 0.808,112 0.808,113 3.641,114 1.052,115 -4.36,116 -4.3,117 -4.05,119 37,120 4,121 2,125 4,128 1,137 8,138 1,139 4,140 1,142 1,145 1,162 6,164 2,165 6,167 5,169 8,170 8,173 1,174 8,178 6,180 3,184 14,186 1,187 1,188 3,190 2,194 11,195 5.222}
{0 CHEMBL1289926,1 10.807,2 0.963,3 20.446,4 1.585,5 12.286,6 4.493,7 20.186,8 114.788,9 8.402,10 0.71,11 3.933,12 4.041,13 3.653,14 3.596,15 5.11,16 3.55,17 4.385,18 4.525,19 4.009,20 3.968,21 5.533,22 3.895,23 4.58,24 4.752,25 4.064,26 4.071,27 5.68,28 3.961,29 4.574,30 4.747,31 4.008,32 3.986,33 5.713,34 3.882,35 4.522,36 4.712,37 3.866,38 3.941,39 5.584,40 3.83,41 4.549,42 4.75,43 3.804,44 3.926,45 5.609,46 3.818,47 4.533,48 4.753,49 3.746,50 3.841,51 5.597,52 3.752,53 4.411,54 4.634,55 3.583,56 3.705,57 5.489,58 3.601,59 0.044,60 0.663,61 7.861,62 3.899,63 7.206,64 4.667,65 0.109,66 1.04,67 14.352,68 6.503,69 16.07,70 7.766,71 0.116,72 1.248,73 23.017,74 9.306,75 23.968,76 10.629,77 0.237,78 1.254,79 24.376,80 8.717,81 35.504,82 9.532,83 0.169,84 1.163,85 21.084,86 8.362,87 26.663,88 10.076,89 0.138,90 1.195,91 22.736,92 8.907,93 26.506,94 0.162,95 1.168,96 7.871,97 30.645,98 9.879,99 0.226,100 1.051,101 18.187,102 6.853,103 31.972,104 8.636,105 7,106 42,107 0.266,108 0.591,109 0.757,110 0.886,111 0.91,112 0.91,113 3.374,114 0.931,115 -4.38,116 -4.31,117 -4.07,119 47.8,124 1,132 2,137 10,138 2,139 2,140 1,141 2,147 1,150 1,160 1,162 9,165 6,167 1,169 3,170 14,174 5,178 4,180 10,184 6,188 4,190 11,194 2,195 5}
{0 CHEMBL1336,1 8.546,2 0.904,3 18.324,4 1.965,5 14.281,6 4.176,7 17.437,8 110.459,9 9.685,10 0.529,11 4.003,12 4.1,13 3.755,14 3.517,15 5.316,16 3.555,17 4.496,18 4.622,19 4.2,20 3.853,21 6.254,22 3.888,23 4.687,24 4.837,25 4.212,26 3.955,27 6.089,28 3.972,29 4.729,30 4.888,31 4.278,32 3.87,33 6.302,34 3.909,35 4.633,36 4.809,37 4.034,38 3.794,39 6.141,40 3.811,41 4.604,42 4.799,43 3.841,44 3.776,45 5.894,46 3.752,47 4.507,48 4.685,49 3.977,50 3.684,51 6.22,52 3.67,53 4.383,54 4.577,55 3.681,56 3.61,57 5.663,58 3.582,59 0.311,60 0.902,61 5.104,62 4.001,63 37.643,64 3.787,65 1.055,66 1.686,67 11.815,68 6.648,69 147.525,70 6.555,71 0.943,72 1.452,73 18.483,74 8.178,75 99.294,76 8.02,77 1.323,78 1.452,79 26.239,80 8.848,81 158.001,82 8.205,83 1.117,84 1.415,85 18.246,86 7.271,87 116.513,88 7.605,89 1.027,90 1.273,91 21.288,92 8.134,93 142.434,94 1.184,95 1.129,96 6.854,97 152.715,98 8.195,99 0.73,100 1.053,101 16.236,102 6.388,103 91.483,104 6.945,105 55,106 48,107 0.331,108 0.647,109 0.756,110 0.856,111 0.873,112 0.88,113 3.501,114 0.833,115 -3.51,116 -3.48,117 -3.33,119 43.8,124 1,130 1,137 9,138 1,139 5,140 1,141 1,150 1,151 1,162 4,165 6,167 3,168 1,169 4,170 7,173 1,174 3,176 1,178 5,180 6,183 1,184 4,188 4,190 4,193 1,194 5,195 5}
{0 CHEMBL1421,1 13.89,2 1.129,3 38.483,4 1.781,5 14.515,6 3.439,7 11.829,8 130.334,9 8.272,10 0.472,11 4.186,12 4.31,13 3.868,14 3.71,15 5.289,16 3.681,17 4.723,18 4.911,19 4.273,20 4.092,21 5.802,22 4.04,23 4.941,24 5.151,25 4.314,26 4.218,27 5.982,28 4.141,29 5.006,30 5.228,31 4.28,32 4.257,33 6.04,34 4.143,35 5.048,36 5.295,37 4.247,38 4.219,39 6.107,40 4.099,41 4.913,42 5.139,43 4.3,44 4.148,45 5.979,46 4.032,47 4.818,48 5.046,49 4.105,50 4.07,51 5.861,52 3.938,53 4.729,54 4.975,55 3.899,56 3.905,57 5.736,58 3.791,59 0.095,60 0.941,61 11.465,62 5.069,63 10.998,64 6.429,65 0.43,66 1.487,67 24.882,68 8.224,69 31.59,70 10.997,71 0.6,72 1.695,73 35.684,74 10.349,75 45.533,76 13.753,77 0.546,78 1.729,79 37.657,80 12.51,81 51.32,82 16.654,83 0.76,84 1.693,85 45.193,86 13.007,87 79.856,88 17.006,89 0.671,90 1.578,91 38.884,92 11.058,93 68.555,94 0.533,95 1.499,96 11.075,97 49.188,98 13.638,99 0.487,100 1.324,101 32.202,102 9.003,103 43.612,104 11.771,105 28,106 50,107 0.289,108 0.627,109 0.771,110 0.863,111 0.863,112 0.863,113 3.531,114 0.988,115 -4.5,116 -4.42,117 -4.17,119 37.3,120 2,125 6,137 4,138 1,139 2,140 1,142 2,144 1,147 1,150 1,154 1,162 4,164 2,165 6,167 3,169 3,170 4,173 1,174 1,176 1,178 5,180 4,183 3,184 4,186 3,188 2,190 5,193 1,194 5,195 6.699}
{0 CHEMBL1614701,1 6.621,2 0.824,3 16.171,4 2.039,5 9.815,6 3.234,7 10.461,8 102.384,9 10.898,10 0.552,11 3.88,12 3.977,13 3.747,14 3.406,15 5.143,16 3.419,17 4.367,18 4.502,19 4.17,20 3.789,21 5.626,22 3.787,23 4.575,24 4.72,25 4.313,26 3.908,27 5.974,28 3.885,29 4.605,30 4.779,31 4.414,32 3.873,33 5.96,34 3.844,35 4.549,36 4.713,37 4.164,38 3.765,39 6.036,40 3.785,41 4.562,42 4.689,43 4.272,44 3.821,45 6.169,46 3.842,47 4.586,48 4.746,49 4.239,50 3.795,51 5.983,52 3.784,53 4.555,54 4.749,55 4.302,56 3.728,57 5.806,58 3.674,59 0.255,60 0.679,61 3.015,62 3.461,63 19.199,64 3.449,65 0.538,66 1.037,67 9.729,68 5.922,69 42.845,70 5.857,71 0.872,72 1.262,73 23.78,74 7.869,75 71.232,76 7.961,77 0.832,78 1.321,79 33.428,80 8.205,81 63.717,82 8.272,83 0.944,84 1.243,85 17.834,86 7.175,87 108.942,88 7.332,89 1.045,90 1.235,91 16.589,92 7.522,93 112.204,94 0.901,95 1.128,96 7.214,97 90.926,98 6.667,99 0.973,100 1.017,101 26.345,102 8.19,103 84.24,104 7.949,105 42,106 41,107 0.356,108 0.753,109 0.855,110 0.905,111 0.905,112 0.905,113 3.341,114 0.929,115 -4.17,116 -4.11,117 -3.89,118 1,119 40.5,124 1,125 2,137 4,138 1,139 5,141 1,147 1,150 1,152 1,160 1,162 2,164 1,165 2,167 1,169 3,170 4,173 1,174 4,176 1,178 5,180 3,184 2,186 2,187 2,190 3,193 1,195 5}
{0 CHEMBL162,1 29.664,2 1.223,3 56.948,4 1.512,5 8.057,6 3.82,7 14.59,8 131.874,9 7.649,10 0.571,11 4.263,12 4.37,13 3.882,14 3.832,15 5.286,16 3.826,17 4.873,18 5.021,19 4.374,20 4.318,21 5.859,22 4.309,23 5.178,24 5.337,25 4.61,26 4.573,27 6.149,28 4.556,29 5.369,30 5.531,31 4.757,32 4.756,33 6.333,34 4.727,35 5.532,36 5.717,37 4.778,38 4.847,39 6.495,40 4.794,41 5.585,42 5.797,43 4.686,44 4.848,45 6.518,46 4.761,47 5.533,48 5.767,49 4.425,50 4.709,51 6.463,52 4.58,53 5.314,54 5.575,55 3.935,56 4.389,57 6.201,58 4.21,59 0.027,60 0.917,61 12.149,62 5.573,63 11.265,64 6.965,65 0.37,66 1.627,67 25.463,68 9.887,69 30.97,70 12.55,71 0.571,72 2.159,73 35.68,74 13.607,75 40.408,76 17.155,77 0.443,78 2.615,79 42.815,80 17.103,81 43.837,82 21.674,83 0.654,84 3.038,85 52.426,86 19.901,87 53.811,88 25.674,89 0.548,90 3.117,91 57.473,92 22.265,93 66.036,94 0.67,95 2.864,96 21.781,97 84.94,98 29.533,99 0.536,100 2.232,101 47.876,102 17.849,103 74.079,104 24.601,105 21,106 68,107 0.238,108 0.589,109 0.78,110 0.837,111 0.857,112 0.878,113 3.592,114 0.875,115 -3.69,116 -3.66,117 -3.48,119 45.9,120 1,121 1,124 2,125 1,126 2,127 1,129 1,137 8,138 6,147 4,150 1,162 13,164 2,165 11,167 1,169 3,170 14,173 3,174 12,176 1,178 2,180 13,184 16,186 3,188 3,190 17,193 2,194 15,195 5}
{0 CHEMBL1721885,1 15.668,2 1.064,3 33.085,4 1.672,5 13.219,6 1.477,7 2.182,8 119.219,9 7.501,10 0.314,11 4.185,12 4.306,13 3.74,14 3.66,15 5.304,16 3.661,17 4.749,18 4.924,19 4.121,20 4.065,21 5.87,22 4.049,23 4.994,24 5.19,25 4.166,26 4.207,27 6.128,28 4.159,29 5.082,30 5.314,31 4.121,32 4.214,33 6.167,34 4.135,35 5.078,36 5.306,37 4.098,38 4.128,39 6.304,40 4.069,41 5.032,42 5.27,43 4.038,44 4.095,45 6.228,46 4.026,47 4.95,48 5.189,49 4.002,50 4.053,51 6.049,52 3.982,53 4.921,54 5.134,55 3.934,56 3.971,57 6.219,58 3.912,59 0.129,60 0.935,61 12.267,62 5.279,63 17.348,64 6.821,65 0.457,66 1.484,67 24.332,68 8.676,69 43.105,70 11.737,71 0.745,72 1.768,73 32.893,74 11.091,75 76.178,76 14.938,77 0.645,78 1.804,79 36.882,80 12.412,81 78.284,82 17.496,83 0.989,84 1.7,85 38.43,86 11.551,87 138.129,88 16.051,89 0.998,90 1.624,91 36.999,92 11.059,93 136.547,94 0.68,95 1.529,96 10.501,97 72.144,98 15.142,99 0.893,100 1.494,101 32.436,102 9.999,103 129.414,104 13.339,105 37,106 50,107 0.272,108 0.637,109 0.797,110 0.866,111 0.866,112 0.866,113 3.502,114 0.91,115 -2.31,116 -2.34,117 -2.31,119 39,120 2,125 6,126 1,132 1,133 1,137 3,138 3,139 2,147 2,150 2,162 6,165 2,167 2,169 8,170 7,173 1,174 3,176 1,177 1,178 6,180 8,184 4,186 2,187 1,188 3,190 7,194 3,195 5}
{0 CHEMBL1789941,1 9.929,2 1.058,3 14.408,4 1.454,5 8.217,6 2.741,7 7.514,8 87.719,9 7.473,10 0.577,11 3.83,12 3.964,13 3.419,14 3.379,15 4.917,16 3.361,17 4.393,18 4.579,19 3.766,20 3.812,21 5.342,22 3.761,23 4.662,24 4.912,25 3.726,26 3.893,27 5.519,28 3.793,29 4.671,30 4.931,31 3.794,32 3.896,33 5.617,34 3.814,35 4.649,36 4.893,37 3.712,38 3.876,39 5.675,40 3.777,41 4.555,42 4.837,43 3.475,44 3.656,45 5.585,46 3.543,47 4.166,48 4.425,49 3.14,50 3.392,51 5.114,52 3.28,53 4.06,54 4.274,55 3.265,56 3.408,57 5.073,58 3.326,59 0.041,60 0.682,61 8.241,62 3.401,63 9.986,64 4.712,65 0.131,66 1.111,67 15.972,68 6.023,69 16.474,70 8.592,71 0.168,72 1.289,73 23.327,74 7.929,75 29.134,76 11.904,77 0.319,78 1.31,79 24.085,80 7.725,81 35.496,82 11.607,83 0.191,84 1.284,85 22.816,86 7.672,87 37.649,88 11.491,89 0.341,90 1.111,91 22.197,92 6.431,93 46.383,94 0.152,95 0.763,96 4.675,97 28.391,98 7.021,99 0.105,100 0.743,101 11.964,102 4.393,103 18.547,104 6.355,105 4,106 36,107 0.253,108 0.65,109 0.797,110 0.84,111 0.84,112 0.84,113 3.189,114 0.93,115 -3.52,116 -3.5,117 -3.34,119 41.5,121 5,122 1,126 1,137 1,138 2,140 1,141 1,143 1,146 2,150 1,153 1,158 1,162 6,164 1,165 8,167 1,169 2,170 7,174 6,180 3,183 3,184 8,186 1,188 1,190 4,193 1,194 6,195 5}
{0 CHEMBL180022,1 17.037,2 1.305,3 39.088,4 1.64,5 15.75,6 5.095,7 25.957,8 155.746,9 8.074,10 0.535,11 4.323,12 4.436,13 3.953,14 3.866,15 5.504,16 3.856,17 4.823,18 4.99,19 4.287,20 4.211,21 5.95,22 4.188,23 5.034,24 5.207,25 4.416,26 4.356,27 6.189,28 4.313,29 5.116,30 5.33,31 4.384,32 4.375,33 6.215,34 4.307,35 5.087,36 5.277,37 4.401,38 4.408,39 6.257,40 4.343,41 5.11,42 5.304,43 4.487,44 4.433,45 6.295,46 4.382,47 5.143,48 5.327,49 4.498,50 4.435,51 6.404,52 4.376,53 5.1,54 5.3,55 4.403,56 4.344,57 6.311,58 4.271,59 0.063,60 0.996,61 12.243,62 5.847,63 13.293,64 7.294,65 0.342,66 1.527,67 24.666,68 9.35,69 31.741,70 11.878,71 0.569,72 1.813,73 33.334,74 11.829,75 56.824,76 14.934,77 0.594,78 1.909,79 38.801,80 13.573,81 68.673,82 17.944,83 0.671,84 1.869,85 38.318,86 13.487,87 71.405,88 17.429,89 0.482,90 1.956,91 36.057,92 13.018,93 59.248,94 0.673,95 1.965,96 13.007,97 100.549,98 16.255,99 0.668,100 1.79,101 42.208,102 13.335,103 93.345,104 17.149,105 54,106 58,107 0.254,108 0.623,109 0.82,110 0.883,111 0.883,112 0.883,113 3.717,114 0.905,115 -2.49,116 -2.52,117 -2.46,119 43.5,120 1,124 2,125 3,132 2,137 8,138 2,139 6,140 2,141 2,150 2,162 5,165 11,167 1,169 6,170 5,173 1,174 9,176 1,178 5,180 4,183 2,184 4,186 2,188 2,190 8,193 2,194 6,195 5.886}
{0 CHEMBL1908391,1 15.636,2 1.198,3 35.001,4 1.54,5 16.667,6 4.475,7 20.029,8 146.666,9 7.556,10 0.575,11 4.28,12 4.407,13 3.903,14 3.864,15 5.339,16 3.817,17 4.812,18 4.999,19 4.255,20 4.246,21 5.814,22 4.182,23 5.037,24 5.241,25 4.236,26 4.383,27 6.005,28 4.278,29 5.175,30 5.434,31 4.202,32 4.381,33 6.092,34 4.232,35 5.086,36 5.353,37 4.21,38 4.309,39 5.994,40 4.17,41 4.875,42 5.072,43 4.12,44 4.257,45 5.876,46 4.129,47 4.947,48 5.191,49 3.976,50 4.197,51 5.882,52 4.063,53 4.807,54 5.025,55 3.998,56 4.113,57 5.832,58 4.011,59 0.043,60 1.016,61 13.973,62 5.934,63 9.96,64 7.836,65 0.303,66 1.668,67 27.936,68 9.47,69 24.758,70 13.038,71 0.251,72 1.964,73 33.846,74 12.832,75 34.462,76 17.464,77 0.369,78 2.105,79 42.94,80 15.603,81 55.382,82 21.355,83 0.403,84 1.937,85 44.21,86 14.615,87 51.009,88 19.32,89 0.315,90 1.685,91 33.664,92 12.227,93 36.653,94 0.338,95 1.669,96 12.794,97 42.861,98 17.207,99 0.283,100 1.47,101 28.205,102 10.532,103 40.085,104 14.224,105 10,106 55,107 0.242,108 0.57,109 0.746,110 0.823,111 0.855,112 0.855,113 3.615,114 0.972,115 -4.35,116 -4.29,117 -4.05,119 42.4,120 1,124 1,125 5,137 9,138 4,139 2,140 2,141 1,146 1,150 1,154 1,162 11,165 6,167 2,169 6,170 11,173 1,174 6,178 5,180 7,183 1,184 9,187 1,188 5,190 5,194 7,195 5}
{0 CHEMBL1908392,1 18.251,2 1.115,3 40.822,4 1.468,5 14.139,6 4.725,7 22.326,8 143.007,9 7.189,10 0.55,11 4.296,12 4.422,13 3.839,14 3.839,15 5.374,16 3.814,17 4.829,18 5.017,19 4.193,20 4.236,21 5.841,22 4.191,23 5.082,24 5.287,25 4.266,26 4.404,27 6.091,28 4.326,29 5.194,30 5.429,31 4.24,32 4.417,33 6.189,34 4.315,35 5.191,36 5.436,37 4.277,38 4.386,39 6.24,40 4.315,41 5.107,42 5.294,43 4.281,44 4.439,45 6.214,46 4.362,47 5.207,48 5.442,49 4.18,50 4.463,51 6.186,52 4.337,53 5.154,54 5.421,55 3.926,56 4.318,57 6.018,58 4.158,59 0.05,60 0.996,61 14.24,62 5.91,63 11.343,64 8.044,65 0.309,66 1.633,67 26.445,68 9.271,69 23.903,70 13.296,71 0.387,72 1.987,73 35.058,74 12.805,75 38.967,76 17.929,77 0.358,78 2.094,79 40.579,80 15.014,81 57.73,82 21.288,83 0.497,84 2.048,85 41.823,86 13.987,87 72.416,88 19.646,89 0.429,90 1.978,91 35.939,92 13.536,93 64.075,94 0.348,95 2.119,96 15.806,97 62.944,98 22.335,99 0.384,100 1.941,101 40.207,102 14.942,103 58.33,104 21.447,105 17,106 56,107 0.23,108 0.542,109 0.68,110 0.797,111 0.838,112 0.838,113 3.616,114 0.916,115 -4.14,116 -4.09,117 -3.87,119 43.3,124 2,125 5,137 13,138 3,139 2,147 1,148 1,149 1,150 1,162 13,164 1,165 6,168 1,169 4,170 14,173 3,174 7,178 3,180 12,184 5,186 2,188 5,190 10,193 1,194 7,195 5}
{0 CHEMBL1908393,1 21.413,2 1.368,3 50.732,4 1.667,5 20.217,6 3.792,7 14.379,8 168.034,9 7.741,10 0.333,11 4.52,12 4.625,13 4.112,14 4.011,15 5.635,16 4.019,17 5.08,18 5.239,19 4.456,20 4.378,21 6.203,22 4.372,23 5.337,24 5.525,25 4.583,26 4.5,27 6.516,28 4.488,29 5.359,30 5.562,31 4.48,32 4.493,33 6.572,34 4.447,35 5.34,36 5.554,37 4.478,38 4.514,39 6.429,40 4.459,41 5.335,42 5.522,43 4.52,44 4.524,45 6.537,46 4.482,47 5.379,48 5.593,49 4.468,50 4.472,51 6.584,52 4.422,53 5.262,54 5.485,55 4.382,56 4.361,57 6.46,58 4.315,59 0.166,60 1.298,61 15.93,62 7.845,63 19.124,64 9.393,65 0.692,66 2.065,67 32.94,68 12.666,69 64.573,70 15.58,71 1.234,72 2.512,73 46.336,74 15.613,75 111.312,76 19.578,77 1.411,78 2.441,79 48.588,80 16.33,81 155.365,82 20.867,83 1.157,84 2.373,85 48.211,86 17.455,87 115.804,88 22.674,89 1.093,90 2.488,91 45.714,92 17.118,93 133.185,94 1.484,95 2.589,96 16.613,97 165.059,98 21.527,99 1.227,100 2.366,101 45.289,102 15.112,103 150.791,104 19.548,105 27,106 72,107 0.251,108 0.603,109 0.802,110 0.876,111 0.879,112 0.879,113 3.853,114 0.904,115 -3.05,116 -3.05,117 -2.93,119 41.5,121 4,123 1,124 1,125 6,126 1,132 3,134 1,137 6,138 1,139 6,140 1,141 1,150 2,162 7,165 12,167 2,169 6,170 5,173 2,174 11,178 7,180 5,183 4,184 6,186 2,187 1,190 8,193 2,194 6,195 5}
{0 CHEMBL1908394,1 17.04,2 1.202,3 40.393,4 1.781,5 14,6 5.126,7 26.275,8 142.371,9 8.237,10 0.5,11 4.305,12 4.42,13 3.979,14 3.839,15 5.432,16 3.824,17 4.882,18 5.053,19 4.445,20 4.25,21 6.339,22 4.225,23 5.081,24 5.26,25 4.476,26 4.406,27 6.175,28 4.345,29 5.233,30 5.449,31 4.486,32 4.459,33 6.363,34 4.371,35 5.253,36 5.486,37 4.449,38 4.41,39 6.462,40 4.328,41 5.122,42 5.328,43 4.368,44 4.368,45 6.288,46 4.284,47 5.089,48 5.295,49 4.428,50 4.346,51 6.281,52 4.281,53 5.093,54 5.291,55 4.487,56 4.302,57 6.332,58 4.253,59 0.146,60 1.213,61 12.176,62 6.276,63 25.48,64 7.263,65 1.048,66 2.299,67 27.961,68 10.371,69 153.195,70 12.329,71 0.631,72 2.227,73 36.147,74 13.907,75 55.298,76 16.555,77 0.855,78 2.571,79 45.904,80 17.185,81 97.719,82 20.983,83 1.474,84 2.549,85 49.52,86 16.836,87 147.462,88 19.783,89 0.948,90 2.313,91 42.715,92 15.232,93 117.928,94 0.727,95 2.187,96 13.693,97 80.509,98 16.586,99 0.783,100 2.434,101 41.697,102 13.851,103 82.239,104 15.347,105 54,106 62,107 0.281,108 0.61,109 0.759,110 0.821,111 0.856,112 0.861,113 3.668,114 0.932,115 -4.6,116 -4.52,117 -4.25,119 40.9,120 1,124 1,125 5,126 1,130 1,137 8,138 3,139 1,141 1,147 2,148 1,150 1,152 1,155 1,156 1,157 1,162 9,164 1,165 8,166 1,167 1,170 10,173 1,174 10,178 1,180 6,182 1,183 2,184 8,185 1,186 1,188 1,190 6,191 1,193 2,194 2,195 5}
{0 CHEMBL1908395,1 20.777,2 1.134,3 43.402,4 1.503,5 13.5,6 3.328,7 11.073,8 132.718,9 6.979,10 0.297,11 4.265,12 4.401,13 3.774,14 3.783,15 5.32,16 3.752,17 4.844,18 5.048,19 4.12,20 4.201,21 5.813,22 4.138,23 5.129,24 5.356,25 4.19,26 4.389,27 6.129,28 4.279,29 5.226,30 5.479,31 4.177,32 4.391,33 6.2,34 4.275,35 5.188,36 5.43,37 4.146,38 4.364,39 6.187,40 4.261,41 5.159,42 5.396,43 4.153,44 4.392,45 6.14,46 4.276,47 5.238,48 5.501,49 4.101,50 4.409,51 6.093,52 4.27,53 5.236,54 5.509,55 4.051,56 4.347,57 6.12,58 4.207,59 0.035,60 1.005,61 14.504,62 5.794,63 10.727,64 8.282,65 0.316,66 1.619,67 27.893,68 9.817,69 25.899,70 14.536,71 0.511,72 1.97,73 38.107,74 14.189,75 61.819,76 20.389,77 0.358,78 2.026,79 42.966,80 15.222,81 66.898,82 22.212,83 0.49,84 1.968,85 41.722,86 13.786,87 85.309,88 20.083,89 0.372,90 2.01,91 39.397,92 14.14,93 71.509,94 0.343,95 2.071,96 15.464,97 58.696,98 22.954,99 0.434,100 1.991,101 44.144,102 15.101,103 72.165,104 22.404,105 32,106 51,107 0.238,108 0.596,109 0.789,110 0.834,111 0.843,112 0.843,113 3.561,114 0.971,115 -3.56,116 -3.54,117 -3.37,119 39.4,121 6,122 1,124 2,125 3,132 1,133 1,137 3,138 2,139 1,141 1,146 1,150 3,153 1,162 14,164 1,165 2,167 2,169 2,170 18,173 4,174 1,176 2,177 1,178 3,180 17,184 5,186 1,188 3,190 13,194 10,195 5}
{0 CHEMBL1908396,1 15.044,2 1.12,3 30.187,4 1.725,5 13.882,6 3.467,7 12.019,8 127.926,9 8.286,10 0.595,11 4.179,12 4.273,13 3.865,14 3.695,15 5.365,16 3.691,17 4.676,18 4.82,19 4.21,20 4.029,21 5.836,22 4.019,23 4.81,24 4.952,25 4.267,26 4.128,27 5.969,28 4.117,29 4.908,30 5.054,31 4.256,32 4.189,33 6.087,34 4.155,35 5.014,36 5.2,37 4.236,38 4.199,39 6.198,40 4.144,41 4.963,42 5.171,43 4.112,44 4.147,45 6.037,46 4.08,47 4.901,48 5.101,49 4.059,50 4.096,51 5.988,52 4.024,53 4.825,54 5.018,55 4.052,56 4.041,57 5.849,58 3.962,59 0.12,60 0.839,61 10.643,62 5.373,63 9.758,64 5.983,65 0.542,66 1.287,67 23.313,68 8.563,69 38.93,70 9.636,71 0.646,72 1.464,73 26.135,74 9.446,75 43.65,76 10.616,77 0.671,78 1.578,79 29.749,80 11.1,81 45.753,82 12.502,83 1.021,84 1.662,85 33.575,86 11.797,87 80.173,88 14.557,89 0.681,90 1.573,91 32.873,92 11.964,93 57.179,94 0.762,95 1.482,96 10.886,97 69.801,98 13.307,99 0.632,100 1.381,101 29.803,102 10.812,103 44.617,104 12.91,105 35,106 51,107 0.279,108 0.614,109 0.773,110 0.835,111 0.848,112 0.877,113 3.56,114 0.911,115 -1.72,116 -1.79,117 -1.81,119 41.4,120 1,124 3,126 1,137 6,138 1,139 6,140 2,141 1,146 1,151 1,153 1,162 2,165 11,167 2,168 1,169 2,170 3,173 1,174 8,176 2,178 3,180 4,183 3,184 5,188 2,190 5,193 4,194 4,195 5}
{0 CHEMBL1908397,1 10.165,2 0.934,3 18.868,4 1.472,5 11.68,6 2.724,7 7.42,8 100.285,9 7.388,10 0.571,11 3.911,12 4.039,13 3.483,14 3.483,15 4.988,16 3.457,17 4.433,18 4.608,19 3.812,20 3.874,21 5.459,22 3.825,23 4.685,24 4.91,25 3.823,26 3.981,27 5.672,28 3.893,29 4.685,30 4.917,31 3.663,32 3.874,33 5.729,34 3.773,35 4.528,36 4.765,37 3.498,38 3.747,39 5.542,40 3.635,41 4.405,42 4.635,43 3.443,44 3.711,45 5.33,46 3.589,47 4.418,48 4.68,49 3.334,50 3.628,51 5.309,52 3.496,53 4.195,54 4.446,55 3.138,56 3.439,57 5.085,58 3.309,59 0.056,60 0.685,61 9.145,62 3.907,63 6.95,64 5.242,65 0.163,66 1.109,67 16.808,68 6.318,69 14.143,70 8.8,71 0.19,72 1.317,73 23.453,74 8.784,75 25.75,76 12.338,77 0.264,78 1.236,79 24.534,80 8.639,81 46.309,82 11.83,83 0.283,84 1.045,85 21.099,86 7.671,87 42.677,88 10.556,89 0.095,90 0.972,91 17.651,92 7.21,93 22.002,94 0.154,95 0.962,96 6.932,97 25.382,98 10.013,99 0.117,100 0.767,101 14.848,102 5.646,103 18.257,104 8.044,105 2,106 38,107 0.251,108 0.576,109 0.695,110 0.809,111 0.831,112 0.831,113 3.266,114 0.913,115 -3.62,116 -3.59,117 -3.42,119 44.4,125 4,132 2,137 8,138 3,141 1,147 1,150 1,160 1,162 12,164 1,165 4,169 2,170 14,174 7,176 1,178 3,180 11,184 6,188 3,190 7,194 3,195 5.328}
{0 CHEMBL215152,1 17.129,2 1.259,3 32.383,4 1.681,5 17.459,6 3.771,7 14.22,8 139.919,9 7.577,10 0.55,11 4.307,12 4.435,13 3.872,14 3.771,15 5.458,16 3.774,17 4.827,18 5.009,19 4.192,20 4.127,21 5.96,22 4.108,23 5.066,24 5.289,25 4.202,26 4.231,27 6.134,28 4.185,29 5.098,30 5.335,31 4.193,32 4.241,33 6.171,34 4.167,35 5.13,36 5.377,37 4.134,38 4.209,39 6.206,40 4.136,41 5.077,42 5.331,43 4.092,44 4.138,45 6.191,46 4.06,47 4.929,48 5.166,49 3.994,50 4.054,51 5.984,52 3.995,53 4.815,54 5.039,55 3.982,56 4.027,57 5.903,58 3.96,59 0.144,60 1.088,61 13.616,62 5.607,63 16.068,64 7.417,65 0.443,66 1.651,67 25.778,68 8.954,69 42.252,70 12.355,71 0.745,72 1.9,73 35.981,74 10.775,75 73.434,76 15.28,77 0.757,78 1.89,79 37.31,80 12.071,81 69.112,82 17.533,83 0.771,84 1.811,85 39.939,86 12.191,87 98.061,88 17.545,89 0.945,90 1.666,91 38.803,92 11.702,93 116.811,94 0.766,95 1.581,96 9.258,97 76.09,98 13.442,99 0.524,100 1.523,101 26.96,102 8.899,103 47.555,104 13.035,105 27,106 53,107 0.264,108 0.627,109 0.817,110 0.91,111 0.91,112 0.91,113 3.641,114 0.908,115 -4.34,116 -4.28,117 -4.04,119 38.8,120 1,121 2,125 5,137 8,138 1,139 3,141 1,142 2,143 1,147 1,150 1,160 1,162 4,164 1,165 10,167 3,169 7,170 7,174 4,176 1,177 1,178 2,180 2,183 3,184 9,186 2,187 1,188 5,190 6,193 1,194 2,195 5}
{0 CHEMBL221959,1 13.766,2 0.935,3 25.547,4 1.567,5 8.696,6 1.372,7 1.883,8 87.831,9 7.266,10 0.4,11 3.858,12 3.998,13 3.408,14 3.334,15 4.964,16 3.324,17 4.432,18 4.643,19 3.762,20 3.746,21 5.408,22 3.709,23 4.697,24 4.92,25 3.855,26 3.924,27 5.691,28 3.859,29 4.853,30 5.103,31 3.837,32 3.998,33 5.874,34 3.897,35 4.905,36 5.183,37 3.72,38 4.009,39 5.772,40 3.869,41 4.827,42 5.104,43 3.663,44 3.916,45 5.78,46 3.789,47 4.681,48 4.945,49 3.517,50 3.743,51 5.755,52 3.62,53 4.465,54 4.769,55 3.189,56 3.443,57 5.493,58 3.305,59 0.02,60 0.693,61 9.09,62 3.332,63 9.916,64 4.976,65 0.278,66 1.085,67 18.121,68 5.65,69 22.406,70 8.677,71 0.25,72 1.31,73 24.153,74 7.443,75 39.951,76 11.503,77 0.483,78 1.411,79 29.517,80 9.021,81 72.937,82 13.754,83 0.428,84 1.405,85 31.822,86 9.981,87 54.136,88 15.511,89 0.334,90 1.307,91 29.314,92 8.631,93 58.293,94 0.462,95 1.106,96 7.42,97 68.581,98 11.408,99 0.26,100 0.837,101 21.112,102 5.624,103 40.757,104 9.33,105 20,106 35,107 0.274,108 0.644,109 0.86,110 0.876,111 0.876,112 0.876,113 3.189,114 0.933,115 -3,116 -3.01,117 -2.9,119 37.2,120 1,121 2,122 1,124 1,125 2,126 1,137 1,138 1,142 1,143 1,146 1,150 2,153 1,162 3,164 3,165 8,167 1,169 2,170 1,173 1,174 6,183 3,184 3,186 2,190 2,193 2,194 5,195 5}
{0 CHEMBL223360,1 9.409,2 0.975,3 18.15,4 1.634,5 11.429,6 4.169,7 17.383,8 107.914,9 8.162,10 0.71,11 3.95,12 4.077,13 3.584,14 3.517,15 5.182,16 3.516,17 4.409,18 4.555,19 3.957,20 3.901,21 5.658,22 3.881,23 4.647,24 4.824,25 4,26 4.007,27 5.876,28 3.969,29 4.721,30 4.936,31 3.93,32 3.963,33 5.904,34 3.912,35 4.667,36 4.882,37 3.863,38 3.86,39 6.017,40 3.812,41 4.591,42 4.828,43 3.641,44 3.733,45 5.779,46 3.668,47 4.397,48 4.639,49 3.447,50 3.569,51 5.514,52 3.493,53 4.231,54 4.463,55 3.433,56 3.458,57 5.408,58 3.397,59 0.108,60 0.782,61 7.914,62 3.697,63 11.726,64 4.413,65 0.223,66 1.204,67 13.556,68 6.439,69 22.404,70 8.066,71 0.344,72 1.489,73 19.254,74 7.879,75 40.825,76 9.722,77 0.337,78 1.507,79 23.161,80 8.716,81 48.52,82 11.124,83 0.537,84 1.362,85 22.441,86 7.743,87 80.827,88 10.011,89 0.435,90 1.257,91 22.255,92 7.478,93 67.431,94 0.323,95 1.008,96 6.136,97 46.423,98 8.048,99 0.256,100 0.927,101 15.067,102 5.878,103 32.921,104 7.568,105 17,106 44,107 0.276,108 0.606,109 0.745,110 0.86,111 0.877,112 0.877,113 3.374,114 0.84,115 -5.45,116 -5.33,117 -4.98,119 45.7,120 1,137 10,138 4,139 3,142 1,147 1,151 1,155 1,156 1,157 1,160 1,162 13,165 1,166 1,167 3,168 1,169 6,170 16,172 1,174 2,177 1,178 7,179 1,180 13,182 1,184 6,188 11,190 7,191 3,194 6,195 5}
{0 CHEMBL230011,1 7.587,2 0.839,3 15.847,4 1.675,5 7.885,6 2.637,7 6.954,8 95.202,9 8.659,10 0.793,11 3.843,12 3.954,13 3.515,14 3.384,15 5.164,16 3.411,17 4.25,18 4.376,19 3.905,20 3.754,21 5.605,22 3.767,23 4.496,24 4.657,25 3.98,26 3.858,27 5.801,28 3.863,29 4.507,30 4.696,31 3.942,32 3.821,33 5.799,34 3.817,35 4.496,36 4.674,37 3.931,38 3.849,39 5.791,40 3.846,41 4.514,42 4.684,43 3.954,44 3.893,45 5.791,46 3.878,47 4.559,48 4.734,49 3.901,50 3.861,51 5.867,52 3.837,53 4.566,54 4.771,55 3.675,56 3.667,57 5.923,58 3.619,59 0.151,60 0.65,61 6.242,62 2.923,63 22.572,64 3.025,65 0.206,66 0.992,67 9.428,68 4.932,69 19.459,70 5.714,71 0.38,72 1.197,73 14.477,74 5.901,75 42.394,76 6.727,77 0.385,78 1.197,79 16.05,80 6.158,81 47.359,82 7.601,83 0.445,84 1.192,85 15.109,86 5.438,87 53.866,88 6.345,89 0.349,90 1.188,91 15.003,92 6.25,93 38.169,94 0.335,95 1.202,96 6.594,97 35.346,98 7.887,99 0.528,100 1.095,101 18.861,102 6.686,103 68.064,104 8.135,105 17,106 42,107 0.29,108 0.593,109 0.706,110 0.801,111 0.81,112 0.827,113 3.306,114 0.797,115 -3.67,116 -3.64,117 -3.47,119 45,137 8,138 2,139 2,141 3,142 1,144 1,145 1,155 2,156 2,157 2,162 8,164 2,165 2,166 3,167 3,169 4,170 8,173 3,174 6,175 1,176 1,178 4,180 5,183 1,184 7,185 3,186 3,187 1,188 2,189 2,190 4,192 1,194 8,195 5}
{0 CHEMBL2309006,1 20.833,2 1.181,3 43.8,4 1.547,5 7.727,6 3.097,7 9.588,8 120.91,9 8.139,10 0.6,11 4.166,12 4.257,13 3.825,14 3.754,15 5.256,16 3.76,17 4.761,18 4.88,19 4.355,20 4.261,21 5.837,22 4.266,23 5.105,24 5.244,25 4.581,26 4.502,27 6.247,28 4.5,29 5.272,30 5.421,31 4.66,32 4.645,33 6.369,34 4.624,35 5.354,36 5.532,37 4.675,38 4.696,39 6.412,40 4.657,41 5.343,42 5.511,43 4.583,44 4.661,45 6.447,46 4.604,47 5.32,48 5.527,49 4.257,50 4.47,51 6.426,52 4.363,53 5.075,54 5.343,55 3.604,56 4.018,57 6.113,58 3.844,59 0.099,60 0.784,61 9.631,62 4.91,63 17.601,64 5.507,65 0.341,66 1.418,67 19.436,68 8.823,69 35.052,70 10.31,71 0.718,72 1.945,73 30.363,74 12.462,75 77.919,76 14.241,77 0.757,78 2.287,79 36.384,80 14.993,81 73.412,82 17.333,83 0.663,84 2.483,85 41.505,86 17.22,87 56.009,88 21.179,89 0.509,90 2.417,91 39.468,92 17.223,93 55.808,94 0.759,95 2.258,96 17.535,97 98.068,98 21.867,99 0.716,100 1.704,101 40.317,102 14.344,103 102.389,104 18.88,105 18,106 67,107 0.249,108 0.619,109 0.763,110 0.835,111 0.859,112 0.883,113 3.535,114 0.847,115 -3.29,116 -3.28,117 -3.14,119 48.1,120 1,121 1,125 2,127 1,128 1,129 1,137 8,138 6,147 4,150 1,162 13,164 2,165 11,167 1,169 3,170 14,173 1,174 11,176 2,177 1,178 4,180 14,184 15,186 3,188 3,190 16,193 1,194 12,195 5.051}
{0 CHEMBL2309609,1 34.924,2 1.32,3 73.598,4 1.495,5 10.884,6 5.28,7 27.873,8 161.613,9 7.818,10 0.588,11 4.432,12 4.533,13 4.067,14 4.023,15 5.496,16 4.016,17 5.025,18 5.167,19 4.544,20 4.493,21 6.056,22 4.483,23 5.333,24 5.485,25 4.773,26 4.738,27 6.359,28 4.721,29 5.534,30 5.691,31 4.914,32 4.904,33 6.564,34 4.88,35 5.692,36 5.865,37 4.973,38 5.013,39 6.721,40 4.969,41 5.784,42 5.982,43 4.947,44 5.063,45 6.789,46 4.989,47 5.803,48 6.024,49 4.802,50 5.003,51 6.787,52 4.902,53 5.655,54 5.887,55 4.571,56 4.828,57 6.63,58 4.71,59 0.025,60 1.045,61 13.58,62 6.639,63 11.439,64 8.089,65 0.432,66 1.864,67 28.35,68 11.59,69 33.192,70 14.33,71 0.591,72 2.488,73 40.031,74 16.026,75 47.117,76 19.605,77 0.59,78 3.015,79 49.661,80 19.899,81 68.572,82 24.119,83 0.87,84 3.522,85 59.91,86 23.293,87 83.434,88 28.77,89 0.845,90 3.793,91 68.123,92 27.096,93 96.013,94 0.914,95 3.759,96 28.599,97 122.862,98 37.189,99 0.723,100 3.236,101 64.383,102 24.864,103 97.084,104 32.687,105 27,106 81,107 0.226,108 0.55,109 0.729,110 0.82,111 0.857,112 0.873,113 3.789,114 0.868,115 -4.65,116 -4.57,117 -4.3,119 47.9,120 1,121 1,124 2,125 1,126 2,127 1,129 1,137 13,138 7,147 4,150 2,162 19,164 3,165 14,167 1,169 2,170 20,173 4,174 16,178 2,180 16,183 3,184 22,188 2,190 18,193 3,194 18,195 5}
{0 CHEMBL24828,1 12.223,2 1.064,3 31.754,4 1.715,5 12.633,6 5.087,7 25.882,8 118.666,9 8.804,10 0.515,11 4.096,12 4.21,13 3.809,14 3.624,15 5.183,16 3.608,17 4.654,18 4.831,19 4.207,20 4.022,21 5.692,22 3.985,23 4.896,24 5.087,25 4.303,26 4.185,27 5.942,28 4.112,29 5,30 5.239,31 4.249,32 4.119,33 5.993,34 4.028,35 4.9,36 5.149,37 4.082,38 4.02,39 5.885,40 3.947,41 4.725,42 4.904,43 4.108,44 4.046,45 5.806,46 3.985,47 4.877,48 5.093,49 4.17,50 4.064,51 5.938,52 3.991,53 4.807,54 5.035,55 4.136,56 4.001,57 5.805,58 3.888,59 0.058,60 0.853,61 9.037,62 4.983,63 7.077,64 6.16,65 0.356,66 1.361,67 21.772,68 8.436,69 26.488,70 10.434,71 0.51,72 1.694,73 35.268,74 11.548,75 40.534,76 14.399,77 0.653,78 1.701,79 43.941,80 12.799,81 59.27,82 16.162,83 0.799,84 1.495,85 35.628,86 10.733,87 59.961,88 14.498,89 0.337,90 1.441,91 25.124,92 9.744,93 30.079,94 0.614,95 1.604,96 10.393,97 58.941,98 13.134,99 0.6,100 1.394,101 30.973,102 10.363,103 50.053,104 13.272,105 18,106 46,107 0.284,108 0.627,109 0.815,110 0.857,111 0.857,112 0.857,113 3.44,114 0.972,115 -5,116 -4.9,117 -4.6,118 1,119 40.7,121 2,122 1,124 2,125 3,137 5,138 1,139 5,141 1,142 1,143 1,162 4,164 1,165 8,167 1,169 2,170 5,173 1,174 8,178 3,180 3,183 1,184 3,186 1,188 1,190 2,193 3,194 3,195 5}
{0 CHEMBL249697,1 8.387,2 0.717,3 16.434,4 1.437,5 7.316,6 1.761,7 3.1,8 76.664,9 7.093,10 0.714,11 3.69,12 3.839,13 3.224,14 3.19,15 4.767,16 3.172,17 4.205,18 4.411,19 3.589,20 3.567,21 5.202,22 3.531,23 4.386,24 4.615,25 3.648,26 3.681,27 5.395,28 3.624,29 4.446,30 4.695,31 3.586,32 3.681,33 5.378,34 3.609,35 4.341,36 4.568,37 3.465,38 3.618,39 5.314,40 3.534,41 4.36,42 4.611,43 3.224,44 3.548,45 5.303,46 3.415,47 4.271,48 4.552,49 2.73,50 3.342,51 5.081,52 3.119,53 4.082,54 4.442,55 2.203,56 2.933,57 4.749,58 2.65,59 0.039,60 0.587,61 7.979,62 2.761,63 7.893,64 4.178,65 0.141,66 0.905,67 14.364,68 4.628,69 14.081,70 7.141,71 0.278,72 1.037,73 17.776,74 5.514,75 24.113,76 8.461,77 0.179,78 1.047,79 19.171,80 5.597,81 21.424,82 9.019,83 0.184,84 0.966,85 16.879,86 5.178,87 20.287,88 8.103,89 0.242,90 0.914,91 17.665,92 5.385,93 25.449,94 0.123,95 0.74,96 5.646,97 19.862,98 8.709,99 0.137,100 0.509,101 14.76,102 4.658,103 20.489,104 7.463,105 13,106 30,107 0.261,108 0.653,109 0.786,110 0.86,111 0.86,112 0.86,113 3.013,114 0.913,115 -2.81,116 -2.82,117 -2.73,119 38.9,120 2,125 2,137 3,138 1,140 1,141 1,142 1,147 2,153 1,155 1,156 1,157 1,162 4,164 1,165 3,167 1,170 4,173 2,174 5,176 2,177 1,179 1,180 2,184 4,188 1,190 1,194 4,195 5}
{0 CHEMBL255863,1 11.17,2 1.253,3 32.789,4 1.716,5 14.769,6 5.084,7 25.849,8 140.252,9 8.681,10 0.674,11 4.236,12 4.35,13 3.921,14 3.781,15 5.478,16 3.8,17 4.739,18 4.893,19 4.349,20 4.15,21 6.333,22 4.161,23 4.908,24 5.077,25 4.326,26 4.265,27 6.178,28 4.25,29 5.037,30 5.246,31 4.309,32 4.247,33 6.287,34 4.228,35 5.006,36 5.216,37 4.393,38 4.231,39 6.329,40 4.226,41 4.99,42 5.176,43 4.366,44 4.232,45 6.37,46 4.24,47 5.048,48 5.25,49 4.376,50 4.214,51 6.634,52 4.208,53 4.881,54 5.068,55 4.22,56 4.165,57 6.205,58 4.141,59 0.17,60 1.169,61 8.678,62 4.973,63 20.21,64 5.501,65 0.955,66 2.17,67 18.501,68 8.284,69 141.288,70 9.406,71 0.491,72 2.047,73 21.562,74 9.741,75 36.543,76 11.338,77 0.855,78 2.22,79 30.557,80 11.422,81 98.132,82 13.327,83 1.003,84 2.211,85 29.88,86 10.502,87 81.361,88 13.362,89 0.867,90 2.306,91 26.91,92 10.516,93 89.115,94 1.472,95 2.324,96 11.889,97 229.403,98 13.493,99 0.573,100 1.98,101 23.789,102 10.394,103 53.249,104 12.151,105 38,106 62,107 0.271,108 0.601,109 0.777,110 0.884,111 0.9,112 0.9,113 3.693,114 0.824,115 -4.91,116 -4.82,117 -4.52,119 45.9,120 2,130 1,137 9,138 4,139 3,140 3,141 2,145 1,146 1,150 1,152 1,162 9,164 2,165 9,167 3,169 5,170 10,174 6,178 6,180 6,183 1,184 13,186 1,188 5,190 4,194 10,195 5}
{0 CHEMBL259084,1 9.633,2 0.886,3 27.385,4 1.805,5 12.382,6 6.167,7 38.036,8 123.999,9 9.732,10 0.632,11 4.038,12 4.122,13 3.816,14 3.667,15 5.347,16 3.681,17 4.508,18 4.617,19 4.228,20 4.057,21 5.92,22 4.061,23 4.792,24 4.932,25 4.383,26 4.222,27 6.131,28 4.224,29 4.87,30 5.039,31 4.381,32 4.18,33 6.355,34 4.184,35 4.817,36 4.98,37 4.353,38 4.193,39 6.118,40 4.187,41 4.846,42 5.019,43 4.384,44 4.181,45 6.209,46 4.165,47 4.792,48 4.977,49 4.335,50 4.091,51 6.219,52 4.054,53 4.613,54 4.797,55 4.07,56 3.902,57 6.046,58 3.858,59 0.191,60 0.819,61 4.764,62 3.856,63 24.096,64 3.682,65 0.415,66 1.332,67 8.932,68 6.355,69 53.058,70 6.425,71 0.585,72 1.774,73 17.729,74 8.989,75 73.495,76 8.972,77 1.019,78 2.073,79 21.224,80 9.337,81 133.233,82 9.046,83 0.701,84 1.794,85 18.749,86 9.09,87 97.64,88 9.039,89 0.853,90 1.966,91 20.823,92 9.764,93 104.276,94 0.951,95 1.667,96 10.125,97 113.46,98 10.879,99 0.83,100 1.414,101 22.3,102 8.175,103 96.873,104 9.093,105 27,106 55,107 0.297,108 0.632,109 0.764,110 0.856,111 0.865,112 0.865,113 3.561,114 0.832,115 -5.59,116 -5.46,117 -5.09,119 51,125 1,137 10,138 5,139 4,140 1,141 1,145 1,149 1,150 1,159 1,161 1,162 10,163 1,164 1,165 7,167 3,169 3,170 15,171 2,174 6,178 4,180 11,181 2,183 2,184 12,188 5,190 7,194 10,195 5}
{0 CHEMBL261849,1 11.286,2 0.948,3 23.357,4 1.588,5 12.778,6 3.127,7 9.779,8 106.122,9 7.479,10 0.621,11 3.994,12 4.11,13 3.552,14 3.474,15 5.177,16 3.477,17 4.473,18 4.635,19 3.859,20 3.811,21 5.61,22 3.797,23 4.61,24 4.764,25 3.924,26 3.939,27 5.724,28 3.903,29 4.754,30 4.963,31 3.786,32 3.943,33 5.791,34 3.858,35 4.764,36 5.007,37 3.693,38 3.901,39 5.695,40 3.8,41 4.633,42 4.857,43 3.695,44 3.83,45 5.638,46 3.746,47 4.618,48 4.854,49 3.676,50 3.765,51 5.626,52 3.681,53 4.53,54 4.751,55 3.531,56 3.647,57 5.563,58 3.56,59 0.069,60 0.705,61 10.086,62 4.218,63 12.468,64 5.389,65 0.345,66 1.035,67 18.562,68 7.05,69 31.217,70 8.841,71 0.307,72 1.2,73 20.517,74 7.862,75 27.304,76 10.287,77 0.384,78 1.288,79 25.704,80 9.14,81 45.5,82 12.349,83 0.426,84 1.239,85 27.512,86 9.309,87 43.763,88 12.999,89 0.384,90 1.141,91 23.149,92 8.032,93 36.626,94 0.387,95 1.072,96 8.165,97 37.643,98 11.531,99 0.442,100 0.961,101 21.488,102 7.238,103 39.423,104 9.947,105 21,106 39,107 0.269,108 0.587,109 0.734,110 0.816,111 0.842,112 0.862,113 3.339,114 0.867,115 -3.7,116 -3.67,117 -3.49,119 40.8,121 1,124 2,125 1,137 7,138 3,139 3,140 1,142 1,145 1,155 2,156 2,157 2,162 9,164 1,165 7,166 3,167 3,169 1,170 9,172 1,173 1,174 10,178 1,180 6,182 1,184 8,185 1,186 1,187 1,188 2,189 2,190 2,191 2,192 1,194 7,195 5}
{0 CHEMBL288441,1 17.233,2 1.108,3 44.73,4 1.692,5 14.556,6 4.883,7 23.847,8 142.137,9 8.162,10 0.436,11 4.273,12 4.384,13 3.916,14 3.784,15 5.376,16 3.77,17 4.831,18 5.013,19 4.276,20 4.168,21 5.83,22 4.139,23 5.047,24 5.227,25 4.462,26 4.366,27 6.1,28 4.306,29 5.171,30 5.39,31 4.438,32 4.411,33 6.182,34 4.3,35 5.173,36 5.417,37 4.323,38 4.353,39 6.121,40 4.252,41 5.067,42 5.27,43 4.381,44 4.327,45 6.127,46 4.251,47 5.082,48 5.292,49 4.382,50 4.291,51 6.218,52 4.216,53 4.969,54 5.165,55 4.319,56 4.22,57 6.095,58 4.143,59 0.069,60 0.928,61 12.114,62 5.76,63 11.444,64 7.328,65 0.459,66 1.455,67 27.478,68 9.309,69 28.265,70 11.987,71 0.67,72 1.759,73 37.048,74 12.412,75 44.354,76 16.176,77 0.747,78 1.885,79 48.447,80 15.391,81 65.448,82 20.506,83 0.786,84 1.823,85 47.666,86 15.1,87 61.843,88 20.601,89 0.545,90 1.697,91 38.227,92 13.209,93 51.397,94 0.835,95 1.649,96 12.79,97 81.487,98 16.75,99 0.591,100 1.526,101 34.875,102 12.092,103 61.341,104 15.781,105 46,106 54,107 0.269,108 0.578,109 0.758,110 0.819,111 0.844,112 0.858,113 3.616,114 0.956,115 -2.61,116 -2.63,117 -2.56,119 40,121 1,124 3,125 6,137 4,138 2,139 7,140 1,141 1,150 1,162 1,165 9,169 3,170 4,173 2,174 6,178 3,180 5,183 3,184 2,186 3,188 1,190 5,193 1,194 5,195 7.027}
{0 CHEMBL296468,1 8.452,2 1.062,3 34.79,4 1.706,5 11.8,6 2.284,7 5.216,8 101.699,9 7.767,10 0.37,11 3.979,12 4.1,13 3.665,14 3.55,15 4.99,16 3.47,17 4.551,18 4.736,19 4.127,20 3.973,21 5.51,22 3.851,23 4.782,24 4.99,25 3.999,26 4.025,27 5.719,28 3.878,29 4.895,30 5.161,31 3.92,32 3.959,33 5.827,34 3.792,35 4.614,36 4.87,37 3.825,38 3.766,39 5.612,40 3.614,41 4.288,42 4.455,43 3.875,44 3.739,45 5.319,46 3.56,47 4.388,48 4.617,49 3.622,50 3.732,51 5.218,52 3.493,53 4.129,54 4.299,55 3.55,56 3.559,57 5.096,58 3.378,59 0.023,60 0.759,61 11.51,62 5.054,63 7.549,64 6.286,65 0.278,66 1.247,67 28.591,68 9.346,69 26.577,70 11.26,71 0.297,72 1.401,73 33.279,74 10.879,75 34.528,76 13.753,77 0.565,78 1.39,79 39.808,80 11.762,81 59.771,82 14.875,83 0.453,84 1.155,85 31.374,86 8.604,87 47.285,88 10.791,89 0.28,90 0.985,91 24.271,92 7.881,93 25.889,94 0.298,95 1.03,96 10.196,97 21.236,98 10.966,99 0.13,100 0.81,101 20.114,102 6.957,103 17.688,104 7.67,105 18,106 38,107 0.292,108 0.602,109 0.762,110 0.769,111 0.769,112 0.769,113 3.266,114 1.141,115 -3.55,116 -3.52,117 -3.36,119 34.7,120 3,121 2,122 1,123 1,125 3,140 2,147 1,148 1,150 1,153 1,154 1,162 5,164 1,165 3,167 2,169 4,170 5,174 9,178 3,183 1,184 5,188 1,190 1,194 4,195 5}
{0 CHEMBL300138,1 22.641,2 1.245,3 45.411,4 1.463,5 13.769,6 4.534,7 20.558,8 151.757,9 7.583,10 0.578,11 4.333,12 4.449,13 3.937,14 3.93,15 5.403,16 3.909,17 4.891,18 5.057,19 4.336,20 4.371,21 5.922,22 4.332,23 5.159,24 5.356,25 4.405,26 4.538,27 6.128,28 4.466,29 5.263,30 5.477,31 4.438,32 4.597,33 6.268,34 4.508,35 5.31,36 5.525,37 4.491,38 4.613,39 6.325,40 4.532,41 5.321,42 5.528,43 4.488,44 4.613,45 6.389,46 4.535,47 5.332,48 5.549,49 4.383,50 4.562,51 6.387,52 4.469,53 5.254,54 5.487,55 4.229,56 4.439,57 6.266,58 4.338,59 0.024,60 1.003,61 13.098,62 5.962,63 8.409,64 7.762,65 0.268,66 1.73,67 25.55,68 10.038,69 25.517,70 13.473,71 0.279,72 2.148,73 35.731,74 14.257,75 33.073,76 19.155,77 0.361,78 2.339,79 40.757,80 16.439,81 61.46,82 22.531,83 0.425,84 2.439,85 43.258,86 16.985,87 51.945,88 23.08,89 0.414,90 2.432,91 43.587,92 16.945,93 64.64,94 0.47,95 2.42,96 17.217,97 83.853,98 22.682,99 0.493,100 2.205,101 43.594,102 15.829,103 86.688,104 20.961,105 10,106 66,107 0.225,108 0.565,109 0.719,110 0.796,111 0.832,112 0.85,113 3.694,114 0.897,115 -4.04,116 -3.99,117 -3.78,119 47.1,121 2,124 1,125 3,126 1,133 2,137 11,138 4,140 1,141 1,146 2,147 2,150 2,162 15,165 14,167 2,169 2,170 16,173 1,174 12,178 2,180 13,183 2,184 9,188 2,190 16,193 2,194 9,195 5}
{0 CHEMBL31965,1 14.343,2 1.064,3 32.179,4 1.772,5 13.382,6 4.038,7 16.303,8 128.881,9 8.237,10 0.459,11 4.189,12 4.302,13 3.832,14 3.687,15 5.339,16 3.692,17 4.727,18 4.89,19 4.185,20 4.051,21 5.872,22 4.039,23 4.974,24 5.173,25 4.295,26 4.187,27 6.14,28 4.149,29 4.987,30 5.209,31 4.153,32 4.174,33 6.024,34 4.1,35 4.981,36 5.213,37 4.15,38 4.173,39 6.025,40 4.098,41 4.966,42 5.177,43 4.196,44 4.161,45 6.05,46 4.111,47 4.953,48 5.157,49 4.23,50 4.162,51 6.137,52 4.106,53 4.887,54 5.09,55 4.185,56 4.122,57 6.058,58 4.065,59 0.126,60 0.934,61 10.471,62 5.109,63 13.648,64 6.243,65 0.499,66 1.442,67 22.228,68 8.341,69 37.702,70 10.315,71 0.855,72 1.704,73 34.269,74 10.812,75 80.994,76 13.657,77 0.767,78 1.674,79 34.53,80 11.419,81 69.915,82 15.23,83 0.746,84 1.619,85 35.318,86 11.901,87 69.817,88 16.304,89 0.759,90 1.615,91 32.606,92 10.923,93 68.483,94 0.913,95 1.625,96 10.748,97 81.979,98 14.076,99 0.567,100 1.61,101 30.95,102 10.087,103 61.965,104 13.165,105 20,106 50,107 0.287,108 0.648,109 0.808,110 0.875,111 0.875,112 0.875,113 3.56,114 0.915,115 -4.06,116 -4.01,117 -3.8,119 40.7,121 1,125 6,131 1,132 1,137 5,138 1,139 5,141 1,142 1,143 1,150 1,162 3,164 1,165 7,167 2,169 5,170 3,173 1,174 4,176 1,178 5,180 3,183 2,184 5,186 1,188 2,190 5,193 1,194 5,195 5}
{0 CHEMBL377300,1 9.541,2 0.926,3 23.28,4 1.737,5 10.667,6 3.998,7 15.98,8 99.425,9 8.053,10 0.667,11 3.969,12 4.075,13 3.595,14 3.442,15 5.155,16 3.465,17 4.486,18 4.641,19 3.993,20 3.812,21 5.66,22 3.837,23 4.673,24 4.828,25 4.062,26 3.886,27 5.958,28 3.901,29 4.729,30 4.929,31 3.971,32 3.855,33 5.902,34 3.848,35 4.586,36 4.771,37 3.866,38 3.781,39 5.811,40 3.768,41 4.608,42 4.805,43 3.857,44 3.815,45 5.79,46 3.786,47 4.648,48 4.862,49 3.806,50 3.755,51 5.861,52 3.727,53 4.533,54 4.767,55 3.644,56 3.611,57 5.74,58 3.565,59 0.152,60 0.756,61 8.482,62 4.074,63 13.139,64 4.746,65 0.381,66 1.172,67 16.916,68 6.524,69 31.722,70 8.026,71 0.805,72 1.343,73 21.689,74 7.604,75 60.193,76 8.969,77 0.757,78 1.404,79 25.402,80 8.334,81 56.999,82 10.3,83 0.713,84 1.27,85 20.691,86 6.914,87 54.499,88 8.53,89 0.552,90 1.336,91 21.105,92 7.571,93 47.249,94 0.686,95 1.316,96 7.274,97 62.388,98 9.311,99 0.779,100 1.072,101 22.034,102 6.623,103 72.722,104 8.856,105 29,106 44,107 0.295,108 0.697,109 0.839,110 0.879,111 0.879,112 0.879,113 3.341,114 0.853,115 -4.07,116 -4.02,117 -3.81,119 41.3,120 3,125 1,126 1,137 3,138 2,139 3,142 1,143 1,146 1,147 3,158 1,162 3,164 2,165 3,169 5,170 2,173 3,174 8,176 1,178 1,180 3,183 2,184 5,190 2,193 2,194 3,195 5}
{0 CHEMBL379218,1 11.871,2 0.894,3 22.792,4 1.447,5 11.889,6 3.212,7 10.318,8 107.094,9 7.316,10 0.733,11 3.988,12 4.113,13 3.548,14 3.566,15 5.096,16 3.538,17 4.486,18 4.649,19 3.875,20 3.946,21 5.513,22 3.897,23 4.722,24 4.921,25 3.882,26 4.052,27 5.728,28 3.964,29 4.797,30 5.045,31 3.741,32 3.999,33 5.685,34 3.879,35 4.677,36 4.916,37 3.705,38 3.912,39 5.619,40 3.805,41 4.661,42 4.897,43 3.667,44 3.85,45 5.636,46 3.748,47 4.59,48 4.847,49 3.557,50 3.746,51 5.517,52 3.64,53 4.42,54 4.66,55 3.467,56 3.656,57 5.379,58 3.548,59 0.07,60 0.719,61 10.103,62 4.355,63 11.923,64 5.765,65 0.115,66 1.123,67 17.865,68 7.253,69 18.259,70 9.74,71 0.292,72 1.358,73 24.012,74 9.183,75 34.729,76 12.615,77 0.244,78 1.398,79 27.58,80 10.137,81 34.748,82 14.244,83 0.171,84 1.263,85 23.926,86 8.953,87 31.875,88 12.626,89 0.236,90 1.23,91 23.868,92 8.561,93 36.542,94 0.274,95 1.148,96 7.822,97 32.595,98 11.064,99 0.24,100 0.97,101 18.622,102 6.861,103 27.527,104 9.772,105 5,106 41,107 0.242,108 0.6,109 0.775,110 0.866,111 0.875,112 0.875,113 3.339,114 0.901,115 -3.58,116 -3.55,117 -3.39,119 44.9,120 1,121 1,125 1,126 1,137 9,138 4,139 1,140 2,141 1,147 1,155 1,156 1,157 1,160 1,162 13,165 4,169 3,170 16,172 1,173 1,174 7,175 1,176 1,178 3,180 12,182 1,184 5,188 4,190 5,191 2,194 7,195 5}
{0 CHEMBL384304,1 10.233,2 1.064,3 24.279,4 1.968,5 12.033,6 1.658,7 2.749,8 109.44,9 8.657,10 0.375,11 4.056,12 4.16,13 3.858,14 3.537,15 5.251,16 3.538,17 4.617,18 4.777,19 4.158,20 3.908,21 5.995,22 3.907,23 4.88,24 5.061,25 4.271,26 4.064,27 6.262,28 4.058,29 4.97,30 5.157,31 4.23,32 4.054,33 6.454,34 4.03,35 4.944,36 5.176,37 4.081,38 3.955,39 6.289,40 3.925,41 4.789,42 5.011,43 4.025,44 3.819,45 6.221,46 3.798,47 4.649,48 4.869,49 3.851,50 3.69,51 6.013,52 3.657,53 4.55,54 4.811,55 3.677,56 3.553,57 5.847,58 3.48,59 0.25,60 0.925,61 11.052,62 4.708,63 37.82,64 5.191,65 0.752,66 1.413,67 22.484,68 8.115,69 88.598,70 9.215,71 1.11,72 1.841,73 31.381,74 9.87,75 161.414,76 11.228,77 1.469,78 1.667,79 34.955,80 10.782,81 211.429,82 12.687,83 1.361,84 1.548,85 35.038,86 9.377,87 196.719,88 12.633,89 1.248,90 1.518,91 28.584,92 7.928,93 153.265,94 0.992,95 1.329,96 6.467,97 138.479,98 8.546,99 0.894,100 1.003,101 23.773,102 6.066,103 111.734,104 8.642,105 69,106 47,107 0.331,108 0.676,109 0.829,110 0.842,111 0.842,112 0.842,113 3.44,114 1.019,115 -3.31,116 -3.3,117 -3.16,119 35.3,121 2,124 2,125 2,126 1,137 2,138 2,139 3,140 1,142 1,145 1,149 1,155 1,156 1,157 1,162 1,164 4,165 8,166 1,167 3,169 3,170 3,172 1,174 1,180 1,183 3,184 12,185 2,186 3,187 1,188 2,189 1,190 1,191 1,194 1,195 5}
{0 CHEMBL386051,1 8.535,2 0.906,3 30.247,4 1.798,5 11.517,6 5.639,7 31.799,8 120.773,9 9.853,10 0.563,11 3.925,12 4.019,13 3.771,14 3.606,15 5.109,16 3.562,17 4.407,18 4.542,19 4.162,20 3.993,21 5.588,22 3.932,23 4.606,24 4.736,25 4.319,26 4.134,27 5.827,28 4.071,29 4.7,30 4.859,31 4.382,32 4.114,33 5.972,34 4.039,35 4.663,36 4.826,37 4.251,38 4.029,39 5.964,40 3.963,41 4.617,42 4.812,43 4.146,44 3.951,45 5.833,46 3.877,47 4.534,48 4.731,49 3.974,50 3.865,51 5.693,52 3.748,53 4.302,54 4.512,55 3.657,56 3.654,57 5.367,58 3.54,59 0.062,60 0.634,61 4.901,62 3.483,63 5.832,64 3.942,65 0.276,66 1.063,67 15.091,68 6.695,69 15.962,70 7.366,71 0.221,72 1.204,73 18.348,74 7.991,75 22.414,76 8.664,77 0.529,78 1.319,79 26.419,80 8.739,81 55.763,82 9.068,83 0.52,84 1.234,85 26.674,86 8.87,87 54.382,88 9.532,89 0.468,90 1.253,91 20.133,92 7.782,93 48.556,94 0.517,95 1.032,96 8.419,97 52.307,98 9.549,99 0.234,100 0.934,101 15.167,102 6.238,103 23.228,104 7.134,105 27,106 46,107 0.306,108 0.663,109 0.793,110 0.86,111 0.867,112 0.867,113 3.408,114 1.001,115 -6.15,116 -6,117 -5.57,119 46.7,124 2,132 1,133 1,137 7,138 2,139 4,140 1,142 1,145 1,150 1,162 7,164 3,165 5,167 2,169 2,170 14,174 6,178 1,180 10,183 2,184 7,186 1,188 3,190 9,194 12,195 7.244}
{0 CHEMBL428690,1 12.641,2 0.888,3 25.512,4 1.621,5 9.179,6 3.058,7 9.351,8 107.239,9 8.372,10 0.387,11 3.998,12 4.081,13 3.643,14 3.551,15 5.185,16 3.547,17 4.526,18 4.657,19 4.068,20 3.981,21 5.672,22 3.964,23 4.86,24 5.01,25 4.257,26 4.182,27 6.024,28 4.146,29 4.993,30 5.169,31 4.32,32 4.174,33 6.329,34 4.136,35 4.957,36 5.122,37 4.179,38 4.12,39 6.224,40 4.086,41 4.873,42 5.039,43 4.168,44 4.068,45 6.187,46 4.031,47 4.776,48 4.936,49 4.086,50 3.998,51 6.148,52 3.954,53 4.756,54 4.918,55 3.985,56 3.903,57 6.093,58 3.826,59 0.15,60 0.625,61 8.515,62 4.62,63 23.107,64 5.139,65 0.27,66 1.055,67 16.568,68 7.705,69 29.558,70 9.058,71 0.531,72 1.357,73 27.094,74 11.206,75 68.163,76 13.079,77 1.093,78 1.46,79 36.08,80 12.755,81 133.607,82 15.517,83 1.022,84 1.382,85 34.357,86 11.916,87 133.424,88 13.411,89 0.905,90 1.309,91 30.036,92 10.934,93 121.366,94 0.696,95 1.213,96 9.96,97 115.959,98 11.638,99 0.931,100 1.116,101 29.706,102 9.737,103 118.433,104 10.744,105 37,106 46,107 0.275,108 0.664,109 0.835,110 0.897,111 0.911,112 0.911,113 3.376,114 0.908,115 -3.46,116 -3.44,117 -3.29,119 43.8,121 1,122 1,124 1,125 2,126 1,132 1,134 1,137 5,138 3,139 4,149 1,162 6,165 7,169 5,170 12,174 3,176 1,178 3,180 7,183 1,184 9,186 3,187 1,188 4,190 10,194 3,195 5}
{0 CHEMBL445813,1 6.381,2 0.91,3 19.94,4 1.842,5 10.12,6 1.599,7 2.557,8 95.872,9 9.102,10 0.407,11 3.859,12 3.982,13 3.576,14 3.39,15 5.015,16 3.383,17 4.388,18 4.548,19 3.967,20 3.795,21 5.554,22 3.756,23 4.68,24 4.897,25 4.075,26 3.91,27 5.81,28 3.833,29 4.655,30 4.867,31 4.232,32 3.795,33 6.037,34 3.747,35 4.505,36 4.704,37 3.776,38 3.629,39 5.817,40 3.6,41 4.35,42 4.516,43 3.873,44 3.634,45 5.752,46 3.61,47 4.413,48 4.599,49 3.951,50 3.659,51 5.635,52 3.611,53 4.405,54 4.639,55 3.707,56 3.471,57 5.673,58 3.399,59 0.148,60 0.646,61 6.342,62 3.323,63 12.313,64 4.067,65 0.331,66 0.991,67 13.408,68 5.864,69 29.161,70 7.513,71 0.599,72 1.112,73 27.014,74 8.588,75 63.36,76 11.089,77 0.864,78 0.999,79 33.747,80 8.087,81 86.415,82 10.181,83 0.729,84 0.875,85 25.159,86 6.457,87 92.216,88 7.553,89 0.557,90 0.856,91 15.19,92 5.304,93 80.521,94 0.525,95 0.886,96 5.395,97 46.277,98 6.851,99 0.651,100 0.797,101 23.465,102 5.815,103 65.239,104 7.623,105 17,106 37,107 0.324,108 0.692,109 0.811,110 0.831,111 0.831,112 0.831,113 3.267,114 0.958,115 -2.99,116 -2.99,117 -2.89,119 38.1,121 2,125 2,126 1,137 3,138 1,139 3,141 1,146 1,150 2,160 1,162 2,165 1,167 2,169 5,170 8,173 1,176 2,177 1,180 3,184 6,186 2,187 3,188 4,190 3,193 1,194 4,195 5}
{0 CHEMBL450786,1 24.792,2 1.495,3 63.53,4 1.709,5 15.419,6 5.69,7 32.372,8 171.59,9 8.333,10 0.354,11 4.444,12 4.548,13 4.198,14 4.062,15 5.463,16 4.009,17 5.04,18 5.2,19 4.583,20 4.506,21 6.166,22 4.438,23 5.321,24 5.513,25 4.683,26 4.666,27 6.394,28 4.564,29 5.408,30 5.607,31 4.83,32 4.684,33 6.545,34 4.57,35 5.401,36 5.596,37 4.765,38 4.644,39 6.664,40 4.572,41 5.397,42 5.589,43 4.677,44 4.71,45 6.491,46 4.618,47 5.514,48 5.744,49 4.543,50 4.69,51 6.624,52 4.552,53 5.394,54 5.657,55 4.505,56 4.555,57 6.445,58 4.424,59 0.103,60 1.119,61 16.315,62 7.664,63 19.103,64 9.196,65 0.432,66 1.915,67 33.013,68 13.56,69 60.785,70 16.999,71 0.543,72 2.361,73 50.142,74 18.564,75 72.916,76 22.885,77 0.8,78 2.44,79 71.194,80 21.227,81 111.978,82 25.272,83 1.257,84 2.442,85 60.205,86 19.039,87 174.294,88 22.646,89 0.613,90 2.549,91 50.627,92 19.7,93 91.259,94 1.002,95 2.683,96 22.144,97 174.246,98 28.851,99 1.048,100 2.376,101 61.829,102 20.224,103 139.649,104 26.655,105 65,106 72,107 0.26,108 0.587,109 0.76,110 0.844,111 0.855,112 0.855,113 3.788,114 1.062,115 -5.08,116 -4.97,117 -4.66,119 41.6,120 2,121 4,125 5,126 1,132 1,133 1,137 6,138 4,139 4,147 2,150 2,162 10,164 2,165 7,167 1,169 7,170 14,173 1,174 11,178 5,180 11,184 13,186 2,188 1,190 14,193 1,194 17,195 5}
{0 CHEMBL464552,1 17.538,2 1.307,3 42.849,4 1.705,5 13.282,6 3.582,7 12.832,8 146.018,9 7.833,10 0.512,11 4.338,12 4.466,13 3.94,14 3.803,15 5.502,16 3.818,17 4.868,18 5.055,19 4.32,20 4.196,21 6.012,22 4.197,23 5.056,24 5.235,25 4.419,26 4.335,27 6.24,28 4.322,29 5.189,30 5.394,31 4.486,32 4.357,33 6.484,34 4.341,35 5.204,36 5.413,37 4.396,38 4.351,39 6.39,40 4.335,41 5.181,42 5.389,43 4.423,44 4.424,45 6.317,46 4.38,47 5.271,48 5.504,49 4.445,50 4.439,51 6.349,52 4.386,53 5.233,54 5.467,55 4.417,56 4.344,57 6.455,58 4.302,59 0.14,60 1.145,61 13.017,62 5.346,63 11.905,64 7.044,65 0.598,66 1.77,67 26.231,68 8.877,69 38.466,70 12.021,71 0.595,72 2.097,73 31.387,74 11.003,75 54.569,76 14.684,77 1.037,78 2.227,79 38.99,80 12.605,81 120.109,82 17.169,83 1.107,84 2.207,85 40.42,86 10.99,87 114.841,88 14.934,89 0.833,90 2.287,91 37.677,92 12.764,93 82.724,94 0.818,95 2.357,96 13.696,97 73.703,98 20.019,99 1.225,100 2.253,101 42.727,102 12.703,103 110.6,104 18.261,105 64,106 62,107 0.266,108 0.643,109 0.815,110 0.874,111 0.874,112 0.874,113 3.693,114 0.861,115 -3.75,116 -3.71,117 -3.53,119 39.7,121 1,124 4,125 2,137 6,138 3,139 5,142 1,145 1,146 1,150 2,153 1,162 5,164 2,165 7,167 5,169 7,170 5,173 2,174 5,176 1,178 3,180 3,184 10,186 4,187 4,188 5,190 2,193 3,194 8,195 5}
{0 CHEMBL475251,1 12.335,2 1.071,3 31.121,4 1.811,5 13.294,6 3.881,7 15.065,8 120.223,9 8.255,10 0.486,11 4.181,12 4.287,13 3.819,14 3.59,15 5.41,16 3.639,17 4.696,18 4.852,19 4.212,20 3.93,21 5.928,22 3.987,23 4.871,24 5.003,25 4.354,26 4.072,27 6.256,28 4.124,29 4.965,30 5.15,31 4.237,32 4.11,33 6.19,34 4.106,35 4.971,36 5.17,37 4.157,38 4.096,39 6.144,40 4.074,41 4.931,42 5.145,43 4.061,44 4.021,45 6.123,46 3.982,47 4.857,48 5.115,49 4.009,50 3.875,51 5.993,52 3.849,53 4.682,54 4.9,55 3.99,56 3.738,57 5.985,58 3.776,59 0.241,60 0.916,61 9.999,62 4.578,63 11.947,64 5.41,65 0.752,66 1.357,67 21.622,68 7.518,69 50.92,70 8.972,71 1.2,72 1.653,73 24.404,74 7.729,75 79.055,76 9.366,77 1.098,78 1.661,79 29.552,80 9.584,81 85.717,82 12.264,83 1.125,84 1.673,85 30.993,86 9.389,87 71.271,88 12.534,89 1.08,90 1.631,91 30.075,92 9.243,93 75.683,94 0.918,95 1.487,96 8.513,97 74.725,98 12.79,99 0.995,100 1.342,101 24.284,102 6.132,103 80.035,104 8.003,105 59,106 54,107 0.295,108 0.608,109 0.739,110 0.778,111 0.791,112 0.815,113 3.56,114 0.82,115 -3.27,116 -3.26,117 -3.12,119 38.6,120 2,124 3,128 1,137 4,139 6,140 1,142 3,145 1,150 1,162 1,164 1,165 6,167 6,169 3,170 2,173 4,174 6,176 1,178 4,183 3,184 7,186 3,187 2,188 1,190 2,194 4,195 5.027}
{0 CHEMBL477772,1 12.541,2 1.13,3 22.957,4 1.719,5 11.968,6 3.864,7 14.932,8 122.737,9 8.103,10 0.647,11 4.104,12 4.224,13 3.876,14 3.648,15 5.22,16 3.62,17 4.618,18 4.794,19 4.174,20 4.016,21 5.962,22 3.99,23 4.786,24 4.955,25 4.224,26 4.173,27 5.958,28 4.124,29 4.937,30 5.132,31 4.161,32 4.214,33 6.076,34 4.121,35 5.003,36 5.255,37 4.006,38 4.116,39 6.109,40 4.009,41 4.823,42 5.085,43 3.915,44 3.953,45 5.83,46 3.865,47 4.627,48 4.861,49 3.942,50 3.859,51 5.821,52 3.799,53 4.578,54 4.779,55 3.856,56 3.88,57 5.703,58 3.799,59 0.138,60 0.904,61 12.929,62 4.722,63 20.395,64 5.743,65 0.473,66 1.378,67 22.161,68 7.738,69 72,70 9.924,71 0.338,72 1.611,73 24.428,74 8.777,75 40.919,76 11.033,77 0.405,78 1.764,79 32.164,80 11.123,81 46.141,82 14.3,83 0.678,84 1.676,85 37.021,86 11.492,87 90.976,88 15.73,89 0.506,90 1.46,91 30.445,92 8.58,93 62.666,94 0.541,95 1.281,96 6.991,97 53.727,98 9.878,99 0.292,100 1.246,101 21.137,102 7.269,103 30.346,104 9.7,105 51,106 51,107 0.28,108 0.632,109 0.768,110 0.863,111 0.869,112 0.869,113 3.472,114 0.978,115 -3.85,116 -3.81,117 -3.61,119 38.9,120 2,124 2,137 7,138 2,139 3,140 1,141 1,142 1,145 1,147 1,155 1,156 1,157 1,158 1,162 5,164 3,165 9,166 2,167 4,169 2,170 8,174 9,178 3,180 5,182 2,183 2,184 13,186 1,188 4,190 4,191 2,193 1,194 5,195 5}
{0 CHEMBL491473,1 14.538,2 1.216,3 31.105,4 1.62,5 13.576,6 4.761,7 22.67,8 124.882,9 7.509,10 0.568,11 4.211,12 4.322,13 3.792,14 3.709,15 5.292,16 3.709,17 4.775,18 4.948,19 4.155,20 4.097,21 5.811,22 4.084,23 4.983,24 5.18,25 4.213,26 4.194,27 6.059,28 4.156,29 5.01,30 5.231,31 4.148,32 4.152,33 6.061,34 4.1,35 4.934,36 5.142,37 4.089,38 4.104,39 6.004,40 4.047,41 4.941,42 5.159,43 4.06,44 4.078,45 5.997,46 4.026,47 4.887,48 5.106,49 4.015,50 4.038,51 5.957,52 3.996,53 4.778,54 4.973,55 3.993,56 4.034,57 5.831,58 3.979,59 0.058,60 0.944,61 12.288,62 5.569,63 7.222,64 7.017,65 0.379,66 1.51,67 24.914,68 9.094,69 25.934,70 11.839,71 0.644,72 1.772,73 32.376,74 11.278,75 49.412,76 14.879,77 0.687,78 1.792,79 34.886,80 12.037,81 55.404,82 15.843,83 0.719,84 1.649,85 31.833,86 11.332,87 58.454,88 14.828,89 0.636,90 1.671,91 32.56,92 11.127,93 57.323,94 0.737,95 1.614,96 9.673,97 61.559,98 12.704,99 0.45,100 1.468,101 25.697,102 9.439,103 40.61,104 12.598,105 11,106 52,107 0.26,108 0.591,109 0.781,110 0.84,111 0.855,112 0.855,113 3.532,114 0.913,115 -4.48,116 -4.4,117 -4.15,119 41.7,120 1,121 3,124 1,125 4,137 5,138 2,139 4,141 1,142 1,143 1,147 2,162 4,164 2,165 11,169 4,170 3,173 1,174 8,178 1,180 4,183 3,184 5,190 6,193 3,194 3,195 5}
{0 CHEMBL494089,1 13.487,2 1.035,3 35.761,4 1.633,5 10.226,6 1.839,7 3.383,8 117.484,9 7.337,10 0.441,11 4.177,12 4.306,13 3.724,14 3.613,15 5.301,16 3.615,17 4.724,18 4.917,19 4.099,20 4.009,21 5.793,22 3.997,23 4.962,24 5.18,25 4.127,26 4.137,27 6.028,28 4.082,29 5.008,30 5.256,31 4.141,32 4.13,33 5.989,34 4.073,35 4.865,36 5.063,37 4.153,38 4.107,39 5.923,40 4.086,41 4.962,42 5.152,43 4.205,44 4.179,45 6.093,46 4.151,47 5.06,48 5.28,49 4.191,50 4.198,51 6.178,52 4.144,53 5.003,54 5.247,55 3.964,56 4.127,57 5.95,58 4.031,59 0.189,60 0.894,61 12.784,62 4.687,63 19.748,64 6.664,65 0.323,66 1.386,67 24.179,68 7.835,69 34.585,70 11.55,71 0.662,72 1.584,73 32.423,74 10.069,75 65.938,76 14.886,77 0.765,78 1.589,79 35.185,80 10.417,81 55.895,82 15.813,83 0.445,84 1.531,85 28.462,86 8.521,87 37.944,88 12.822,89 0.584,90 1.685,91 31.229,92 8.874,93 54.292,94 0.88,95 1.752,96 9.718,97 75.414,98 15.157,99 0.601,100 1.588,101 34.2,102 10.099,103 55.822,104 15.703,105 32,106 49,107 0.266,108 0.622,109 0.791,110 0.852,111 0.852,112 0.852,113 3.473,114 0.921,115 -3.08,116 -3.08,117 -2.96,119 36.2,120 3,121 2,122 1,125 4,128 1,136 2,139 1,140 1,141 3,142 1,147 1,153 1,155 1,156 1,157 1,158 2,162 3,164 2,165 3,166 1,167 1,169 5,170 4,173 5,174 3,175 2,176 2,178 2,180 2,183 6,184 4,185 2,186 3,194 8,195 5}
{0 CHEMBL509032,1 26.67,2 1.134,3 58.969,4 1.669,5 16.976,6 5.342,7 28.539,8 170.073,9 7.491,10 0.391,11 4.496,12 4.621,13 4.163,14 4.017,15 5.479,16 3.968,17 5.087,18 5.281,19 4.512,20 4.43,21 6.136,22 4.363,23 5.368,24 5.577,25 4.642,26 4.636,27 6.374,28 4.539,29 5.512,30 5.748,31 4.531,32 4.679,33 6.503,34 4.55,35 5.508,36 5.768,37 4.534,38 4.659,39 6.41,40 4.527,41 5.461,42 5.721,43 4.567,44 4.606,45 6.38,46 4.475,47 5.352,48 5.6,49 4.534,50 4.505,51 6.362,52 4.394,53 5.262,54 5.504,55 4.401,56 4.44,57 6.273,58 4.314,59 0.076,60 1.264,61 20.736,62 7.815,63 18.574,64 10.317,65 0.513,66 2.034,67 39.117,68 12.934,69 65.567,70 17.58,71 0.659,72 2.533,73 58.987,74 17.554,75 70.348,76 23.955,77 0.886,78 2.662,79 63.492,80 20.784,81 112.54,82 28.418,83 0.721,84 2.642,85 62.501,86 20.106,87 86.361,88 29.046,89 0.73,90 2.492,91 65.052,92 18.696,93 85.627,94 0.879,95 2.241,96 16.151,97 93.724,98 23.233,99 0.792,100 2.048,101 52.656,102 15.458,103 87.343,104 22.089,105 55,106 66,107 0.253,108 0.547,109 0.741,110 0.808,111 0.836,112 0.836,113 3.765,114 1.065,115 -4.41,116 -4.34,117 -4.09,119 36.6,120 2,121 2,124 2,125 6,126 2,137 7,139 6,140 1,142 1,145 1,162 4,164 2,165 7,167 3,169 2,170 5,173 1,174 10,176 1,178 5,180 2,183 2,184 8,186 3,187 1,188 1,190 6,193 2,194 10,195 5}
{0 CHEMBL513909,1 24.641,2 1.264,3 53.425,4 1.525,5 14.237,6 3.655,7 13.36,8 148.213,9 6.776,10 0.286,11 4.432,12 4.57,13 3.921,14 3.892,15 5.424,16 3.869,17 5.038,18 5.248,19 4.303,20 4.321,21 5.967,22 4.272,23 5.327,24 5.562,25 4.434,26 4.515,27 6.261,28 4.439,29 5.431,30 5.678,31 4.445,32 4.554,33 6.405,34 4.474,35 5.442,36 5.683,37 4.457,38 4.572,39 6.485,40 4.487,41 5.406,42 5.644,43 4.35,44 4.546,45 6.381,46 4.44,47 5.411,48 5.686,49 4.183,50 4.452,51 6.3,52 4.321,53 5.263,54 5.539,55 4.107,56 4.326,57 6.139,58 4.205,59 0.032,60 1.179,61 18.11,62 6.578,63 11.145,64 9.87,65 0.476,66 1.902,67 35.32,68 11.066,69 36.537,70 17.074,71 0.556,72 2.349,73 47.751,74 14.58,75 54.5,76 22.827,77 0.654,78 2.456,79 53.861,80 15.746,81 79.905,82 24.541,83 1.011,84 2.478,85 54.847,86 15.761,87 111.883,88 24.678,89 0.642,90 2.419,91 52.039,92 15.848,93 80.741,94 0.768,95 2.258,96 14.967,97 86.391,98 24.141,99 0.738,100 1.93,101 46.069,102 13.81,103 76.125,104 21.436,105 41,106 60,107 0.235,108 0.541,109 0.765,110 0.845,111 0.845,112 0.845,113 3.668,114 0.983,115 -4.05,116 -4,117 -3.79,119 36.4,120 1,121 7,124 3,125 2,126 3,137 3,138 1,139 3,140 1,142 1,145 1,150 2,162 7,164 3,165 7,167 3,169 4,170 6,173 4,174 9,176 1,178 4,180 1,183 1,184 11,186 2,188 2,190 4,193 5,194 11,195 5}
{0 CHEMBL521851,1 16.735,2 1.232,3 33.878,4 1.78,5 12.029,6 2.892,7 8.361,8 136.875,9 8.286,10 0.5,11 4.265,12 4.373,13 4.076,14 3.821,15 5.256,16 3.78,17 4.867,18 5.038,19 4.41,20 4.247,21 6.005,22 4.193,23 5.085,24 5.279,25 4.431,26 4.39,27 6.061,28 4.298,29 5.148,30 5.363,31 4.399,32 4.418,33 6.122,34 4.302,35 5.146,36 5.383,37 4.367,38 4.396,39 6.121,40 4.26,41 4.99,42 5.187,43 4.34,44 4.365,45 5.882,46 4.246,47 4.978,48 5.161,49 4.376,50 4.342,51 5.958,52 4.235,53 5.064,54 5.284,55 4.373,56 4.333,57 5.977,58 4.213,59 0.138,60 1.053,61 14.833,62 6.041,63 15.843,64 7.068,65 0.636,66 1.735,67 30.612,68 10.283,69 59.844,70 12.197,71 0.71,72 2.06,73 43.941,74 13.352,75 54.192,76 16.27,77 0.565,78 2.113,79 43.593,80 15.122,81 65.169,82 19.016,83 0.887,84 2.089,85 50.078,86 15.742,87 77.777,88 19.215,89 0.447,90 1.937,91 41.98,92 13.99,93 27.589,94 0.442,95 1.876,96 12.865,97 37.968,98 15.547,99 0.531,100 1.975,101 41.626,102 13.47,103 38.358,104 17.095,105 11,106 59,107 0.282,108 0.603,109 0.751,110 0.82,111 0.82,112 0.82,113 3.589,114 1.076,115 -2.75,116 -2.76,117 -2.68,119 37.1,124 1,125 9,137 4,138 2,140 1,141 1,142 1,144 1,147 3,160 1,162 4,164 5,165 4,169 2,170 5,173 2,174 11,178 2,180 2,183 1,184 7,188 1,190 1,193 6,194 4,195 5}
{0 CHEMBL522892,1 11.245,2 1.048,3 19.966,4 1.644,5 11.483,6 1.782,7 3.174,8 110.583,9 7.85,10 0.485,11 4.047,12 4.179,13 3.661,14 3.564,15 5.18,16 3.569,17 4.589,18 4.768,19 4.07,20 3.99,21 5.696,22 3.982,23 4.85,24 5.047,25 4.167,26 4.158,27 5.955,28 4.124,29 4.961,30 5.19,31 4.158,32 4.149,33 6.204,34 4.082,35 4.929,36 5.188,37 3.955,38 4.015,39 6.03,40 3.953,41 4.683,42 4.915,43 3.899,44 3.876,45 5.946,46 3.823,47 4.553,48 4.765,49 3.733,50 3.765,51 5.709,52 3.722,53 4.466,54 4.715,55 3.529,56 3.669,57 5.461,58 3.571,59 0.083,60 0.886,61 9.549,62 4.013,63 10.718,64 5.212,65 0.281,66 1.433,67 18.687,68 6.802,69 20.524,70 9.196,71 0.356,72 1.774,73 25.624,74 9.239,75 34.54,76 12.309,77 0.681,78 1.867,79 31.032,80 11.103,81 85.154,82 15.394,83 0.638,84 1.665,85 33.013,86 9.809,87 82.244,88 13.475,89 0.542,90 1.369,91 23.953,92 7.844,93 79.087,94 0.377,95 1.246,96 6.256,97 44.302,98 8.334,99 0.342,100 1.077,101 19.425,102 6.969,103 30.263,104 9.759,105 17,106 49,107 0.274,108 0.65,109 0.766,110 0.845,111 0.851,112 0.851,113 3.409,114 0.868,115 -3.23,116 -3.22,117 -3.09,119 42,124 1,125 4,133 1,134 1,137 6,138 1,139 3,141 1,147 1,150 1,153 1,155 1,156 1,157 1,162 3,165 5,167 2,169 7,170 5,172 2,173 1,174 2,178 3,180 2,183 2,184 4,185 2,186 4,187 3,188 4,189 2,190 4,191 2,194 3,195 5}
{0 CHEMBL525191,1 10.631,2 0.9,3 21.549,4 1.571,5 9.36,6 2.407,7 5.796,8 95.753,9 7.777,10 0.607,11 3.887,12 3.997,13 3.491,14 3.444,15 5.086,16 3.433,17 4.376,18 4.534,19 3.818,20 3.851,21 5.433,22 3.817,23 4.601,24 4.805,25 3.851,26 3.954,27 5.622,28 3.889,29 4.61,30 4.801,31 3.855,32 3.935,33 5.719,34 3.874,35 4.636,36 4.853,37 3.777,38 3.9,39 5.678,40 3.828,41 4.539,42 4.74,43 3.71,44 3.879,45 5.524,46 3.791,47 4.612,48 4.842,49 3.659,50 3.849,51 5.599,52 3.744,53 4.589,54 4.841,55 3.498,56 3.676,57 5.628,58 3.571,59 0.128,60 0.648,61 8.273,62 3.802,63 17.434,64 4.705,65 0.141,66 1.043,67 14.684,68 6.079,69 19.042,70 7.92,71 0.259,72 1.235,73 20.378,74 7.795,75 29.015,76 10.613,77 0.239,78 1.236,79 20.176,80 7.747,81 35.055,82 10.37,83 0.304,84 1.234,85 22.102,86 7.93,87 38.06,88 10.684,89 0.178,90 1.135,91 18.979,92 7.899,93 23.238,94 0.158,95 1.179,96 8.453,97 27.666,98 11.768,99 0.338,100 1.09,101 22.914,102 7.773,103 45.313,104 10.679,105 10,106 39,107 0.271,108 0.641,109 0.81,110 0.864,111 0.872,112 0.872,113 3.268,114 0.882,115 -3.29,116 -3.28,117 -3.14,119 44.2,121 2,125 2,137 5,138 5,140 2,141 1,146 1,149 1,158 1,160 1,162 11,165 7,170 14,174 9,176 1,178 2,180 12,184 8,186 1,188 3,190 9,193 1,194 6,195 5}
{0 CHEMBL535,1 15.545,2 1.256,3 28.873,4 1.584,5 11.655,6 2.998,7 8.987,8 113.678,9 7.117,10 0.355,11 4.101,12 4.238,13 3.612,14 3.603,15 5.199,16 3.578,17 4.649,18 4.852,19 3.983,20 3.985,21 5.735,22 3.943,23 4.864,24 5.08,25 4.051,26 4.122,27 5.954,28 4.066,29 4.978,30 5.196,31 4.03,32 4.168,33 6.076,34 4.077,35 5.06,36 5.324,37 3.954,38 4.095,39 6.164,40 3.994,41 4.949,42 5.221,43 3.905,44 4.029,45 6.047,46 3.935,47 4.824,48 5.053,49 3.867,50 3.978,51 5.943,52 3.895,53 4.825,54 5.057,55 3.837,56 3.927,57 6.073,58 3.851,59 0.042,60 0.89,61 12.112,62 4.992,63 8.39,64 6.881,65 0.257,66 1.392,67 22.895,68 8.086,69 28.708,70 11.698,71 0.357,72 1.638,73 29.378,74 9.964,75 45.373,76 13.974,77 0.334,78 1.713,79 32.841,80 11.644,81 54.094,82 16.456,83 0.714,84 1.689,85 38.27,86 11.448,87 97.478,88 16.832,89 0.566,90 1.535,91 34.091,92 10.532,93 95.888,94 0.404,95 1.417,96 9.612,97 60.464,98 13.7,99 0.648,100 1.43,101 29.772,102 9.203,103 101.382,104 12.854,105 59,106 44,107 0.262,108 0.599,109 0.765,110 0.838,111 0.838,112 0.838,113 3.408,114 0.956,115 -3.6,116 -3.57,117 -3.41,119 39.3,120 4,125 4,132 1,133 1,137 3,138 3,139 2,147 2,150 2,162 6,165 4,167 2,169 8,170 7,174 3,176 1,178 6,180 8,184 4,186 1,187 1,188 3,190 8,193 1,194 4,195 5}
{0 CHEMBL553,1 11.875,2 1.021,3 26.398,4 1.568,5 11.345,6 4.31,7 18.575,8 110.749,9 7.567,10 0.548,11 4.05,12 4.152,13 3.627,14 3.526,15 5.216,16 3.534,17 4.559,18 4.716,19 3.895,20 3.835,21 5.642,22 3.833,23 4.683,24 4.845,25 3.989,26 3.966,27 5.793,28 3.938,29 4.733,30 4.933,31 3.953,32 3.987,33 5.768,34 3.933,35 4.809,36 5.016,37 3.978,38 3.993,39 5.841,40 3.949,41 4.756,42 4.929,43 4.008,44 4.017,45 5.839,46 3.974,47 4.81,48 5.008,49 3.969,50 4.04,51 5.839,52 3.981,53 4.868,54 5.089,55 3.861,56 3.961,57 5.891,58 3.89,59 0.054,60 0.714,61 10.332,62 4.677,63 11.647,64 5.733,65 0.454,66 1.069,67 20.708,68 7.197,69 33.876,70 8.665,71 0.65,72 1.236,73 23.177,74 8.149,75 39.845,76 10.493,77 0.305,78 1.325,79 24.251,80 9.042,81 32.353,82 12.318,83 0.58,84 1.335,85 27.897,86 9.386,87 47.402,88 12.503,89 0.618,90 1.309,91 25.009,92 9.121,93 42.197,94 0.375,95 1.41,96 9.44,97 37.479,98 12.731,99 0.676,100 1.381,101 30.36,102 9.574,103 54.708,104 12.892,105 31,106 40,107 0.261,108 0.608,109 0.734,110 0.816,111 0.822,112 0.828,113 3.408,114 0.881,115 -4.13,116 -4.08,117 -3.86,119 42.3,124 2,125 4,135 1,136 1,137 6,138 2,139 3,141 1,142 1,143 1,162 7,164 1,165 5,167 1,169 3,170 8,173 3,174 5,178 3,180 6,183 1,184 4,186 1,188 3,190 4,193 2,194 4,195 5}
{0 CHEMBL554,1 14.715,2 1.192,3 34.463,4 1.816,5 17.4,6 6.255,7 39.126,8 152.448,9 8.805,10 0.636,11 4.306,12 4.395,13 4.109,14 3.908,15 5.446,16 3.881,17 4.829,18 4.958,19 4.397,20 4.268,21 6.123,22 4.239,23 5.076,24 5.243,25 4.42,26 4.346,27 6.269,28 4.299,29 5.076,30 5.278,31 4.34,32 4.305,33 6.187,34 4.234,35 5.025,36 5.23,37 4.277,38 4.306,39 6.114,40 4.221,41 4.952,42 5.129,43 4.381,44 4.311,45 6.078,46 4.24,47 4.986,48 5.172,49 4.433,50 4.32,51 6.18,52 4.243,53 4.938,54 5.12,55 4.341,56 4.213,57 6.171,58 4.146,59 0.16,60 1.011,61 12.31,62 6.42,63 21.401,64 6.763,65 0.486,66 1.617,67 26.002,68 10.989,69 63.858,70 11.764,71 0.911,72 1.929,73 36.244,74 13.271,75 105.739,76 14.463,77 0.861,78 1.894,79 37.427,80 13.509,81 86.989,82 16.077,83 0.9,84 1.805,85 40.185,86 13.57,87 93.378,88 16.058,89 0.663,90 1.655,91 29.907,92 12.198,93 64.253,94 0.713,95 1.742,96 12.827,97 64.704,98 15.491,99 0.726,100 1.618,101 35.717,102 12.338,103 78.312,104 14.109,105 31,106 62,107 0.283,108 0.622,109 0.804,110 0.906,111 0.906,112 0.906,113 3.717,114 1.011,115 -5.1,116 -5,117 -4.68,119 43.9,124 1,125 4,137 12,138 3,139 4,141 1,142 1,143 1,147 2,162 10,164 2,165 8,167 1,169 3,170 11,174 10,176 1,178 3,180 9,184 8,186 3,188 4,190 8,194 3,195 5}
{0 CHEMBL558752,1 10.334,2 1.084,3 20.869,4 1.859,5 15.514,6 6.607,7 43.648,8 120.68,9 9.782,10 0.659,11 4.14,12 4.241,13 3.906,14 3.631,15 5.441,16 3.695,17 4.683,18 4.815,19 4.421,20 3.997,21 6.599,22 4.072,23 4.805,24 4.965,25 4.34,26 4.068,27 6.253,28 4.114,29 4.895,30 5.085,31 4.275,32 4.037,33 6.334,34 4.074,35 4.791,36 4.996,37 4.103,38 4.001,39 6.06,40 3.997,41 4.741,42 4.935,43 4.143,44 4.003,45 6.101,46 3.988,47 4.747,48 4.941,49 4.074,50 3.937,51 6.053,52 3.946,53 4.679,54 4.874,55 4.136,56 3.832,57 6.21,58 3.859,59 0.433,60 1.298,61 4.994,62 4.463,63 58,64 3.926,65 1.625,66 2.602,67 13.283,68 7.528,69 256.909,70 6.634,71 1.126,72 2.085,73 15.851,74 8.278,75 96.766,76 8.136,77 1.547,78 2.154,79 21.864,80 9.137,81 163.102,82 8.751,83 1.325,84 1.796,85 22.163,86 9.058,87 161.056,88 9.772,89 1.088,90 1.738,91 18.796,92 8.595,93 93.831,94 1.274,95 1.818,96 9.059,97 151.43,98 9.427,99 1.392,100 1.646,101 18.967,102 7.413,103 127.495,104 8.361,105 54,106 62,107 0.303,108 0.633,109 0.765,110 0.865,111 0.865,112 0.865,113 3.642,114 0.779,115 -4.97,116 -4.87,117 -4.57,119 45.3,124 1,130 2,137 9,138 1,139 3,140 1,141 3,146 1,147 1,153 1,154 1,162 5,164 1,165 8,167 3,169 2,170 6,173 1,174 5,176 1,178 3,180 3,183 2,184 5,188 3,190 4,193 2,194 5,195 5}
{0 CHEMBL572878,1 13.463,2 1.064,3 36.591,4 1.625,5 12.697,6 4.445,7 19.761,8 134.268,9 7.617,10 0.459,11 4.223,12 4.36,13 3.852,14 3.746,15 5.264,16 3.713,17 4.754,18 4.955,19 4.209,20 4.106,21 5.761,22 4.045,23 4.954,24 5.18,25 4.195,26 4.222,27 5.917,28 4.121,29 5.007,30 5.26,31 4.138,32 4.196,33 5.957,34 4.072,35 4.907,36 5.156,37 4.169,38 4.155,39 5.872,40 4.06,41 4.828,42 5.024,43 4.211,44 4.193,45 5.828,46 4.088,47 4.877,48 5.098,49 4.185,50 4.188,51 5.82,52 4.069,53 4.879,54 5.109,55 4.1,56 4.188,57 5.766,58 4.061,59 0.058,60 1.019,61 13.326,62 5.246,63 8.981,64 7.112,65 0.337,66 1.582,67 26.662,68 8.349,69 28.572,70 11.98,71 0.383,72 1.783,73 34.938,74 10.824,75 36.022,76 14.782,77 0.476,78 1.767,79 39.027,80 11.848,81 54.352,82 16.633,83 0.399,84 1.668,85 35.152,86 10.423,87 44.42,88 14.572,89 0.305,90 1.694,91 33.497,92 10.442,93 33.706,94 0.467,95 1.725,96 10.82,97 34.713,98 14.386,99 0.214,100 1.664,101 32.442,102 11.143,103 27.062,104 15.27,105 10,106 52,107 0.261,108 0.597,109 0.766,110 0.828,111 0.828,112 0.828,113 3.532,114 0.976,115 -5.31,116 -5.2,117 -4.86,119 37.7,120 1,121 2,122 1,124 1,125 4,137 6,139 2,142 3,145 1,147 1,150 1,160 1,162 5,164 2,165 7,167 3,169 7,170 5,173 1,174 3,177 1,178 4,180 4,183 2,184 9,186 2,188 2,190 4,193 1,194 7,195 5.377}
{0 CHEMBL572881,1 11.076,2 0.969,3 19.533,4 1.481,5 11.607,6 2.721,7 7.405,8 112.492,9 7.324,10 0.581,11 4.026,12 4.158,13 3.583,14 3.584,15 5.127,16 3.56,17 4.543,18 4.722,19 3.947,20 3.989,21 5.597,22 3.943,23 4.804,24 5.002,25 3.986,26 4.133,27 5.824,28 4.048,29 4.944,30 5.207,31 3.872,32 4.072,33 5.953,34 3.953,35 4.791,36 5.051,37 3.727,38 3.926,39 5.79,40 3.819,41 4.617,42 4.86,43 3.735,44 3.836,45 5.672,46 3.762,47 4.517,48 4.719,49 3.767,50 3.836,51 5.639,52 3.782,53 4.591,54 4.81,55 3.688,56 3.821,57 5.705,58 3.736,59 0.04,60 0.782,61 10.48,62 4.319,63 8.837,64 5.92,65 0.184,66 1.248,67 19.045,68 7.308,69 22.805,70 10.274,71 0.136,72 1.538,73 25.469,74 9.702,75 26.884,76 13.703,77 0.465,78 1.622,79 32.551,80 10.79,81 57.557,82 15.809,83 0.314,84 1.36,85 28.07,86 9.36,87 48.465,88 13.434,89 0.287,90 1.179,91 23.119,92 7.743,93 40.926,94 0.197,95 1.146,96 6.735,97 31.198,98 9.43,99 0.234,100 1.158,101 21.817,102 7.857,103 41.779,104 10.85,105 10,106 44,107 0.247,108 0.6,109 0.767,110 0.84,111 0.849,112 0.849,113 3.374,114 0.9,115 -4.02,116 -3.97,117 -3.76,119 43.1,120 2,123 1,125 2,137 7,138 3,139 2,140 3,142 1,150 1,162 9,165 5,167 2,169 8,170 9,174 3,178 8,180 5,183 1,184 4,186 2,187 2,188 4,190 7,194 3,195 5}
{0 CHEMBL573339,1 7.574,2 0.906,3 17.722,4 1.643,5 8.038,6 2.634,7 6.936,8 93.122,9 8.295,10 0.7,11 3.901,12 3.993,13 3.57,14 3.427,15 5.053,16 3.451,17 4.429,18 4.567,19 3.953,20 3.814,21 5.57,22 3.831,23 4.632,24 4.81,25 4.004,26 3.906,27 5.74,28 3.897,29 4.601,30 4.8,31 3.93,32 3.856,33 5.661,34 3.843,35 4.552,36 4.727,37 3.948,38 3.85,39 5.691,40 3.845,41 4.563,42 4.716,43 3.948,44 3.915,45 5.647,46 3.901,47 4.608,48 4.774,49 3.86,50 3.933,51 5.677,52 3.88,53 4.659,54 4.872,55 3.658,56 3.843,57 5.7,58 3.738,59 0.093,60 0.64,61 7.051,62 3.599,63 8.919,64 4.003,65 0.347,66 1.055,67 14.419,68 5.833,69 21.708,70 6.641,71 0.537,72 1.241,73 20.054,74 7.233,75 35.14,76 8.985,77 0.401,78 1.234,79 19.844,80 6.951,81 33.285,82 8.821,83 0.525,84 1.162,85 18.373,86 6.593,87 41.881,88 7.998,89 0.434,90 1.193,91 16.823,92 6.549,93 25.389,94 0.383,95 1.212,96 7.482,97 25.34,98 8.996,99 0.443,100 1.167,101 21.923,102 8.885,103 39.839,104 11.593,105 2,106 43,107 0.282,108 0.649,109 0.781,110 0.845,111 0.845,112 0.845,113 3.306,114 0.847,115 -3.61,116 -3.59,117 -3.42,119 45.2,125 4,137 6,138 2,139 1,140 1,141 1,142 1,144 1,147 1,153 1,162 6,164 3,165 6,169 2,170 5,173 4,174 7,178 2,180 2,183 2,184 7,188 1,190 1,193 3,194 7,195 5}
{0 CHEMBL574738,1 15.218,2 1.144,3 38.593,4 1.737,5 17.421,6 4.513,7 20.37,8 141.564,9 7.789,10 0.439,11 4.326,12 4.457,13 3.911,14 3.768,15 5.463,16 3.782,17 4.887,18 5.079,19 4.318,20 4.137,21 6.358,22 4.135,23 5.094,24 5.307,25 4.297,26 4.305,27 6.174,28 4.264,29 5.208,30 5.442,31 4.301,32 4.321,33 6.33,34 4.256,35 5.246,36 5.511,37 4.289,38 4.258,39 6.458,40 4.203,41 5.069,42 5.294,43 4.205,44 4.184,45 6.242,46 4.15,47 5.071,48 5.299,49 4.255,50 4.121,51 6.562,52 4.093,53 4.978,54 5.224,55 4.019,56 4.011,57 6.218,58 3.971,59 0.176,60 1.234,61 13.199,62 5.62,63 23.129,64 7.372,65 1.167,66 2.182,67 28.269,68 9.026,69 151.997,70 12.315,71 0.725,72 2.117,73 35.087,74 11.784,75 62.487,76 16.266,77 0.866,78 2.327,79 41.627,80 14.262,81 92.131,82 19.458,83 1.48,84 2.318,85 47.733,86 13.322,87 145.555,88 18.829,89 0.918,90 2.16,91 36.82,92 11.876,93 115.325,94 1.561,95 2.233,96 11.753,97 231.729,98 14.917,99 1.258,100 1.928,101 36.067,102 10.065,103 132.792,104 12.838,105 46,106 57,107 0.274,108 0.592,109 0.742,110 0.819,111 0.848,112 0.853,113 3.667,114 0.895,115 -4.94,116 -4.85,117 -4.54,119 38.2,120 1,124 1,125 6,130 1,137 8,138 2,139 3,142 2,143 1,151 1,162 6,164 2,165 7,167 3,168 1,169 5,170 6,173 1,174 4,178 4,180 4,183 1,184 8,186 2,188 5,190 2,194 8,195 5}
{0 CHEMBL576982,1 13.458,2 1.309,3 29.949,4 1.664,5 19.05,6 5.719,7 32.712,8 154.689,9 7.788,10 0.556,11 4.397,12 4.508,13 4.039,14 3.919,15 5.471,16 3.899,17 4.952,18 5.118,19 4.449,20 4.327,21 5.997,22 4.293,23 5.17,24 5.359,25 4.416,26 4.461,27 6.168,28 4.373,29 5.269,30 5.512,31 4.326,32 4.417,33 6.213,34 4.304,35 5.153,36 5.405,37 4.221,38 4.254,39 6.148,40 4.156,41 4.877,42 5.083,43 4.138,44 4.153,45 5.874,46 4.067,47 4.826,48 5.007,49 4.166,50 4.191,51 5.877,52 4.113,53 4.957,54 5.158,55 4.128,56 4.199,57 6.038,58 4.11,59 0.11,60 1.104,61 14.964,62 6.645,63 11.579,64 8.276,65 0.499,66 1.806,67 31.117,68 11.057,69 39.025,70 14.213,71 0.656,72 2.107,73 40.132,74 14.426,75 49.537,76 18.301,77 0.67,78 2.156,79 49.446,80 16.656,81 67.629,82 22.163,83 0.825,84 1.921,85 44.02,86 13.339,87 75.5,88 18.092,89 0.662,90 1.571,91 34.515,92 10.925,93 47.153,94 0.249,95 1.576,96 10.999,97 27.839,98 13.99,99 0.594,100 1.672,101 32.686,102 11.102,103 71.058,104 14.352,105 18,106 65,107 0.256,108 0.601,109 0.733,110 0.798,111 0.81,112 0.81,113 3.717,114 0.942,115 -4.43,116 -4.36,117 -4.11,119 40.3,120 3,123 1,125 6,137 8,138 1,139 2,141 1,142 1,146 1,147 3,151 1,154 1,158 1,162 8,164 1,165 9,167 3,168 1,169 3,170 10,173 2,174 10,176 1,178 2,180 7,183 1,184 13,186 1,188 5,190 2,193 2,194 7,195 5}
{0 CHEMBL601719,1 11.785,2 1.064,3 27.552,4 1.778,5 11.767,6 3.694,7 13.646,8 118.112,9 8.661,10 0.515,11 4.068,12 4.188,13 3.755,14 3.612,15 5.194,16 3.597,17 4.613,18 4.779,19 4.164,20 4.02,21 5.709,22 3.988,23 4.9,24 5.103,25 4.332,26 4.171,27 6.028,28 4.108,29 4.921,30 5.125,31 4.366,32 4.168,33 6.033,34 4.081,35 4.893,36 5.122,37 4.105,38 4.074,39 6.038,40 3.981,41 4.725,42 4.942,43 4.013,44 3.993,45 5.803,46 3.908,47 4.692,48 4.901,49 4.129,50 3.992,51 5.855,52 3.904,53 4.731,54 4.963,55 3.976,56 3.926,57 5.886,58 3.828,59 0.124,60 0.843,61 8.72,62 4.5,63 12.631,64 5.562,65 0.295,66 1.327,67 18.794,68 7.839,69 27.206,70 9.848,71 0.724,72 1.546,73 32.857,74 10.809,75 68.014,76 13.474,77 0.761,78 1.529,79 41.123,80 11.496,81 68.091,82 14.309,83 0.89,84 1.468,85 39.648,86 11.066,87 85.139,88 14.164,89 0.537,90 1.357,91 25.281,92 9.144,93 52.019,94 0.463,95 1.286,96 9.058,97 51.292,98 12.149,99 0.596,100 1.34,101 30.777,102 9.101,103 68.553,104 11.935,105 26,106 47,107 0.297,108 0.679,109 0.838,110 0.866,111 0.866,112 0.866,113 3.44,114 0.955,115 -4.9,116 -4.8,117 -4.51,119 40.4,120 1,121 2,125 2,126 2,137 3,138 3,139 4,140 2,142 1,146 1,155 1,156 1,157 1,158 1,162 3,165 8,166 1,167 1,169 2,170 7,173 1,174 7,175 1,176 1,178 1,180 3,182 1,184 6,186 1,188 1,190 9,191 1,193 2,194 3,195 5}
{0 CHEMBL608154,1 8.973,2 1.011,3 18.891,4 1.716,5 8.731,6 2.737,7 7.493,8 98.273,9 8.947,10 0.724,11 3.849,12 3.95,13 3.571,14 3.435,15 5.058,16 3.438,17 4.334,18 4.472,19 3.963,20 3.819,21 5.516,22 3.813,23 4.508,24 4.644,25 4.123,26 3.947,27 5.74,28 3.933,29 4.608,30 4.76,31 4.124,32 3.954,33 5.859,34 3.923,35 4.66,36 4.842,37 4.045,38 3.912,39 5.908,40 3.857,41 4.542,42 4.731,43 4.015,44 3.825,45 5.792,46 3.79,47 4.455,48 4.606,49 3.916,50 3.776,51 5.711,52 3.739,53 4.424,54 4.589,55 3.766,56 3.745,57 5.642,58 3.67,59 0.082,60 0.605,61 5.726,62 3.248,63 6.403,64 3.636,65 0.262,66 0.945,67 12.328,68 5.532,69 21.856,70 6.314,71 0.387,72 1.117,73 16.022,74 6.569,75 29.763,76 7.388,77 0.43,78 1.191,79 17.437,80 7.243,81 35.698,82 8.18,83 0.648,84 1.141,85 26.997,86 8.34,87 64.551,88 9.432,89 0.457,90 1.034,91 23.227,92 7.658,93 51.68,94 0.497,95 0.939,96 6.735,97 47.237,98 7.318,99 0.411,100 0.94,101 16.736,102 6.487,103 39.202,104 7.245,105 18,106 42,107 0.296,108 0.689,109 0.814,110 0.876,111 0.885,112 0.885,113 3.306,114 0.861,115 -2.77,116 -2.78,117 -2.7,119 46.3,120 1,124 1,137 4,138 3,139 3,140 3,141 1,147 2,150 1,162 5,165 5,167 1,169 3,170 5,174 5,176 2,177 1,178 4,180 3,183 1,184 4,186 2,188 5,190 2,193 1,194 4,195 5}
{0 CHEMBL91829,1 25.88,2 1.262,3 56.723,4 1.502,5 9.743,6 3.479,7 12.106,8 135.851,9 7.438,10 0.5,11 4.257,12 4.372,13 3.84,14 3.811,15 5.311,16 3.796,17 4.831,18 5.002,19 4.238,20 4.25,21 5.851,22 4.221,23 5.087,24 5.269,25 4.344,26 4.446,27 6.081,28 4.384,29 5.26,30 5.47,31 4.46,32 4.561,33 6.273,34 4.488,35 5.371,36 5.576,37 4.55,38 4.626,39 6.383,40 4.562,41 5.455,42 5.667,43 4.625,44 4.699,45 6.486,46 4.634,47 5.519,48 5.746,49 4.566,50 4.705,51 6.531,52 4.625,53 5.405,54 5.634,55 4.318,56 4.565,57 6.422,58 4.453,59 0.01,60 0.931,61 12.794,62 5.704,63 8.109,64 7.426,65 0.33,66 1.576,67 25.693,68 9.495,69 27.812,70 12.684,71 0.384,72 1.917,73 34.175,74 13.551,75 35.095,76 17.839,77 0.389,78 2.258,79 41.743,80 16.368,81 66.1,82 22.422,83 0.571,84 2.511,85 47.271,86 17.453,87 57.707,88 23.328,89 0.503,90 2.715,91 51.617,92 19.102,93 69.583,94 0.628,95 2.852,96 19.81,97 93.764,98 26.839,99 0.758,100 2.485,101 51.171,102 18.086,103 105.793,104 24.444,105 19,106 59,107 0.237,108 0.569,109 0.715,110 0.784,111 0.804,112 0.824,113 3.59,114 0.903,115 -3.48,116 -3.46,117 -3.31,119 44.4,121 1,124 2,125 4,126 1,133 2,137 8,138 4,146 2,147 2,150 2,162 13,165 10,167 2,169 2,170 14,173 2,174 11,178 2,180 13,183 2,184 8,188 2,190 13,193 3,194 10,195 5}
{0 CHEMBL939,1 13.425,2 1.047,3 29.541,4 1.765,5 12.935,6 4.203,7 17.668,8 117.539,9 8.126,10 0.5,11 4.125,12 4.233,13 3.763,14 3.608,15 5.232,16 3.614,17 4.683,18 4.851,19 4.108,20 3.975,21 5.763,22 3.967,23 4.893,24 5.085,25 4.228,26 4.114,27 6.01,28 4.075,29 4.91,30 5.131,31 4.063,32 4.094,33 5.891,34 4.01,35 4.924,36 5.162,37 3.998,38 4.066,39 5.867,40 3.975,41 4.855,42 5.07,43 4.024,44 4.022,45 5.847,46 3.955,47 4.822,48 5.037,49 4.035,50 4,51 5.867,52 3.93,53 4.743,54 4.957,55 4.007,56 3.938,57 5.802,58 3.875,59 0.111,60 0.856,61 10.201,62 4.964,63 8.62,64 6.061,65 0.52,66 1.327,67 22.65,68 8.032,69 32.965,70 9.846,71 0.832,72 1.556,73 32.057,74 10.206,75 61.553,76 12.9,77 0.668,78 1.527,79 32.189,80 10.914,81 50.112,82 14.647,83 0.769,84 1.436,85 34.793,86 11.224,87 55.907,88 15.459,89 0.703,90 1.383,91 30.31,92 10.185,93 51.652,94 0.773,95 1.377,96 9.526,97 53.011,98 12.641,99 0.507,100 1.332,101 28.621,102 8.847,103 41.222,104 11.646,105 11,106 46,107 0.291,108 0.618,109 0.788,110 0.862,111 0.862,112 0.862,113 3.472,114 0.926,115 -4.14,116 -4.08,117 -3.86,119 40,121 1,124 1,125 6,137 5,138 1,139 5,141 1,142 1,143 1,162 2,164 1,165 7,167 1,169 3,170 3,173 2,174 5,178 2,180 3,183 2,184 4,186 1,188 2,190 4,193 2,194 3,195 5}
{0 CHEMBL941,1 15.945,2 1.136,3 34.142,4 1.468,5 16.73,6 4.221,7 17.813,8 146.651,9 7.26,10 0.585,11 4.309,12 4.443,13 3.863,14 3.85,15 5.388,16 3.826,17 4.838,18 5.033,19 4.197,20 4.233,21 5.866,22 4.187,23 5.077,24 5.286,25 4.239,26 4.395,27 6.061,28 4.31,29 5.205,30 5.466,31 4.145,32 4.367,33 6.139,34 4.247,35 5.13,36 5.402,37 4.135,38 4.291,39 6.073,40 4.196,41 4.967,42 5.186,43 4.111,44 4.268,45 6.004,46 4.179,47 5.016,48 5.264,49 4.026,50 4.248,51 5.971,52 4.136,53 4.9,54 5.125,55 3.986,56 4.166,57 5.937,58 4.067,59 0.042,60 1.057,61 14.153,62 5.707,63 10.591,64 7.967,65 0.335,66 1.689,67 26.501,68 9.172,69 28.678,70 13.227,71 0.267,72 2.03,73 34.233,74 12.408,75 36.8,76 17.809,77 0.379,78 2.115,79 41.833,80 14.546,81 57.714,82 21.321,83 0.4,84 1.949,85 39.659,86 12.896,87 56.06,88 19.119,89 0.404,90 1.798,91 31.238,92 11.142,93 47.554,94 0.357,95 1.761,96 12.405,97 47.321,98 17.862,99 0.328,100 1.59,101 29.721,102 10.944,103 50.027,104 15.574,105 10,106 56,107 0.229,108 0.549,109 0.732,110 0.824,111 0.859,112 0.859,113 3.642,114 0.911,115 -4.14,116 -4.08,117 -3.86,119 42.6,120 1,124 1,125 5,137 10,138 4,139 2,140 3,141 1,145 1,150 1,162 11,164 1,165 7,167 3,169 5,170 12,173 1,174 6,178 5,180 7,183 1,184 13,187 1,188 6,190 3,194 9,195 5}
