{
  "data_features": {
    "feature": [
      {
        "data_type": "nominal",
        "index": "0",
        "is_ignore": "false",
        "is_row_identifier": "true",
        "is_target": "false",
        "name": "molecule_id",
        "nominal_value": [
          "CHEMBL1382213",
          "CHEMBL2171451",
          "CHEMBL2171452",
          "CHEMBL2171453",
          "CHEMBL2171454",
          "CHEMBL2171455",
          "CHEMBL2171456",
          "CHEMBL2171457",
          "CHEMBL2171458",
          "CHEMBL2171459",
          "CHEMBL2171460",
          "CHEMBL2171461",
          "CHEMBL2171462",
          "CHEMBL2171463",
          "CHEMBL2171464",
          "CHEMBL2171465",
          "CHEMBL2171650",
          "CHEMBL2171651",
          "CHEMBL2171652",
          "CHEMBL2171653",
          "CHEMBL2171654",
          "CHEMBL2171655",
          "CHEMBL2171656",
          "CHEMBL2171657",
          "CHEMBL2171658",
          "CHEMBL2171659",
          "CHEMBL2171660",
          "CHEMBL2171661",
          "CHEMBL2171662",
          "CHEMBL2171663",
          "CHEMBL2171664",
          "CHEMBL2326941",
          "CHEMBL2326942",
          "CHEMBL2326943",
          "CHEMBL2326944",
          "CHEMBL2326945",
          "CHEMBL2326946",
          "CHEMBL63",
          "CHEMBL85005"
        ],
        "number_of_missing_values": "0"
      },
      {
        "data_type": "numeric",
        "index": "1",
        "is_ignore": "false",
        "is_row_identifier": "false",
        "is_target": "false",
        "name": "nAT",
        "number_of_missing_values": "0"
      },
      {
        "data_type": "numeric",
        "index": "2",
        "is_ignore": "false",
        "is_row_identifier": "false",
        "is_target": "false",
        "name": "nBT",
        "number_of_missing_values": "0"
      },
      {
        "data_type": "numeric",
        "index": "3",
        "is_ignore": "false",
        "is_row_identifier": "false",
        "is_target": "false",
        "name": "Se",
        "number_of_missing_values": "0"
      },
      {
        "data_type": "numeric",
        "index": "4",
        "is_ignore": "false",
        "is_row_identifier": "false",
        "is_target": "false",
        "name": "Si",
        "number_of_missing_values": "0"
      },
      {
        "data_type": "numeric",
        "index": "5",
        "is_ignore": "false",
        "is_row_identifier": "false",
        "is_target": "true",
        "name": "pXC50",
        "number_of_missing_values": "0"
      }
    ]
  }
}