"molecule_id","FCFP4_1024b116","FCFP4_1024b185","FCFP4_1024b216","FCFP4_1024b227","FCFP4_1024b283","FCFP4_1024b298","FCFP4_1024b330","FCFP4_1024b365","FCFP4_1024b38","FCFP4_1024b468","FCFP4_1024b497","FCFP4_1024b540","FCFP4_1024b553","FCFP4_1024b622","FCFP4_1024b635","FCFP4_1024b639","FCFP4_1024b669","FCFP4_1024b695","FCFP4_1024b787","FCFP4_1024b809","FCFP4_1024b819","FCFP4_1024b853","FCFP4_1024b904","FCFP4_1024b961","FCFP4_1024b971","FCFP4_1024b982","FCFP4_1024b986","FCFP4_1024b142","FCFP4_1024b281","FCFP4_1024b360","FCFP4_1024b412","FCFP4_1024b524","FCFP4_1024b530","FCFP4_1024b61","FCFP4_1024b68","FCFP4_1024b711","FCFP4_1024b712","FCFP4_1024b8","FCFP4_1024b825","FCFP4_1024b847","FCFP4_1024b859","FCFP4_1024b891","FCFP4_1024b922","FCFP4_1024b940","FCFP4_1024b389","FCFP4_1024b650","FCFP4_1024b1","FCFP4_1024b10","FCFP4_1024b100","FCFP4_1024b1000","FCFP4_1024b1001","FCFP4_1024b1002","FCFP4_1024b1003","FCFP4_1024b1004","FCFP4_1024b1005","FCFP4_1024b1006","FCFP4_1024b1007","FCFP4_1024b1008","FCFP4_1024b1009","FCFP4_1024b101","FCFP4_1024b1010","FCFP4_1024b1011","FCFP4_1024b1012","FCFP4_1024b1013","FCFP4_1024b1014","FCFP4_1024b1015","FCFP4_1024b1016","FCFP4_1024b1017","FCFP4_1024b1018","FCFP4_1024b1019","FCFP4_1024b102","FCFP4_1024b1020","FCFP4_1024b1021","FCFP4_1024b1022","FCFP4_1024b1023","FCFP4_1024b1024","FCFP4_1024b103","FCFP4_1024b104","FCFP4_1024b105","FCFP4_1024b106","FCFP4_1024b107","FCFP4_1024b108","FCFP4_1024b109","FCFP4_1024b11","FCFP4_1024b110","FCFP4_1024b111","FCFP4_1024b112","FCFP4_1024b113","FCFP4_1024b114","FCFP4_1024b115","FCFP4_1024b117","FCFP4_1024b118","FCFP4_1024b119","FCFP4_1024b12","FCFP4_1024b120","FCFP4_1024b121","FCFP4_1024b122","FCFP4_1024b123","FCFP4_1024b124","FCFP4_1024b125","FCFP4_1024b126","FCFP4_1024b127","FCFP4_1024b128","FCFP4_1024b129","FCFP4_1024b13","FCFP4_1024b130","FCFP4_1024b131","FCFP4_1024b132","FCFP4_1024b133","FCFP4_1024b134","FCFP4_1024b135","FCFP4_1024b136","FCFP4_1024b137","FCFP4_1024b138","FCFP4_1024b139","FCFP4_1024b14","FCFP4_1024b140","FCFP4_1024b141","FCFP4_1024b143","FCFP4_1024b144","FCFP4_1024b145","FCFP4_1024b146","FCFP4_1024b147","FCFP4_1024b148","FCFP4_1024b149","FCFP4_1024b15","FCFP4_1024b150","FCFP4_1024b151","FCFP4_1024b152","FCFP4_1024b153","FCFP4_1024b154","FCFP4_1024b155","FCFP4_1024b156","FCFP4_1024b157","FCFP4_1024b158","FCFP4_1024b159","FCFP4_1024b16","FCFP4_1024b160","FCFP4_1024b161","FCFP4_1024b162","FCFP4_1024b163","FCFP4_1024b164","FCFP4_1024b165","FCFP4_1024b166","FCFP4_1024b167","FCFP4_1024b168","FCFP4_1024b169","FCFP4_1024b17","FCFP4_1024b170","FCFP4_1024b171","FCFP4_1024b172","FCFP4_1024b173","FCFP4_1024b174","FCFP4_1024b175","pXC50"
{12 1,34 1,47 1,148 1,149 1,155 4.939}
{0 CHEMBL2062528,12 1,28 1,29 1,30 1,31 1,32 1,35 1,36 1,37 1,38 1,39 1,40 1,41 1,42 1,43 1,44 1,47 1,148 1,149 1,152 1,155 4}
{0 CHEMBL2062590,12 1,28 1,29 1,30 1,31 1,32 1,35 1,36 1,37 1,38 1,39 1,40 1,41 1,42 1,43 1,44 1,47 1,148 1,149 1,150 1,152 1,155 4}
{0 CHEMBL2062591,12 1,28 1,29 1,30 1,31 1,32 1,35 1,36 1,37 1,38 1,39 1,40 1,41 1,42 1,43 1,44 1,47 1,70 1,148 1,149 1,150 1,152 1,155 4}
{0 CHEMBL2062592,12 1,28 1,29 1,30 1,31 1,32 1,35 1,36 1,37 1,38 1,39 1,40 1,41 1,42 1,43 1,44 1,47 1,115 1,148 1,149 1,150 1,152 1,155 4}
{0 CHEMBL2062593,12 1,28 1,29 1,30 1,31 1,32 1,35 1,36 1,37 1,38 1,39 1,40 1,41 1,42 1,43 1,44 1,47 1,115 1,148 1,149 1,150 1,152 1,155 4}
{0 CHEMBL2062594,12 1,28 1,29 1,30 1,31 1,32 1,35 1,36 1,37 1,38 1,39 1,40 1,41 1,42 1,43 1,44 1,47 1,148 1,149 1,150 1,152 1,155 4}
{0 CHEMBL2062595,12 1,28 1,29 1,30 1,31 1,32 1,35 1,36 1,37 1,38 1,39 1,40 1,41 1,42 1,43 1,44 1,47 1,103 1,148 1,149 1,150 1,152 1,155 4}
{0 CHEMBL2062596,12 1,28 1,29 1,30 1,31 1,32 1,35 1,36 1,37 1,38 1,39 1,40 1,41 1,42 1,43 1,44 1,47 1,148 1,149 1,150 1,152 1,155 4}
{0 CHEMBL2062597,12 1,28 1,29 1,30 1,31 1,32 1,35 1,36 1,37 1,38 1,39 1,40 1,41 1,42 1,43 1,44 1,47 1,148 1,149 1,150 1,152 1,155 4}
{0 CHEMBL2062598,12 1,28 1,29 1,30 1,31 1,32 1,35 1,36 1,37 1,38 1,39 1,40 1,41 1,42 1,43 1,44 1,47 1,115 1,148 1,149 1,150 1,152 1,155 4}
{0 CHEMBL2062599,12 1,28 1,29 1,30 1,31 1,32 1,35 1,36 1,37 1,38 1,39 1,40 1,41 1,42 1,43 1,44 1,47 1,115 1,148 1,149 1,150 1,152 1,155 4}
{0 CHEMBL2062707,12 1,28 1,29 1,30 1,31 1,32 1,35 1,36 1,37 1,38 1,39 1,40 1,41 1,42 1,43 1,44 1,47 1,148 1,149 1,150 1,152 1,155 4}
{0 CHEMBL2062708,12 1,28 1,29 1,30 1,31 1,32 1,35 1,36 1,37 1,38 1,39 1,40 1,41 1,42 1,43 1,44 1,47 1,103 1,148 1,149 1,150 1,152 1,155 4}
{0 CHEMBL2062709,12 1,28 1,29 1,30 1,31 1,32 1,35 1,36 1,37 1,38 1,39 1,40 1,41 1,42 1,43 1,44 1,47 1,148 1,149 1,150 1,152 1,155 4}
{0 CHEMBL2062710,12 1,28 1,29 1,30 1,31 1,32 1,35 1,36 1,37 1,38 1,39 1,40 1,41 1,42 1,43 1,44 1,47 1,115 1,148 1,149 1,152 1,155 4}
{0 CHEMBL2062711,12 1,28 1,29 1,30 1,31 1,32 1,35 1,36 1,37 1,38 1,39 1,40 1,41 1,42 1,43 1,44 1,47 1,115 1,148 1,149 1,152 1,155 4}
{0 CHEMBL2062712,12 1,28 1,29 1,30 1,31 1,32 1,33 1,35 1,36 1,37 1,38 1,39 1,40 1,41 1,42 1,43 1,44 1,47 1,148 1,149 1,152 1,155 4}
{0 CHEMBL2062713,12 1,28 1,29 1,30 1,31 1,32 1,35 1,36 1,37 1,38 1,39 1,40 1,41 1,42 1,43 1,44 1,47 1,103 1,148 1,149 1,152 1,155 4}
{0 CHEMBL2062714,12 1,28 1,29 1,30 1,31 1,32 1,35 1,36 1,37 1,38 1,39 1,40 1,41 1,42 1,43 1,44 1,47 1,148 1,149 1,152 1,155 4}
{0 CHEMBL565371,1 1,2 1,3 1,4 1,5 1,6 1,7 1,8 1,9 1,10 1,11 1,13 1,14 1,15 1,16 1,17 1,18 1,19 1,20 1,21 1,22 1,23 1,24 1,25 1,26 1,27 1,33 1,34 1,47 1,48 1,64 1,148 1,149 1,155 5.553}
{0 CHEMBL565795,1 1,2 1,3 1,4 1,5 1,6 1,7 1,8 1,9 1,10 1,11 1,13 1,14 1,15 1,16 1,17 1,18 1,19 1,20 1,21 1,22 1,23 1,24 1,25 1,26 1,27 1,33 1,34 1,45 1,46 1,47 1,115 1,148 1,149 1,150 1,152 1,155 6.337}
{0 CHEMBL565810,1 1,2 1,3 1,4 1,5 1,6 1,7 1,8 1,9 1,10 1,11 1,13 1,14 1,15 1,16 1,17 1,18 1,19 1,20 1,21 1,22 1,23 1,24 1,25 1,26 1,27 1,33 1,34 1,45 1,46 1,47 1,148 1,149 1,150 1,152 1,155 6.108}
{0 CHEMBL567069,1 1,2 1,3 1,4 1,5 1,6 1,7 1,8 1,9 1,10 1,11 1,13 1,14 1,15 1,16 1,17 1,18 1,19 1,20 1,21 1,22 1,23 1,24 1,25 1,26 1,27 1,33 1,34 1,45 1,46 1,47 1,115 1,148 1,149 1,152 1,155 6.328}
{0 CHEMBL584481,1 1,2 1,3 1,4 1,5 1,6 1,7 1,8 1,9 1,10 1,11 1,13 1,14 1,15 1,16 1,17 1,18 1,19 1,20 1,21 1,22 1,23 1,24 1,25 1,26 1,27 1,33 1,34 1,45 1,46 1,47 1,115 1,148 1,149 1,152 1,155 6.284}
