"molecule_id","AMW","C.","H.","Me","Mi","Mp","Mv","MW","N.","nAB","nAT","nB","nBM","nBO","nBR","nBT","nC","nCL","nCsp","nCsp2","nCsp3","nDB","nF","nH","nHet","nHM","nI","nN","nO","nP","nS","nSK","nTB","nX","O.","RBF","RBN","SCBO","Se","Si","Sp","Sv","X.","pXC50"
{1 5.934,2 39.6,3 56.6,4 0.979,5 1.125,6 0.629,7 0.572,8 314.51,11 53,13 3,14 26,16 56,17 21,20 4,21 17,22 3,24 30,25 2,29 2,32 23,35 3.8,36 0.018,37 1,38 29,39 51.909,40 59.647,41 33.33,42 30.332,44 4.762}
{0 CHEMBL1292,1 8.608,2 49.1,3 40,4 0.998,5 1.11,6 0.734,7 0.691,8 473.43,9 7.3,10 18,11 55,13 22,14 37,16 59,17 27,18 2,20 24,21 3,22 4,24 22,25 6,26 2,28 4,32 33,34 2,36 0.051,37 3,38 50,39 54.891,40 61.033,41 40.353,42 38.009,43 3.6,44 4.542}
{0 CHEMBL159,1 6.932,2 39.3,3 49.6,4 1.002,5 1.129,6 0.638,7 0.605,8 811.08,9 3.4,10 16,11 117,13 20,14 67,16 125,17 46,20 19,21 27,22 4,24 58,25 13,28 4,29 9,32 59,35 7.7,36 0.08,37 10,38 79,39 117.21,40 132.088,41 74.671,42 70.742,44 4.208}
{0 CHEMBL160,1 6.137,2 31.6,3 56.6,4 0.996,5 1.147,6 0.595,7 0.552,8 1202.84,9 5.6,11 196,13 12,14 85,16 196,17 62,20 13,21 49,22 12,24 111,25 23,28 11,29 12,32 85,35 6.1,36 0.077,37 15,38 97,39 195.227,40 224.754,41 116.587,42 108.153,44 5.108}
{0 CHEMBL185878,1 6.326,2 32.9,3 57,4 0.995,5 1.137,6 0.609,7 0.558,8 499.79,9 1.3,11 79,13 3,14 37,16 82,17 26,20 1,21 25,22 3,24 45,25 8,26 1,28 1,29 6,31 1,32 34,35 7.6,36 0.085,37 7,38 40,39 78.581,40 89.809,41 48.131,42 44.087,44 4.553}
{0 CHEMBL197,1 6.404,2 38,3 53.5,4 0.992,5 1.131,6 0.627,7 0.583,8 454.67,9 2.8,10 12,11 71,13 13,14 34,16 72,17 27,19 1,20 12,21 14,24 38,25 6,28 2,29 4,32 33,33 1,35 5.6,36 0.181,37 13,38 42,39 70.418,40 80.308,41 44.535,42 41.384,44 4.102}
{0 CHEMBL2074579,1 5.996,2 34.7,3 57.3,4 0.991,5 1.137,6 0.604,7 0.555,8 449.7,9 1.3,11 75,13 2,14 35,16 78,17 26,20 2,21 24,22 2,24 43,25 6,28 1,29 5,32 32,35 6.7,36 0.077,37 6,38 37,39 74.294,40 85.265,41 45.268,42 41.658,44 5.155}
{0 CHEMBL2074587,1 6.128,2 34.2,3 56.6,4 0.995,5 1.138,6 0.602,7 0.558,8 465.7,9 1.3,11 76,13 2,14 36,16 79,17 26,20 2,21 24,22 2,24 43,25 7,28 1,29 6,32 33,35 7.9,36 0.076,37 6,38 38,39 75.621,40 86.474,41 45.722,42 42.373,44 4.957}
{0 CHEMBL223643,1 6.616,2 32.1,3 53.6,4 1.01,5 1.144,6 0.596,7 0.566,8 1111.5,9 3.6,11 168,13 12,14 78,16 168,17 54,20 12,21 42,22 12,24 90,25 24,28 6,29 18,32 78,35 10.7,36 0.054,37 9,38 90,39 169.613,40 192.197,41 100.194,42 95.12,44 5.143}
{0 CHEMBL224867,1 6.447,2 32.5,3 56.3,4 0.999,5 1.138,6 0.607,7 0.56,8 515.79,9 1.3,11 80,13 3,14 38,16 83,17 26,20 1,21 25,22 3,24 45,25 9,26 1,28 1,29 7,31 1,32 35,35 8.8,36 0.084,37 7,38 41,39 79.909,40 91.019,41 48.586,42 44.802,44 5.372}
{0 CHEMBL272427,1 6.326,2 32.9,3 57,4 0.995,5 1.137,6 0.609,7 0.558,8 499.79,9 1.3,11 79,13 3,14 37,16 82,17 26,20 1,21 25,22 3,24 45,25 8,26 1,28 1,29 6,31 1,32 34,35 7.6,36 0.085,37 7,38 40,39 78.581,40 89.809,41 48.131,42 44.087,44 4.924}
{0 CHEMBL295698,1 8.304,2 40.6,3 43.8,4 1.013,5 1.127,6 0.679,7 0.648,8 531.48,9 6.3,10 17,11 64,13 18,14 40,16 68,17 26,18 2,20 16,21 10,22 1,24 28,25 10,26 2,28 4,29 4,32 36,34 2,35 6.3,36 0.103,37 7,38 49.5,39 64.851,40 72.116,41 43.455,42 41.448,43 3.1,44 4.184}
{0 CHEMBL408,1 7.614,2 41.4,3 46.6,4 1.005,5 1.118,6 0.669,7 0.632,8 441.59,9 1.7,10 12,11 58,13 14,14 34,16 61,17 24,20 14,21 10,22 2,24 27,25 7,26 1,28 1,29 5,31 1,32 31,35 8.6,36 0.082,37 5,38 42,39 58.302,40 64.863,41 38.824,42 36.631,44 4.178}
{0 CHEMBL428647,1 7.557,2 41.6,3 45.1,4 1.016,5 1.122,6 0.65,7 0.63,8 853.99,9 0.9,10 18,11 113,13 25,14 68,16 119,17 47,20 26,21 21,22 7,24 51,25 15,28 1,29 14,32 62,35 12.4,36 0.118,37 14,38 84,39 114.774,40 126.81,41 73.404,42 71.199,44 4.556}
{0 CHEMBL437765,1 7.194,2 38.1,3 48.5,4 1.014,5 1.129,6 0.629,7 0.605,8 697.85,9 1,10 11,11 97,13 17,14 53,16 100,17 37,20 19,21 18,22 6,24 47,25 13,28 1,29 12,32 50,35 12.4,36 0.03,37 3,38 64.5,39 98.352,40 109.561,41 60.972,42 58.715,44 4.712}
{0 CHEMBL472,1 8.099,2 37.7,3 45.9,4 1.014,5 1.128,6 0.667,7 0.631,8 494.06,9 4.9,10 12,11 61,13 16,14 35,16 63,17 23,18 1,20 14,21 9,22 4,24 28,25 10,26 2,28 3,29 5,31 1,32 33,34 1,35 8.2,36 0.127,37 8,38 45,39 61.829,40 68.804,41 40.693,42 38.501,43 1.6,44 4.561}
{0 CHEMBL71,1 7.972,2 42.5,3 47.5,4 0.989,5 1.115,6 0.709,7 0.645,8 318.9,9 5,10 12,11 40,13 12,14 23,16 42,17 17,18 1,20 12,21 5,24 19,25 4,26 2,28 2,31 1,32 21,34 1,36 0.095,37 4,38 29,39 39.556,40 44.597,41 28.37,42 25.799,43 2.5,44 4.493}
{0 CHEMBL772,1 7.247,2 39.3,3 47.6,4 1.011,5 1.128,6 0.638,7 0.613,8 608.75,9 2.4,10 16,11 84,13 18,14 49,16 89,17 33,20 16,21 17,22 2,24 40,25 11,28 2,29 9,32 44,35 10.7,36 0.112,37 10,38 59,39 84.938,40 94.77,41 53.568,42 51.485,44 4.991}
{0 CHEMBL83,1 6.519,2 45.6,3 50.9,4 0.979,5 1.114,6 0.669,7 0.616,8 371.56,9 1.8,10 18,11 57,13 19,14 30,16 59,17 26,20 20,21 6,22 1,24 29,25 2,28 1,29 1,32 28,35 1.8,36 0.136,37 8,38 40,39 55.8,40 63.521,41 38.12,42 35.111,44 4.723}
