{
  "data_set_description": {
    "collection_date": "November 2013",
    "creator": "Dr Jeremy Besnard, Dr Ivan Olier, Dr Noureddin Sadawi, Dr Larisa Soldatova, Dr Crina Grosan, Prof Ross King, Dr Richard Bickerton, Prof Andrew Hopkins and Dr Willem van Hoorn",
    "default_target_attribute": "pXC50",
    "description": "This dataset contains QSAR data (from ChEMBL version 17) showing activity values (unit is pseudo-pCI50) of several compounds on drug target ChEMBL_ID: CHEMBL4613 (TID: 10677), and it has 59 rows and 1241 features (not including molecule IDs and class feature: molecule_id and pXC50). The features represent Molecular Descriptors which were generated from SMILES strings. Missing value imputation was applied to this dataset (By choosing the Median).",
    "description_version": "1",
    "file_id": "3668656",
    "format": "ARFF",
    "id": "39263",
    "licence": "Public",
    "md5_checksum": "9c2023c3a4fb3688a7f29c34fd9630b1",
    "minio_url": "https://data.openml.org/datasets/0003/39263/dataset_39263.pq",
    "name": "QSAR-DATASET-FOR-DRUG-TARGET-CHEMBL4613",
    "original_data_url": "https://www.ebi.ac.uk/chembl/target/inspect/CHEMBL4613",
    "parquet_url": "https://data.openml.org/datasets/0003/39263/dataset_39263.pq",
    "processing_date": "2018-10-04 06:19:28",
    "row_id_attribute": "molecule_id",
    "status": "deactivated",
    "tag": [
      "MetaQSAR",
      "study_13"
    ],
    "upload_date": "2016-07-16T07:17:26",
    "url": "https://api.openml.org/data/v1/download/3668656/QSAR-DATASET-FOR-DRUG-TARGET-CHEMBL4613.arff",
    "version": "12",
    "visibility": "public"
  }
}