{
  "data_features": {
    "feature": [
      {
        "data_type": "nominal",
        "index": "0",
        "is_ignore": "false",
        "is_row_identifier": "true",
        "is_target": "false",
        "name": "molecule_id",
        "nominal_value": [
          "CHEMBL1098175",
          "CHEMBL116438",
          "CHEMBL1172228",
          "CHEMBL1208858",
          "CHEMBL122097",
          "CHEMBL1255778",
          "CHEMBL1256783",
          "CHEMBL1257003",
          "CHEMBL1284",
          "CHEMBL1300370",
          "CHEMBL1302272",
          "CHEMBL1302459",
          "CHEMBL1302946",
          "CHEMBL1303188",
          "CHEMBL1303708",
          "CHEMBL1304445",
          "CHEMBL1305055",
          "CHEMBL1305463",
          "CHEMBL1307435",
          "CHEMBL1307459",
          "CHEMBL1307682",
          "CHEMBL1309252",
          "CHEMBL1310309",
          "CHEMBL1310353",
          "CHEMBL1310972",
          "CHEMBL1311580",
          "CHEMBL1311641",
          "CHEMBL1312616",
          "CHEMBL1313502",
          "CHEMBL1314122",
          "CHEMBL1314787",
          "CHEMBL1315784",
          "CHEMBL1318350",
          "CHEMBL1319190",
          "CHEMBL1319254",
          "CHEMBL1319346",
          "CHEMBL1319411",
          "CHEMBL1320007",
          "CHEMBL1320230",
          "CHEMBL1320284",
          "CHEMBL1321572",
          "CHEMBL1321811",
          "CHEMBL1322977",
          "CHEMBL1323179",
          "CHEMBL1323450",
          "CHEMBL1323900",
          "CHEMBL1323944",
          "CHEMBL1324863",
          "CHEMBL1325006",
          "CHEMBL1325366",
          "CHEMBL1325487",
          "CHEMBL1326265",
          "CHEMBL1327409",
          "CHEMBL1328229",
          "CHEMBL1329826",
          "CHEMBL1330039",
          "CHEMBL1330574",
          "CHEMBL1333255",
          "CHEMBL1333659",
          "CHEMBL1333737",
          "CHEMBL1333813",
          "CHEMBL1334421",
          "CHEMBL1334710",
          "CHEMBL1334863",
          "CHEMBL1335905",
          "CHEMBL1336276",
          "CHEMBL1338487",
          "CHEMBL1338507",
          "CHEMBL1338906",
          "CHEMBL1340338",
          "CHEMBL1340344",
          "CHEMBL1340638",
          "CHEMBL1340656",
          "CHEMBL1340701",
          "CHEMBL1340713",
          "CHEMBL1342091",
          "CHEMBL1342156",
          "CHEMBL1342821",
          "CHEMBL1343784",
          "CHEMBL1343895",
          "CHEMBL1345195",
          "CHEMBL1345538",
          "CHEMBL1346047",
          "CHEMBL1347537",
          "CHEMBL1348355",
          "CHEMBL1349252",
          "CHEMBL1349795",
          "CHEMBL1350188",
          "CHEMBL1350396",
          "CHEMBL1350596",
          "CHEMBL1350787",
          "CHEMBL1351795",
          "CHEMBL1352305",
          "CHEMBL1353033",
          "CHEMBL1353324",
          "CHEMBL1355012",
          "CHEMBL1356184",
          "CHEMBL1357122",
          "CHEMBL1357672",
          "CHEMBL1358976",
          "CHEMBL1359140",
          "CHEMBL1359487",
          "CHEMBL1360321",
          "CHEMBL1360404",
          "CHEMBL1361854",
          "CHEMBL1362833",
          "CHEMBL1363730",
          "CHEMBL1363961",
          "CHEMBL1366575",
          "CHEMBL1366670",
          "CHEMBL1367272",
          "CHEMBL1368428",
          "CHEMBL1368995",
          "CHEMBL1369055",
          "CHEMBL1369256",
          "CHEMBL1369494",
          "CHEMBL1369513",
          "CHEMBL1370019",
          "CHEMBL1370217",
          "CHEMBL1370260",
          "CHEMBL1370367",
          "CHEMBL1370787",
          "CHEMBL1371245",
          "CHEMBL1371339",
          "CHEMBL1371869",
          "CHEMBL1372823",
          "CHEMBL1374321",
          "CHEMBL1374971",
          "CHEMBL1375199",
          "CHEMBL1375393",
          "CHEMBL1375627",
          "CHEMBL1375639",
          "CHEMBL1376754",
          "CHEMBL1377001",
          "CHEMBL1378328",
          "CHEMBL1378512",
          "CHEMBL1378661",
          "CHEMBL1379607",
          "CHEMBL1379853",
          "CHEMBL1380128",
          "CHEMBL1381289",
          "CHEMBL1381655",
          "CHEMBL1381922",
          "CHEMBL1382917",
          "CHEMBL1383312",
          "CHEMBL1383878",
          "CHEMBL1385608",
          "CHEMBL1385899",
          "CHEMBL1386267",
          "CHEMBL1386802",
          "CHEMBL1387349",
          "CHEMBL1387581",
          "CHEMBL1389074",
          "CHEMBL1389167",
          "CHEMBL1390521",
          "CHEMBL1390605",
          "CHEMBL1391336",
          "CHEMBL1392552",
          "CHEMBL1392573",
          "CHEMBL1392848",
          "CHEMBL1393486",
          "CHEMBL1393616",
          "CHEMBL1393912",
          "CHEMBL1397359",
          "CHEMBL1398188",
          "CHEMBL1398243",
          "CHEMBL1398478",
          "CHEMBL1399492",
          "CHEMBL140",
          "CHEMBL1400401",
          "CHEMBL1400955",
          "CHEMBL1401039",
          "CHEMBL1401747",
          "CHEMBL1402586",
          "CHEMBL1403606",
          "CHEMBL1404792",
          "CHEMBL1404998",
          "CHEMBL1405027",
          "CHEMBL1405239",
          "CHEMBL1405576",
          "CHEMBL1406077",
          "CHEMBL1406348",
          "CHEMBL1407064",
          "CHEMBL1407474",
          "CHEMBL1407614",
          "CHEMBL1408152",
          "CHEMBL1408276",
          "CHEMBL1408338",
          "CHEMBL1408451",
          "CHEMBL1409617",
          "CHEMBL1409782",
          "CHEMBL1410280",
          "CHEMBL1410313",
          "CHEMBL1410588",
          "CHEMBL1410922",
          "CHEMBL1411223",
          "CHEMBL1411435",
          "CHEMBL1412423",
          "CHEMBL1412926",
          "CHEMBL1412954",
          "CHEMBL1412999",
          "CHEMBL1413142",
          "CHEMBL1413579",
          "CHEMBL1413866",
          "CHEMBL1414254",
          "CHEMBL1416189",
          "CHEMBL1416439",
          "CHEMBL1417159",
          "CHEMBL1417168",
          "CHEMBL1417524",
          "CHEMBL1418124",
          "CHEMBL1419194",
          "CHEMBL1419813",
          "CHEMBL1420033",
          "CHEMBL1421055",
          "CHEMBL1421399",
          "CHEMBL1422183",
          "CHEMBL1424205",
          "CHEMBL1424867",
          "CHEMBL1425242",
          "CHEMBL1425487",
          "CHEMBL1426383",
          "CHEMBL1428640",
          "CHEMBL1428985",
          "CHEMBL1429158",
          "CHEMBL1430116",
          "CHEMBL1436898",
          "CHEMBL1438081",
          "CHEMBL1438508",
          "CHEMBL1439675",
          "CHEMBL1439696",
          "CHEMBL1439735",
          "CHEMBL1439775",
          "CHEMBL1441918",
          "CHEMBL1442092",
          "CHEMBL1442460",
          "CHEMBL1443436",
          "CHEMBL1446062",
          "CHEMBL1446234",
          "CHEMBL1446664",
          "CHEMBL1446839",
          "CHEMBL1447139",
          "CHEMBL1448673",
          "CHEMBL1449025",
          "CHEMBL1449297",
          "CHEMBL1449379",
          "CHEMBL1449443",
          "CHEMBL1449875",
          "CHEMBL1449951",
          "CHEMBL1450066",
          "CHEMBL1450091",
          "CHEMBL1450666",
          "CHEMBL1450813",
          "CHEMBL1451022",
          "CHEMBL1451040",
          "CHEMBL1451595",
          "CHEMBL1452132",
          "CHEMBL1452278",
          "CHEMBL1452776",
          "CHEMBL1454476",
          "CHEMBL1454890",
          "CHEMBL1456240",
          "CHEMBL1457385",
          "CHEMBL1457695",
          "CHEMBL1458290",
          "CHEMBL1458324",
          "CHEMBL1459455",
          "CHEMBL1459664",
          "CHEMBL1459896",
          "CHEMBL1460225",
          "CHEMBL1460470",
          "CHEMBL1461502",
          "CHEMBL1462208",
          "CHEMBL1463851",
          "CHEMBL1465511",
          "CHEMBL1466250",
          "CHEMBL146710",
          "CHEMBL1469393",
          "CHEMBL1469835",
          "CHEMBL1469921",
          "CHEMBL1470091",
          "CHEMBL1470219",
          "CHEMBL1470268",
          "CHEMBL1471932",
          "CHEMBL1471965",
          "CHEMBL1472214",
          "CHEMBL1472524",
          "CHEMBL1473059",
          "CHEMBL1474042",
          "CHEMBL1476029",
          "CHEMBL1478726",
          "CHEMBL1479103",
          "CHEMBL1479664",
          "CHEMBL1480750",
          "CHEMBL1480882",
          "CHEMBL1481632",
          "CHEMBL1483248",
          "CHEMBL1486430",
          "CHEMBL148645",
          "CHEMBL1486493",
          "CHEMBL1486697",
          "CHEMBL1486827",
          "CHEMBL1487179",
          "CHEMBL1487722",
          "CHEMBL1487973",
          "CHEMBL1488474",
          "CHEMBL148905",
          "CHEMBL1489864",
          "CHEMBL1490165",
          "CHEMBL1490685",
          "CHEMBL1491588",
          "CHEMBL1492076",
          "CHEMBL1492396",
          "CHEMBL1493010",
          "CHEMBL1493191",
          "CHEMBL1494656",
          "CHEMBL1495555",
          "CHEMBL1495574",
          "CHEMBL1495968",
          "CHEMBL1496952",
          "CHEMBL1496986",
          "CHEMBL1497387",
          "CHEMBL1497466",
          "CHEMBL1497487",
          "CHEMBL1498044",
          "CHEMBL1498644",
          "CHEMBL1499077",
          "CHEMBL1499248",
          "CHEMBL1499828",
          "CHEMBL1499914",
          "CHEMBL1500102",
          "CHEMBL1503175",
          "CHEMBL1503793",
          "CHEMBL1503852",
          "CHEMBL1503962",
          "CHEMBL1505198",
          "CHEMBL1505816",
          "CHEMBL1506262",
          "CHEMBL1506682",
          "CHEMBL1507315",
          "CHEMBL1508055",
          "CHEMBL1508485",
          "CHEMBL1508847",
          "CHEMBL1509671",
          "CHEMBL1510262",
          "CHEMBL1510294",
          "CHEMBL1510541",
          "CHEMBL1510663",
          "CHEMBL1510785",
          "CHEMBL1512237",
          "CHEMBL1514592",
          "CHEMBL1516984",
          "CHEMBL1518041",
          "CHEMBL1518080",
          "CHEMBL1518655",
          "CHEMBL1518905",
          "CHEMBL1519111",
          "CHEMBL1519162",
          "CHEMBL1519707",
          "CHEMBL1520471",
          "CHEMBL1521009",
          "CHEMBL1523111",
          "CHEMBL1523213",
          "CHEMBL1523405",
          "CHEMBL1524082",
          "CHEMBL1524101",
          "CHEMBL1525897",
          "CHEMBL1526624",
          "CHEMBL1527041",
          "CHEMBL1527423",
          "CHEMBL1527436",
          "CHEMBL1528241",
          "CHEMBL1528487",
          "CHEMBL1528700",
          "CHEMBL1529306",
          "CHEMBL1529466",
          "CHEMBL1529827",
          "CHEMBL1529865",
          "CHEMBL1529919",
          "CHEMBL1529932",
          "CHEMBL1530380",
          "CHEMBL1531156",
          "CHEMBL1531603",
          "CHEMBL1531645",
          "CHEMBL1531945",
          "CHEMBL1532097",
          "CHEMBL1532702",
          "CHEMBL1532795",
          "CHEMBL1532996",
          "CHEMBL1533351",
          "CHEMBL1533512",
          "CHEMBL1534899",
          "CHEMBL1534915",
          "CHEMBL1535695",
          "CHEMBL1536250",
          "CHEMBL1537181",
          "CHEMBL1537356",
          "CHEMBL1539157",
          "CHEMBL1540647",
          "CHEMBL1540897",
          "CHEMBL1541861",
          "CHEMBL1543835",
          "CHEMBL1543965",
          "CHEMBL1544375",
          "CHEMBL1544838",
          "CHEMBL1546037",
          "CHEMBL1546048",
          "CHEMBL1546175",
          "CHEMBL1547446",
          "CHEMBL1548196",
          "CHEMBL1549540",
          "CHEMBL1554773",
          "CHEMBL1555317",
          "CHEMBL1556273",
          "CHEMBL1556531",
          "CHEMBL1559056",
          "CHEMBL1559307",
          "CHEMBL1559467",
          "CHEMBL1560432",
          "CHEMBL1561488",
          "CHEMBL1561914",
          "CHEMBL1562260",
          "CHEMBL1562738",
          "CHEMBL156383",
          "CHEMBL1563861",
          "CHEMBL1564638",
          "CHEMBL1565952",
          "CHEMBL1566209",
          "CHEMBL1566791",
          "CHEMBL1566994",
          "CHEMBL1567226",
          "CHEMBL1567396",
          "CHEMBL1568847",
          "CHEMBL1569923",
          "CHEMBL1570045",
          "CHEMBL1571983",
          "CHEMBL1572087",
          "CHEMBL1572262",
          "CHEMBL1574218",
          "CHEMBL1574857",
          "CHEMBL1574910",
          "CHEMBL1576140",
          "CHEMBL1577281",
          "CHEMBL1577632",
          "CHEMBL1578178",
          "CHEMBL1578652",
          "CHEMBL1578931",
          "CHEMBL1579513",
          "CHEMBL1581074",
          "CHEMBL1582381",
          "CHEMBL1583835",
          "CHEMBL1584202",
          "CHEMBL1584760",
          "CHEMBL1584967",
          "CHEMBL1585156",
          "CHEMBL1585596",
          "CHEMBL1585758",
          "CHEMBL1586668",
          "CHEMBL1587847",
          "CHEMBL1588052",
          "CHEMBL1588557",
          "CHEMBL1589514",
          "CHEMBL1590634",
          "CHEMBL1591163",
          "CHEMBL1594374",
          "CHEMBL1594922",
          "CHEMBL1596461",
          "CHEMBL1597177",
          "CHEMBL1599901",
          "CHEMBL1600440",
          "CHEMBL1600647",
          "CHEMBL1601093",
          "CHEMBL1602709",
          "CHEMBL1604362",
          "CHEMBL1604739",
          "CHEMBL1605362",
          "CHEMBL1605425",
          "CHEMBL1605701",
          "CHEMBL1606904",
          "CHEMBL1606954",
          "CHEMBL1607353",
          "CHEMBL1607428",
          "CHEMBL1608135",
          "CHEMBL1608149",
          "CHEMBL1608620",
          "CHEMBL1609006",
          "CHEMBL1609125",
          "CHEMBL1609128",
          "CHEMBL1609295",
          "CHEMBL1609547",
          "CHEMBL1609596",
          "CHEMBL1610857",
          "CHEMBL1613004",
          "CHEMBL1613432",
          "CHEMBL163713",
          "CHEMBL164",
          "CHEMBL1698793",
          "CHEMBL1699194",
          "CHEMBL1699317",
          "CHEMBL1699830",
          "CHEMBL1701354",
          "CHEMBL1701518",
          "CHEMBL1701850",
          "CHEMBL1702104",
          "CHEMBL1702405",
          "CHEMBL1702573",
          "CHEMBL1702844",
          "CHEMBL1703256",
          "CHEMBL1703867",
          "CHEMBL1704727",
          "CHEMBL1705147",
          "CHEMBL1705410",
          "CHEMBL1705696",
          "CHEMBL1705728",
          "CHEMBL1705776",
          "CHEMBL1706140",
          "CHEMBL1706513",
          "CHEMBL1707106",
          "CHEMBL1707286",
          "CHEMBL1707715",
          "CHEMBL1708559",
          "CHEMBL1708865",
          "CHEMBL1709345",
          "CHEMBL1709543",
          "CHEMBL1709713",
          "CHEMBL1709736",
          "CHEMBL1709944",
          "CHEMBL1710344",
          "CHEMBL1711577",
          "CHEMBL1712030",
          "CHEMBL1712676",
          "CHEMBL1713061",
          "CHEMBL1713421",
          "CHEMBL1714675",
          "CHEMBL1714903",
          "CHEMBL1715095",
          "CHEMBL1715345",
          "CHEMBL1716238",
          "CHEMBL1716336",
          "CHEMBL1716353",
          "CHEMBL1716509",
          "CHEMBL1717050",
          "CHEMBL1717396",
          "CHEMBL1717530",
          "CHEMBL1717729",
          "CHEMBL1717953",
          "CHEMBL1718162",
          "CHEMBL1718174",
          "CHEMBL1718270",
          "CHEMBL1718303",
          "CHEMBL1718423",
          "CHEMBL1719094",
          "CHEMBL1719158",
          "CHEMBL1720160",
          "CHEMBL1720457",
          "CHEMBL1720993",
          "CHEMBL1721186",
          "CHEMBL1721433",
          "CHEMBL1721503",
          "CHEMBL1722786",
          "CHEMBL1722831",
          "CHEMBL1723324",
          "CHEMBL1723441",
          "CHEMBL1723614",
          "CHEMBL1723727",
          "CHEMBL1724211",
          "CHEMBL1724929",
          "CHEMBL1725074",
          "CHEMBL1725384",
          "CHEMBL1725748",
          "CHEMBL1726265",
          "CHEMBL1726632",
          "CHEMBL1726777",
          "CHEMBL1727453",
          "CHEMBL1727550",
          "CHEMBL1727893",
          "CHEMBL1728453",
          "CHEMBL1728960",
          "CHEMBL1730259",
          "CHEMBL1730470",
          "CHEMBL1730620",
          "CHEMBL1730628",
          "CHEMBL1731166",
          "CHEMBL1731432",
          "CHEMBL1731833",
          "CHEMBL1732263",
          "CHEMBL1732408",
          "CHEMBL1732579",
          "CHEMBL1732820",
          "CHEMBL1733511",
          "CHEMBL1733841",
          "CHEMBL1734721",
          "CHEMBL1734946",
          "CHEMBL1735198",
          "CHEMBL1735993",
          "CHEMBL1736776",
          "CHEMBL1736852",
          "CHEMBL1736894",
          "CHEMBL1736975",
          "CHEMBL1737011",
          "CHEMBL179512",
          "CHEMBL195258",
          "CHEMBL1968928",
          "CHEMBL1969992",
          "CHEMBL1970286",
          "CHEMBL1970597",
          "CHEMBL1974737",
          "CHEMBL1976638",
          "CHEMBL1976754",
          "CHEMBL1979849",
          "CHEMBL1980031",
          "CHEMBL1980197",
          "CHEMBL1980281",
          "CHEMBL1980661",
          "CHEMBL1981446",
          "CHEMBL1982107",
          "CHEMBL1984581",
          "CHEMBL1985299",
          "CHEMBL1986342",
          "CHEMBL1987472",
          "CHEMBL1987928",
          "CHEMBL1988579",
          "CHEMBL1989158",
          "CHEMBL1991234",
          "CHEMBL1993780",
          "CHEMBL1997990",
          "CHEMBL2003964",
          "CHEMBL2006611",
          "CHEMBL2028179",
          "CHEMBL210208",
          "CHEMBL224916",
          "CHEMBL234338",
          "CHEMBL240331",
          "CHEMBL250450",
          "CHEMBL254255",
          "CHEMBL255881",
          "CHEMBL260311",
          "CHEMBL307893",
          "CHEMBL346451",
          "CHEMBL349641",
          "CHEMBL358546",
          "CHEMBL359176",
          "CHEMBL400144",
          "CHEMBL40275",
          "CHEMBL442687",
          "CHEMBL445266",
          "CHEMBL445965",
          "CHEMBL455023",
          "CHEMBL459929",
          "CHEMBL463175",
          "CHEMBL466992",
          "CHEMBL467008",
          "CHEMBL467705",
          "CHEMBL467853",
          "CHEMBL467854",
          "CHEMBL468676",
          "CHEMBL468685",
          "CHEMBL468686",
          "CHEMBL474933",
          "CHEMBL490355",
          "CHEMBL501296",
          "CHEMBL502169",
          "CHEMBL505807",
          "CHEMBL509575",
          "CHEMBL522990",
          "CHEMBL549785",
          "CHEMBL556847",
          "CHEMBL560074",
          "CHEMBL56393",
          "CHEMBL567850",
          "CHEMBL572774",
          "CHEMBL576409",
          "CHEMBL583912",
          "CHEMBL586135",
          "CHEMBL587759",
          "CHEMBL589756",
          "CHEMBL592869",
          "CHEMBL594957",
          "CHEMBL596812",
          "CHEMBL596813",
          "CHEMBL597055",
          "CHEMBL597421",
          "CHEMBL597837",
          "CHEMBL598663",
          "CHEMBL599359",
          "CHEMBL599476",
          "CHEMBL599678",
          "CHEMBL599967",
          "CHEMBL600360",
          "CHEMBL600956",
          "CHEMBL601543",
          "CHEMBL607856",
          "CHEMBL608723",
          "CHEMBL609899",
          "CHEMBL610508",
          "CHEMBL610781",
          "CHEMBL70501",
          "CHEMBL76904",
          "CHEMBL81782",
          "CHEMBL89445"
        ],
        "number_of_missing_values": "0"
      },
      {
        "data_type": "numeric",
        "index": "1",
        "is_ignore": "false",
        "is_row_identifier": "false",
        "is_target": "false",
        "name": "AMW",
        "number_of_missing_values": "0"
      },
      {
        "data_type": "numeric",
        "index": "2",
        "is_ignore": "false",
        "is_row_identifier": "false",
        "is_target": "false",
        "name": "C.",
        "number_of_missing_values": "0"
      },
      {
        "data_type": "numeric",
        "index": "3",
        "is_ignore": "false",
        "is_row_identifier": "false",
        "is_target": "false",
        "name": "H.",
        "number_of_missing_values": "0"
      },
      {
        "data_type": "numeric",
        "index": "4",
        "is_ignore": "false",
        "is_row_identifier": "false",
        "is_target": "false",
        "name": "Me",
        "number_of_missing_values": "0"
      },
      {
        "data_type": "numeric",
        "index": "5",
        "is_ignore": "false",
        "is_row_identifier": "false",
        "is_target": "false",
        "name": "Mi",
        "number_of_missing_values": "0"
      },
      {
        "data_type": "numeric",
        "index": "6",
        "is_ignore": "false",
        "is_row_identifier": "false",
        "is_target": "false",
        "name": "Mp",
        "number_of_missing_values": "0"
      },
      {
        "data_type": "numeric",
        "index": "7",
        "is_ignore": "false",
        "is_row_identifier": "false",
        "is_target": "false",
        "name": "Mv",
        "number_of_missing_values": "0"
      },
      {
        "data_type": "numeric",
        "index": "8",
        "is_ignore": "false",
        "is_row_identifier": "false",
        "is_target": "false",
        "name": "MW",
        "number_of_missing_values": "0"
      },
      {
        "data_type": "numeric",
        "index": "9",
        "is_ignore": "false",
        "is_row_identifier": "false",
        "is_target": "false",
        "name": "N.",
        "number_of_missing_values": "0"
      },
      {
        "data_type": "numeric",
        "index": "10",
        "is_ignore": "false",
        "is_row_identifier": "false",
        "is_target": "false",
        "name": "nAB",
        "number_of_missing_values": "0"
      },
      {
        "data_type": "numeric",
        "index": "11",
        "is_ignore": "false",
        "is_row_identifier": "false",
        "is_target": "false",
        "name": "nAT",
        "number_of_missing_values": "0"
      },
      {
        "data_type": "numeric",
        "index": "12",
        "is_ignore": "false",
        "is_row_identifier": "false",
        "is_target": "false",
        "name": "nB",
        "number_of_missing_values": "0"
      },
      {
        "data_type": "numeric",
        "index": "13",
        "is_ignore": "false",
        "is_row_identifier": "false",
        "is_target": "false",
        "name": "nBM",
        "number_of_missing_values": "0"
      },
      {
        "data_type": "numeric",
        "index": "14",
        "is_ignore": "false",
        "is_row_identifier": "false",
        "is_target": "false",
        "name": "nBO",
        "number_of_missing_values": "0"
      },
      {
        "data_type": "numeric",
        "index": "15",
        "is_ignore": "false",
        "is_row_identifier": "false",
        "is_target": "false",
        "name": "nBR",
        "number_of_missing_values": "0"
      },
      {
        "data_type": "numeric",
        "index": "16",
        "is_ignore": "false",
        "is_row_identifier": "false",
        "is_target": "false",
        "name": "nBT",
        "number_of_missing_values": "0"
      },
      {
        "data_type": "numeric",
        "index": "17",
        "is_ignore": "false",
        "is_row_identifier": "false",
        "is_target": "false",
        "name": "nC",
        "number_of_missing_values": "0"
      },
      {
        "data_type": "numeric",
        "index": "18",
        "is_ignore": "false",
        "is_row_identifier": "false",
        "is_target": "false",
        "name": "nCL",
        "number_of_missing_values": "0"
      },
      {
        "data_type": "numeric",
        "index": "19",
        "is_ignore": "false",
        "is_row_identifier": "false",
        "is_target": "false",
        "name": "nCsp",
        "number_of_missing_values": "0"
      },
      {
        "data_type": "numeric",
        "index": "20",
        "is_ignore": "false",
        "is_row_identifier": "false",
        "is_target": "false",
        "name": "nCsp2",
        "number_of_missing_values": "0"
      },
      {
        "data_type": "numeric",
        "index": "21",
        "is_ignore": "false",
        "is_row_identifier": "false",
        "is_target": "false",
        "name": "nCsp3",
        "number_of_missing_values": "0"
      },
      {
        "data_type": "numeric",
        "index": "22",
        "is_ignore": "false",
        "is_row_identifier": "false",
        "is_target": "false",
        "name": "nDB",
        "number_of_missing_values": "0"
      },
      {
        "data_type": "numeric",
        "index": "23",
        "is_ignore": "false",
        "is_row_identifier": "false",
        "is_target": "false",
        "name": "nF",
        "number_of_missing_values": "0"
      },
      {
        "data_type": "numeric",
        "index": "24",
        "is_ignore": "false",
        "is_row_identifier": "false",
        "is_target": "false",
        "name": "nH",
        "number_of_missing_values": "0"
      },
      {
        "data_type": "numeric",
        "index": "25",
        "is_ignore": "false",
        "is_row_identifier": "false",
        "is_target": "false",
        "name": "nHet",
        "number_of_missing_values": "0"
      },
      {
        "data_type": "numeric",
        "index": "26",
        "is_ignore": "false",
        "is_row_identifier": "false",
        "is_target": "false",
        "name": "nHM",
        "number_of_missing_values": "0"
      },
      {
        "data_type": "numeric",
        "index": "27",
        "is_ignore": "false",
        "is_row_identifier": "false",
        "is_target": "false",
        "name": "nI",
        "number_of_missing_values": "0"
      },
      {
        "data_type": "numeric",
        "index": "28",
        "is_ignore": "false",
        "is_row_identifier": "false",
        "is_target": "false",
        "name": "nN",
        "number_of_missing_values": "0"
      },
      {
        "data_type": "numeric",
        "index": "29",
        "is_ignore": "false",
        "is_row_identifier": "false",
        "is_target": "false",
        "name": "nO",
        "number_of_missing_values": "0"
      },
      {
        "data_type": "numeric",
        "index": "30",
        "is_ignore": "false",
        "is_row_identifier": "false",
        "is_target": "false",
        "name": "nP",
        "number_of_missing_values": "0"
      },
      {
        "data_type": "numeric",
        "index": "31",
        "is_ignore": "false",
        "is_row_identifier": "false",
        "is_target": "false",
        "name": "nS",
        "number_of_missing_values": "0"
      },
      {
        "data_type": "numeric",
        "index": "32",
        "is_ignore": "false",
        "is_row_identifier": "false",
        "is_target": "false",
        "name": "nSK",
        "number_of_missing_values": "0"
      },
      {
        "data_type": "numeric",
        "index": "33",
        "is_ignore": "false",
        "is_row_identifier": "false",
        "is_target": "false",
        "name": "nTB",
        "number_of_missing_values": "0"
      },
      {
        "data_type": "numeric",
        "index": "34",
        "is_ignore": "false",
        "is_row_identifier": "false",
        "is_target": "false",
        "name": "nX",
        "number_of_missing_values": "0"
      },
      {
        "data_type": "numeric",
        "index": "35",
        "is_ignore": "false",
        "is_row_identifier": "false",
        "is_target": "false",
        "name": "O.",
        "number_of_missing_values": "0"
      },
      {
        "data_type": "numeric",
        "index": "36",
        "is_ignore": "false",
        "is_row_identifier": "false",
        "is_target": "false",
        "name": "RBF",
        "number_of_missing_values": "0"
      },
      {
        "data_type": "numeric",
        "index": "37",
        "is_ignore": "false",
        "is_row_identifier": "false",
        "is_target": "false",
        "name": "RBN",
        "number_of_missing_values": "0"
      },
      {
        "data_type": "numeric",
        "index": "38",
        "is_ignore": "false",
        "is_row_identifier": "false",
        "is_target": "false",
        "name": "SCBO",
        "number_of_missing_values": "0"
      },
      {
        "data_type": "numeric",
        "index": "39",
        "is_ignore": "false",
        "is_row_identifier": "false",
        "is_target": "false",
        "name": "Se",
        "number_of_missing_values": "0"
      },
      {
        "data_type": "numeric",
        "index": "40",
        "is_ignore": "false",
        "is_row_identifier": "false",
        "is_target": "false",
        "name": "Si",
        "number_of_missing_values": "0"
      },
      {
        "data_type": "numeric",
        "index": "41",
        "is_ignore": "false",
        "is_row_identifier": "false",
        "is_target": "false",
        "name": "Sp",
        "number_of_missing_values": "0"
      },
      {
        "data_type": "numeric",
        "index": "42",
        "is_ignore": "false",
        "is_row_identifier": "false",
        "is_target": "false",
        "name": "Sv",
        "number_of_missing_values": "0"
      },
      {
        "data_type": "numeric",
        "index": "43",
        "is_ignore": "false",
        "is_row_identifier": "false",
        "is_target": "false",
        "name": "X.",
        "number_of_missing_values": "0"
      },
      {
        "data_type": "numeric",
        "index": "44",
        "is_ignore": "false",
        "is_row_identifier": "false",
        "is_target": "true",
        "name": "pXC50",
        "number_of_missing_values": "0"
      }
    ]
  }
}