"molecule_id","AMW","C.","H.","Me","Mi","Mp","Mv","MW","N.","nAB","nAT","nB","nBM","nBO","nBR","nBT","nC","nCL","nCsp","nCsp2","nCsp3","nDB","nF","nH","nHet","nHM","nI","nN","nO","nP","nS","nSK","nTB","nX","O.","RBF","RBN","SCBO","Se","Si","Sp","Sv","X.","pXC50"
{1 5.333,2 35.5,3 61.3,4 0.969,5 1.137,6 0.608,7 0.541,8 165.31,9 3.2,11 31,14 14,16 33,17 11,21 11,24 19,25 1,28 1,32 12,36 0.03,37 1,38 14,39 30.054,40 35.235,41 18.858,42 16.763,44 4.896}
{0 CHEMBL1774319,1 6.577,2 46.7,3 50,4 0.976,5 1.113,6 0.678,7 0.624,8 197.3,9 3.3,11 30,13 2,14 20,16 35,17 14,20 4,21 10,22 2,24 15,25 1,28 1,32 15,38 22,39 29.287,40 33.405,41 20.336,42 18.709,44 4.475}
{0 CHEMBL1774321,1 6.26,2 44.4,3 52.8,4 0.974,5 1.118,6 0.663,7 0.605,8 225.36,9 2.8,11 36,14 24,16 43,17 16,21 16,24 19,25 1,28 1,32 17,38 24,39 35.054,40 40.235,41 23.858,42 21.763,44 4.62}
{0 CHEMBL450375,1 5.403,2 35.7,3 60.7,4 0.97,5 1.136,6 0.611,7 0.544,8 151.28,9 3.6,11 28,14 13,16 30,17 10,21 10,24 17,25 1,28 1,32 11,38 13,39 27.171,40 31.82,41 17.097,42 15.236,44 4.77}
{0 CHEMBL456513,1 5.333,2 35.5,3 61.3,4 0.969,5 1.137,6 0.608,7 0.541,8 165.31,9 3.2,11 31,14 14,16 33,17 11,21 11,24 19,25 1,28 1,32 12,36 0.061,37 2,38 14,39 30.054,40 35.235,41 18.858,42 16.763,44 4.767}
{0 CHEMBL468166,1 5.768,2 34.5,3 58.6,4 0.983,5 1.139,6 0.605,7 0.55,8 167.28,9 3.4,11 29,14 14,16 31,17 10,21 10,24 17,25 2,28 1,29 1,32 12,35 3.4,36 0.032,37 1,38 14,39 28.498,40 33.029,41 17.551,42 15.951,44 4.64}
{0 CHEMBL472275,1 5.894,2 34.6,3 57.7,4 0.985,5 1.139,6 0.607,7 0.555,8 153.25,9 3.8,11 26,14 13,16 28,17 9,21 9,24 15,25 2,28 1,29 1,32 11,35 3.8,38 13,39 25.614,40 29.614,41 15.79,42 14.424,44 4.535}
{0 CHEMBL499125,1 5.858,2 33.3,3 57.6,4 0.981,5 1.146,6 0.609,7 0.554,8 193.33,9 9.1,11 33,13 1,14 16,16 35,17 11,20 1,21 10,22 1,24 19,25 3,28 3,32 14,36 0.086,37 3,38 17,39 32.374,40 37.817,41 20.108,42 18.279,44 5.62}
{0 CHEMBL506460,1 5.403,2 35.7,3 60.7,4 0.97,5 1.136,6 0.611,7 0.544,8 151.28,9 3.6,11 28,14 13,16 30,17 10,21 10,24 17,25 1,28 1,32 11,36 0.033,37 1,38 13,39 27.171,40 31.82,41 17.097,42 15.236,44 5.149}
{0 CHEMBL508777,1 5.333,2 35.5,3 61.3,4 0.969,5 1.137,6 0.608,7 0.541,8 165.31,9 3.2,11 31,14 14,16 33,17 11,21 11,24 19,25 1,28 1,32 12,36 0.03,37 1,38 14,39 30.054,40 35.235,41 18.858,42 16.763,44 5.143}
{0 CHEMBL660,1 5.403,2 35.7,3 60.7,4 0.97,5 1.136,6 0.611,7 0.544,8 151.28,9 3.6,11 28,14 13,16 30,17 10,21 10,24 17,25 1,28 1,32 11,38 13,39 27.171,40 31.82,41 17.097,42 15.236,44 4.796}
