{
  "data_features": {
    "feature": [
      {
        "data_type": "nominal",
        "index": "0",
        "is_ignore": "false",
        "is_row_identifier": "true",
        "is_target": "false",
        "name": "molecule_id",
        "nominal_value": [
          "CHEMBL100572",
          "CHEMBL101617",
          "CHEMBL106257",
          "CHEMBL106622",
          "CHEMBL106886",
          "CHEMBL107041",
          "CHEMBL107519",
          "CHEMBL108463",
          "CHEMBL108480",
          "CHEMBL108531",
          "CHEMBL1086958",
          "CHEMBL1086961",
          "CHEMBL1087182",
          "CHEMBL108764",
          "CHEMBL109063",
          "CHEMBL109101",
          "CHEMBL109723",
          "CHEMBL1099374",
          "CHEMBL1112",
          "CHEMBL111348",
          "CHEMBL112037",
          "CHEMBL112124",
          "CHEMBL112474",
          "CHEMBL113053",
          "CHEMBL113477",
          "CHEMBL114143",
          "CHEMBL114228",
          "CHEMBL114375",
          "CHEMBL114726",
          "CHEMBL115402",
          "CHEMBL115508",
          "CHEMBL115524",
          "CHEMBL115969",
          "CHEMBL1160253",
          "CHEMBL116367",
          "CHEMBL116542",
          "CHEMBL1171644",
          "CHEMBL1171646",
          "CHEMBL1171823",
          "CHEMBL1171824",
          "CHEMBL1172204",
          "CHEMBL1172205",
          "CHEMBL1172206",
          "CHEMBL1172734",
          "CHEMBL1173017",
          "CHEMBL1173018",
          "CHEMBL1173077",
          "CHEMBL1173143",
          "CHEMBL117730",
          "CHEMBL117841",
          "CHEMBL11803",
          "CHEMBL118092",
          "CHEMBL118254",
          "CHEMBL11845",
          "CHEMBL1185",
          "CHEMBL118771",
          "CHEMBL118889",
          "CHEMBL118919",
          "CHEMBL119132",
          "CHEMBL119150",
          "CHEMBL119154",
          "CHEMBL119223",
          "CHEMBL119384",
          "CHEMBL119401",
          "CHEMBL119455",
          "CHEMBL119577",
          "CHEMBL119593",
          "CHEMBL119656",
          "CHEMBL119687",
          "CHEMBL119900",
          "CHEMBL1202783",
          "CHEMBL12028",
          "CHEMBL120512",
          "CHEMBL120995",
          "CHEMBL121274",
          "CHEMBL12177",
          "CHEMBL122536",
          "CHEMBL123642",
          "CHEMBL123952",
          "CHEMBL124444",
          "CHEMBL124561",
          "CHEMBL12507",
          "CHEMBL125193",
          "CHEMBL1255588",
          "CHEMBL1258223",
          "CHEMBL1258452",
          "CHEMBL1258671",
          "CHEMBL125916",
          "CHEMBL12628",
          "CHEMBL126590",
          "CHEMBL126889",
          "CHEMBL12713",
          "CHEMBL127317",
          "CHEMBL127344",
          "CHEMBL127400",
          "CHEMBL127843",
          "CHEMBL128",
          "CHEMBL128649",
          "CHEMBL128917",
          "CHEMBL129634",
          "CHEMBL130328",
          "CHEMBL130795",
          "CHEMBL130851",
          "CHEMBL131054",
          "CHEMBL131313",
          "CHEMBL132304",
          "CHEMBL132545",
          "CHEMBL132766",
          "CHEMBL132981",
          "CHEMBL133086",
          "CHEMBL133094",
          "CHEMBL13325",
          "CHEMBL133615",
          "CHEMBL134273",
          "CHEMBL134344",
          "CHEMBL13464",
          "CHEMBL134746",
          "CHEMBL134991",
          "CHEMBL135197",
          "CHEMBL135224",
          "CHEMBL135318",
          "CHEMBL135414",
          "CHEMBL135616",
          "CHEMBL135735",
          "CHEMBL135834",
          "CHEMBL13588",
          "CHEMBL136190",
          "CHEMBL136226",
          "CHEMBL136235",
          "CHEMBL136260",
          "CHEMBL136262",
          "CHEMBL13632",
          "CHEMBL136333",
          "CHEMBL136334",
          "CHEMBL136340",
          "CHEMBL136468",
          "CHEMBL136480",
          "CHEMBL136553",
          "CHEMBL136562",
          "CHEMBL136630",
          "CHEMBL136648",
          "CHEMBL136683",
          "CHEMBL136711",
          "CHEMBL136722",
          "CHEMBL136776",
          "CHEMBL136822",
          "CHEMBL136841",
          "CHEMBL136873",
          "CHEMBL136891",
          "CHEMBL136932",
          "CHEMBL137420",
          "CHEMBL137430",
          "CHEMBL137536",
          "CHEMBL137583",
          "CHEMBL137636",
          "CHEMBL137637",
          "CHEMBL13770",
          "CHEMBL137805",
          "CHEMBL137954",
          "CHEMBL137960",
          "CHEMBL13805",
          "CHEMBL13811",
          "CHEMBL13816",
          "CHEMBL13856",
          "CHEMBL13866",
          "CHEMBL138745",
          "CHEMBL138964",
          "CHEMBL139081",
          "CHEMBL139258",
          "CHEMBL139304",
          "CHEMBL13979",
          "CHEMBL140032",
          "CHEMBL140189",
          "CHEMBL14020",
          "CHEMBL14022",
          "CHEMBL14048",
          "CHEMBL14089",
          "CHEMBL14138",
          "CHEMBL141863",
          "CHEMBL14238",
          "CHEMBL14239",
          "CHEMBL143022",
          "CHEMBL143027",
          "CHEMBL143865",
          "CHEMBL146741",
          "CHEMBL147463",
          "CHEMBL149108",
          "CHEMBL149240",
          "CHEMBL150523",
          "CHEMBL150550",
          "CHEMBL150551",
          "CHEMBL151263",
          "CHEMBL151475",
          "CHEMBL151809",
          "CHEMBL153960",
          "CHEMBL154015",
          "CHEMBL154301",
          "CHEMBL154468",
          "CHEMBL154709",
          "CHEMBL154787",
          "CHEMBL154948",
          "CHEMBL154989",
          "CHEMBL155002",
          "CHEMBL155006",
          "CHEMBL155066",
          "CHEMBL155208",
          "CHEMBL155246",
          "CHEMBL155351",
          "CHEMBL155352",
          "CHEMBL15564",
          "CHEMBL155731",
          "CHEMBL155833",
          "CHEMBL155883",
          "CHEMBL155884",
          "CHEMBL156011",
          "CHEMBL157735",
          "CHEMBL157799",
          "CHEMBL157879",
          "CHEMBL157912",
          "CHEMBL158067",
          "CHEMBL160430",
          "CHEMBL160672",
          "CHEMBL1616",
          "CHEMBL170475",
          "CHEMBL170974",
          "CHEMBL171903",
          "CHEMBL1729",
          "CHEMBL173315",
          "CHEMBL17357",
          "CHEMBL1742470",
          "CHEMBL1743774",
          "CHEMBL1743798",
          "CHEMBL1743799",
          "CHEMBL1743804",
          "CHEMBL1743819",
          "CHEMBL1744043",
          "CHEMBL1744087",
          "CHEMBL174949",
          "CHEMBL176169",
          "CHEMBL176356",
          "CHEMBL176363",
          "CHEMBL176476",
          "CHEMBL176990",
          "CHEMBL177455",
          "CHEMBL1783346",
          "CHEMBL1783347",
          "CHEMBL1783348",
          "CHEMBL1783349",
          "CHEMBL1783350",
          "CHEMBL1783351",
          "CHEMBL1783352",
          "CHEMBL1783353",
          "CHEMBL178564",
          "CHEMBL178797",
          "CHEMBL1788212",
          "CHEMBL1788322",
          "CHEMBL179557",
          "CHEMBL179775",
          "CHEMBL180319",
          "CHEMBL189384",
          "CHEMBL189437",
          "CHEMBL189890",
          "CHEMBL190034",
          "CHEMBL190301",
          "CHEMBL190384",
          "CHEMBL190525",
          "CHEMBL1907770",
          "CHEMBL1907814",
          "CHEMBL1907969",
          "CHEMBL191226",
          "CHEMBL19130",
          "CHEMBL191425",
          "CHEMBL192037",
          "CHEMBL1927088",
          "CHEMBL1927089",
          "CHEMBL1927090",
          "CHEMBL1927092",
          "CHEMBL1927094",
          "CHEMBL1927095",
          "CHEMBL1927096",
          "CHEMBL1927097",
          "CHEMBL2",
          "CHEMBL2024517",
          "CHEMBL2111582",
          "CHEMBL2111781",
          "CHEMBL2111782",
          "CHEMBL2111783",
          "CHEMBL2111925",
          "CHEMBL2111937",
          "CHEMBL2112383",
          "CHEMBL2112384",
          "CHEMBL2112388",
          "CHEMBL2112643",
          "CHEMBL2113056",
          "CHEMBL2114209",
          "CHEMBL2114388",
          "CHEMBL2114440",
          "CHEMBL2114441",
          "CHEMBL2114444",
          "CHEMBL2115213",
          "CHEMBL2115372",
          "CHEMBL2115373",
          "CHEMBL2115374",
          "CHEMBL2115377",
          "CHEMBL222287",
          "CHEMBL222301",
          "CHEMBL225230",
          "CHEMBL225853",
          "CHEMBL228082",
          "CHEMBL233566",
          "CHEMBL233567",
          "CHEMBL23529",
          "CHEMBL24077",
          "CHEMBL240773",
          "CHEMBL25236",
          "CHEMBL25305",
          "CHEMBL253529",
          "CHEMBL253530",
          "CHEMBL253736",
          "CHEMBL253737",
          "CHEMBL253738",
          "CHEMBL253947",
          "CHEMBL253948",
          "CHEMBL253949",
          "CHEMBL254147",
          "CHEMBL255229",
          "CHEMBL256075",
          "CHEMBL256448",
          "CHEMBL257394",
          "CHEMBL257745",
          "CHEMBL257746",
          "CHEMBL257747",
          "CHEMBL257956",
          "CHEMBL257957",
          "CHEMBL257958",
          "CHEMBL258370",
          "CHEMBL258372",
          "CHEMBL25856",
          "CHEMBL258939",
          "CHEMBL25924",
          "CHEMBL26533",
          "CHEMBL266250",
          "CHEMBL267014",
          "CHEMBL267153",
          "CHEMBL267723",
          "CHEMBL267799",
          "CHEMBL267930",
          "CHEMBL268258",
          "CHEMBL268758",
          "CHEMBL269160",
          "CHEMBL269521",
          "CHEMBL269784",
          "CHEMBL270426",
          "CHEMBL273526",
          "CHEMBL273923",
          "CHEMBL274866",
          "CHEMBL275539",
          "CHEMBL27559",
          "CHEMBL27574",
          "CHEMBL275873",
          "CHEMBL275943",
          "CHEMBL276013",
          "CHEMBL276156",
          "CHEMBL276175",
          "CHEMBL276271",
          "CHEMBL276326",
          "CHEMBL276500",
          "CHEMBL278188",
          "CHEMBL27846",
          "CHEMBL27940",
          "CHEMBL279634",
          "CHEMBL280534",
          "CHEMBL281214",
          "CHEMBL281357",
          "CHEMBL282424",
          "CHEMBL282710",
          "CHEMBL282822",
          "CHEMBL282829",
          "CHEMBL283036",
          "CHEMBL28338",
          "CHEMBL283489",
          "CHEMBL284473",
          "CHEMBL284746",
          "CHEMBL28607",
          "CHEMBL286080",
          "CHEMBL286120",
          "CHEMBL286424",
          "CHEMBL28651",
          "CHEMBL287504",
          "CHEMBL287671",
          "CHEMBL287931",
          "CHEMBL287937",
          "CHEMBL288090",
          "CHEMBL288096",
          "CHEMBL28831",
          "CHEMBL28833",
          "CHEMBL288536",
          "CHEMBL28884",
          "CHEMBL288846",
          "CHEMBL28946",
          "CHEMBL289867",
          "CHEMBL289927",
          "CHEMBL28997",
          "CHEMBL290118",
          "CHEMBL290149",
          "CHEMBL290842",
          "CHEMBL291100",
          "CHEMBL291143",
          "CHEMBL291228",
          "CHEMBL292006",
          "CHEMBL292274",
          "CHEMBL292418",
          "CHEMBL292451",
          "CHEMBL292611",
          "CHEMBL292738",
          "CHEMBL293137",
          "CHEMBL293158",
          "CHEMBL293828",
          "CHEMBL293952",
          "CHEMBL294012",
          "CHEMBL294186",
          "CHEMBL294215",
          "CHEMBL294221",
          "CHEMBL294747",
          "CHEMBL296601",
          "CHEMBL297709",
          "CHEMBL29808",
          "CHEMBL298285",
          "CHEMBL29835",
          "CHEMBL298406",
          "CHEMBL298758",
          "CHEMBL299050",
          "CHEMBL299056",
          "CHEMBL299161",
          "CHEMBL299430",
          "CHEMBL299471",
          "CHEMBL299511",
          "CHEMBL300662",
          "CHEMBL300778",
          "CHEMBL300995",
          "CHEMBL301003",
          "CHEMBL301265",
          "CHEMBL301743",
          "CHEMBL301761",
          "CHEMBL303173",
          "CHEMBL303313",
          "CHEMBL303339",
          "CHEMBL303435",
          "CHEMBL303993",
          "CHEMBL304493",
          "CHEMBL304902",
          "CHEMBL307163",
          "CHEMBL307717",
          "CHEMBL308090",
          "CHEMBL308295",
          "CHEMBL308480",
          "CHEMBL308843",
          "CHEMBL309730",
          "CHEMBL310153",
          "CHEMBL310712",
          "CHEMBL310734",
          "CHEMBL310997",
          "CHEMBL313304",
          "CHEMBL313424",
          "CHEMBL313530",
          "CHEMBL314459",
          "CHEMBL315005",
          "CHEMBL315468",
          "CHEMBL315516",
          "CHEMBL315535",
          "CHEMBL315750",
          "CHEMBL315840",
          "CHEMBL315849",
          "CHEMBL317333",
          "CHEMBL317647",
          "CHEMBL317741",
          "CHEMBL317982",
          "CHEMBL318111",
          "CHEMBL318714",
          "CHEMBL318901",
          "CHEMBL319352",
          "CHEMBL319403",
          "CHEMBL319557",
          "CHEMBL31973",
          "CHEMBL319810",
          "CHEMBL320481",
          "CHEMBL321040",
          "CHEMBL32145",
          "CHEMBL322574",
          "CHEMBL323771",
          "CHEMBL324073",
          "CHEMBL324372",
          "CHEMBL325238",
          "CHEMBL326159",
          "CHEMBL326781",
          "CHEMBL326927",
          "CHEMBL327527",
          "CHEMBL328246",
          "CHEMBL328548",
          "CHEMBL329444",
          "CHEMBL330274",
          "CHEMBL331005",
          "CHEMBL331100",
          "CHEMBL332178",
          "CHEMBL332242",
          "CHEMBL332332",
          "CHEMBL332490",
          "CHEMBL332600",
          "CHEMBL332771",
          "CHEMBL333085",
          "CHEMBL333134",
          "CHEMBL333246",
          "CHEMBL333455",
          "CHEMBL333725",
          "CHEMBL333836",
          "CHEMBL333955",
          "CHEMBL334116",
          "CHEMBL334350",
          "CHEMBL334650",
          "CHEMBL334728",
          "CHEMBL335155",
          "CHEMBL335515",
          "CHEMBL335545",
          "CHEMBL336128",
          "CHEMBL336218",
          "CHEMBL336274",
          "CHEMBL336366",
          "CHEMBL336437",
          "CHEMBL336532",
          "CHEMBL336610",
          "CHEMBL337542",
          "CHEMBL338237",
          "CHEMBL339342",
          "CHEMBL339960",
          "CHEMBL339980",
          "CHEMBL340006",
          "CHEMBL34022",
          "CHEMBL34025",
          "CHEMBL340324",
          "CHEMBL340641",
          "CHEMBL340855",
          "CHEMBL34095",
          "CHEMBL341117",
          "CHEMBL34170",
          "CHEMBL341805",
          "CHEMBL342698",
          "CHEMBL34291",
          "CHEMBL343078",
          "CHEMBL343282",
          "CHEMBL343569",
          "CHEMBL343820",
          "CHEMBL343922",
          "CHEMBL343956",
          "CHEMBL344206",
          "CHEMBL344216",
          "CHEMBL344426",
          "CHEMBL344680",
          "CHEMBL345240",
          "CHEMBL345822",
          "CHEMBL345907",
          "CHEMBL346017",
          "CHEMBL346792",
          "CHEMBL347243",
          "CHEMBL348012",
          "CHEMBL348465",
          "CHEMBL348547",
          "CHEMBL349311",
          "CHEMBL349997",
          "CHEMBL350457",
          "CHEMBL350471",
          "CHEMBL350920",
          "CHEMBL35354",
          "CHEMBL355107",
          "CHEMBL356076",
          "CHEMBL361875",
          "CHEMBL362060",
          "CHEMBL363466",
          "CHEMBL364530",
          "CHEMBL366377",
          "CHEMBL366504",
          "CHEMBL366679",
          "CHEMBL367045",
          "CHEMBL367087",
          "CHEMBL367180",
          "CHEMBL367875",
          "CHEMBL367981",
          "CHEMBL368324",
          "CHEMBL369367",
          "CHEMBL36979",
          "CHEMBL372222",
          "CHEMBL37661",
          "CHEMBL37736",
          "CHEMBL38041",
          "CHEMBL38345",
          "CHEMBL38757",
          "CHEMBL388342",
          "CHEMBL38848",
          "CHEMBL388564",
          "CHEMBL392447",
          "CHEMBL39266",
          "CHEMBL393466",
          "CHEMBL39483",
          "CHEMBL39735",
          "CHEMBL39806",
          "CHEMBL39807",
          "CHEMBL39818",
          "CHEMBL40031",
          "CHEMBL40056",
          "CHEMBL401567",
          "CHEMBL401689",
          "CHEMBL401690",
          "CHEMBL401798",
          "CHEMBL402517",
          "CHEMBL402735",
          "CHEMBL402736",
          "CHEMBL403032",
          "CHEMBL403550",
          "CHEMBL404037",
          "CHEMBL404136",
          "CHEMBL404137",
          "CHEMBL404240",
          "CHEMBL404241",
          "CHEMBL404865",
          "CHEMBL405345",
          "CHEMBL405369",
          "CHEMBL406269",
          "CHEMBL40667",
          "CHEMBL407489",
          "CHEMBL408980",
          "CHEMBL40950",
          "CHEMBL41132",
          "CHEMBL41196",
          "CHEMBL41238",
          "CHEMBL413105",
          "CHEMBL415080",
          "CHEMBL415300",
          "CHEMBL416288",
          "CHEMBL416401",
          "CHEMBL416435",
          "CHEMBL417164",
          "CHEMBL417661",
          "CHEMBL41809",
          "CHEMBL418717",
          "CHEMBL418791",
          "CHEMBL418937",
          "CHEMBL418944",
          "CHEMBL419680",
          "CHEMBL419759",
          "CHEMBL42",
          "CHEMBL420510",
          "CHEMBL42055",
          "CHEMBL420604",
          "CHEMBL420788",
          "CHEMBL420972",
          "CHEMBL421914",
          "CHEMBL422067",
          "CHEMBL422086",
          "CHEMBL422169",
          "CHEMBL422267",
          "CHEMBL422796",
          "CHEMBL423331",
          "CHEMBL423510",
          "CHEMBL423671",
          "CHEMBL426763",
          "CHEMBL426813",
          "CHEMBL429051",
          "CHEMBL430798",
          "CHEMBL431220",
          "CHEMBL431367",
          "CHEMBL431946",
          "CHEMBL432762",
          "CHEMBL433233",
          "CHEMBL43345",
          "CHEMBL433652",
          "CHEMBL433744",
          "CHEMBL434809",
          "CHEMBL43514",
          "CHEMBL435218",
          "CHEMBL435441",
          "CHEMBL435779",
          "CHEMBL435949",
          "CHEMBL436042",
          "CHEMBL439639",
          "CHEMBL441618",
          "CHEMBL442740",
          "CHEMBL443081",
          "CHEMBL443953",
          "CHEMBL44414",
          "CHEMBL444368",
          "CHEMBL445011",
          "CHEMBL445129",
          "CHEMBL446350",
          "CHEMBL446396",
          "CHEMBL446564",
          "CHEMBL449016",
          "CHEMBL451211",
          "CHEMBL451463",
          "CHEMBL451734",
          "CHEMBL452510",
          "CHEMBL452512",
          "CHEMBL452776",
          "CHEMBL45531",
          "CHEMBL455633",
          "CHEMBL46",
          "CHEMBL460",
          "CHEMBL461023",
          "CHEMBL461236",
          "CHEMBL462508",
          "CHEMBL466462",
          "CHEMBL468056",
          "CHEMBL468498",
          "CHEMBL468677",
          "CHEMBL476722",
          "CHEMBL477200",
          "CHEMBL477765",
          "CHEMBL478",
          "CHEMBL478413",
          "CHEMBL479",
          "CHEMBL479026",
          "CHEMBL480149",
          "CHEMBL480524",
          "CHEMBL480525",
          "CHEMBL480526",
          "CHEMBL482276",
          "CHEMBL487387",
          "CHEMBL487388",
          "CHEMBL492664",
          "CHEMBL492883",
          "CHEMBL494308",
          "CHEMBL494309",
          "CHEMBL494509",
          "CHEMBL494510",
          "CHEMBL494511",
          "CHEMBL495327",
          "CHEMBL495572",
          "CHEMBL495573",
          "CHEMBL49634",
          "CHEMBL496531",
          "CHEMBL496739",
          "CHEMBL497573",
          "CHEMBL497574",
          "CHEMBL497604",
          "CHEMBL49995",
          "CHEMBL503882",
          "CHEMBL504303",
          "CHEMBL506025",
          "CHEMBL506299",
          "CHEMBL507970",
          "CHEMBL508011",
          "CHEMBL509530",
          "CHEMBL51",
          "CHEMBL51017",
          "CHEMBL510777",
          "CHEMBL511555",
          "CHEMBL512542",
          "CHEMBL513174",
          "CHEMBL514074",
          "CHEMBL517730",
          "CHEMBL517962",
          "CHEMBL520262",
          "CHEMBL520573",
          "CHEMBL521582",
          "CHEMBL523716",
          "CHEMBL524005",
          "CHEMBL524439",
          "CHEMBL53",
          "CHEMBL53170",
          "CHEMBL53294",
          "CHEMBL53445",
          "CHEMBL53483",
          "CHEMBL53510",
          "CHEMBL53520",
          "CHEMBL538012",
          "CHEMBL538263",
          "CHEMBL538520",
          "CHEMBL538542",
          "CHEMBL538785",
          "CHEMBL539274",
          "CHEMBL539544",
          "CHEMBL54",
          "CHEMBL540036",
          "CHEMBL54050",
          "CHEMBL54051",
          "CHEMBL540546",
          "CHEMBL540575",
          "CHEMBL540577",
          "CHEMBL540822",
          "CHEMBL541096",
          "CHEMBL541284",
          "CHEMBL541304",
          "CHEMBL54168",
          "CHEMBL54183",
          "CHEMBL541838",
          "CHEMBL541842",
          "CHEMBL541862",
          "CHEMBL541867",
          "CHEMBL542047",
          "CHEMBL54206",
          "CHEMBL542167",
          "CHEMBL542181",
          "CHEMBL542351",
          "CHEMBL542419",
          "CHEMBL542428",
          "CHEMBL542436",
          "CHEMBL542493",
          "CHEMBL542593",
          "CHEMBL542683",
          "CHEMBL543134",
          "CHEMBL543389",
          "CHEMBL543390",
          "CHEMBL543613",
          "CHEMBL543838",
          "CHEMBL543914",
          "CHEMBL544078",
          "CHEMBL544089",
          "CHEMBL544091",
          "CHEMBL544099",
          "CHEMBL544318",
          "CHEMBL544319",
          "CHEMBL544618",
          "CHEMBL545240",
          "CHEMBL545264",
          "CHEMBL545477",
          "CHEMBL545488",
          "CHEMBL545597",
          "CHEMBL545727",
          "CHEMBL545783",
          "CHEMBL54661",
          "CHEMBL552611",
          "CHEMBL553060",
          "CHEMBL553361",
          "CHEMBL553399",
          "CHEMBL554199",
          "CHEMBL554571",
          "CHEMBL554950",
          "CHEMBL555049",
          "CHEMBL555279",
          "CHEMBL555427",
          "CHEMBL555619",
          "CHEMBL55693",
          "CHEMBL558417",
          "CHEMBL558817",
          "CHEMBL56",
          "CHEMBL56100",
          "CHEMBL56547",
          "CHEMBL56584",
          "CHEMBL566522",
          "CHEMBL566533",
          "CHEMBL56666",
          "CHEMBL56843",
          "CHEMBL57029",
          "CHEMBL571046",
          "CHEMBL57140",
          "CHEMBL572720",
          "CHEMBL573412",
          "CHEMBL574110",
          "CHEMBL574111",
          "CHEMBL574112",
          "CHEMBL574296",
          "CHEMBL574340",
          "CHEMBL574418",
          "CHEMBL574557",
          "CHEMBL574695",
          "CHEMBL57470",
          "CHEMBL57579",
          "CHEMBL57672",
          "CHEMBL57873",
          "CHEMBL57988",
          "CHEMBL58205",
          "CHEMBL58265",
          "CHEMBL582992",
          "CHEMBL583422",
          "CHEMBL58422",
          "CHEMBL587",
          "CHEMBL588",
          "CHEMBL59",
          "CHEMBL59139",
          "CHEMBL60542",
          "CHEMBL60706",
          "CHEMBL60808",
          "CHEMBL60861",
          "CHEMBL611801",
          "CHEMBL61946",
          "CHEMBL62",
          "CHEMBL62529",
          "CHEMBL63063",
          "CHEMBL63329",
          "CHEMBL63347",
          "CHEMBL63390",
          "CHEMBL63576",
          "CHEMBL63590",
          "CHEMBL63756",
          "CHEMBL64249",
          "CHEMBL6437",
          "CHEMBL64875",
          "CHEMBL65397",
          "CHEMBL654",
          "CHEMBL65768",
          "CHEMBL66730",
          "CHEMBL670",
          "CHEMBL67284",
          "CHEMBL67298",
          "CHEMBL67355",
          "CHEMBL68680",
          "CHEMBL69018",
          "CHEMBL70319",
          "CHEMBL70377",
          "CHEMBL70609",
          "CHEMBL71",
          "CHEMBL715",
          "CHEMBL71724",
          "CHEMBL71960",
          "CHEMBL72162",
          "CHEMBL72220",
          "CHEMBL72292",
          "CHEMBL72794",
          "CHEMBL73074",
          "CHEMBL73082",
          "CHEMBL73151",
          "CHEMBL73538",
          "CHEMBL73589",
          "CHEMBL73665",
          "CHEMBL76480",
          "CHEMBL80369",
          "CHEMBL80686",
          "CHEMBL80974",
          "CHEMBL81330",
          "CHEMBL82591",
          "CHEMBL82706",
          "CHEMBL82899",
          "CHEMBL83080",
          "CHEMBL83915",
          "CHEMBL84557",
          "CHEMBL84639",
          "CHEMBL84983",
          "CHEMBL85",
          "CHEMBL85409",
          "CHEMBL85552",
          "CHEMBL85689",
          "CHEMBL85879",
          "CHEMBL86325",
          "CHEMBL86576",
          "CHEMBL86669",
          "CHEMBL86931",
          "CHEMBL87026",
          "CHEMBL87172",
          "CHEMBL87321",
          "CHEMBL87458",
          "CHEMBL87717",
          "CHEMBL87734",
          "CHEMBL87897",
          "CHEMBL87910",
          "CHEMBL87943",
          "CHEMBL87958",
          "CHEMBL8809",
          "CHEMBL88870",
          "CHEMBL89738",
          "CHEMBL89934",
          "CHEMBL90977",
          "CHEMBL91310",
          "CHEMBL91453",
          "CHEMBL92145",
          "CHEMBL92560",
          "CHEMBL92673",
          "CHEMBL92784",
          "CHEMBL92896",
          "CHEMBL93240",
          "CHEMBL93428",
          "CHEMBL93972",
          "CHEMBL9429",
          "CHEMBL9434",
          "CHEMBL9452",
          "CHEMBL9467",
          "CHEMBL95098",
          "CHEMBL95112",
          "CHEMBL95175",
          "CHEMBL95636",
          "CHEMBL95688",
          "CHEMBL96618",
          "CHEMBL9666",
          "CHEMBL9669",
          "CHEMBL96781",
          "CHEMBL97242",
          "CHEMBL97251",
          "CHEMBL97268",
          "CHEMBL97333",
          "CHEMBL9746",
          "CHEMBL97773",
          "CHEMBL9841",
          "CHEMBL9870",
          "CHEMBL9921",
          "CHEMBL99361"
        ],
        "number_of_missing_values": "0"
      },
      {
        "data_type": "numeric",
        "index": "1",
        "is_ignore": "false",
        "is_row_identifier": "false",
        "is_target": "false",
        "name": "FCFP4_1024b354",
        "number_of_missing_values": "0"
      },
      {
        "data_type": "numeric",
        "index": "2",
        "is_ignore": "false",
        "is_row_identifier": "false",
        "is_target": "false",
        "name": "FCFP4_1024b746",
        "number_of_missing_values": "0"
      },
      {
        "data_type": "numeric",
        "index": "3",
        "is_ignore": "false",
        "is_row_identifier": "false",
        "is_target": "false",
        "name": "FCFP4_1024b282",
        "number_of_missing_values": "0"
      },
      {
        "data_type": "numeric",
        "index": "4",
        "is_ignore": "false",
        "is_row_identifier": "false",
        "is_target": "false",
        "name": "FCFP4_1024b937",
        "number_of_missing_values": "0"
      },
      {
        "data_type": "numeric",
        "index": "5",
        "is_ignore": "false",
        "is_row_identifier": "false",
        "is_target": "false",
        "name": "FCFP4_1024b649",
        "number_of_missing_values": "0"
      },
      {
        "data_type": "numeric",
        "index": "6",
        "is_ignore": "false",
        "is_row_identifier": "false",
        "is_target": "false",
        "name": "FCFP4_1024b319",
        "number_of_missing_values": "0"
      },
      {
        "data_type": "numeric",
        "index": "7",
        "is_ignore": "false",
        "is_row_identifier": "false",
        "is_target": "false",
        "name": "FCFP4_1024b602",
        "number_of_missing_values": "0"
      },
      {
        "data_type": "numeric",
        "index": "8",
        "is_ignore": "false",
        "is_row_identifier": "false",
        "is_target": "false",
        "name": "FCFP4_1024b57",
        "number_of_missing_values": "0"
      },
      {
        "data_type": "numeric",
        "index": "9",
        "is_ignore": "false",
        "is_row_identifier": "false",
        "is_target": "false",
        "name": "FCFP4_1024b36",
        "number_of_missing_values": "0"
      },
      {
        "data_type": "numeric",
        "index": "10",
        "is_ignore": "false",
        "is_row_identifier": "false",
        "is_target": "false",
        "name": "FCFP4_1024b33",
        "number_of_missing_values": "0"
      },
      {
        "data_type": "numeric",
        "index": "11",
        "is_ignore": "false",
        "is_row_identifier": "false",
        "is_target": "false",
        "name": "FCFP4_1024b599",
        "number_of_missing_values": "0"
      },
      {
        "data_type": "numeric",
        "index": "12",
        "is_ignore": "false",
        "is_row_identifier": "false",
        "is_target": "false",
        "name": "FCFP4_1024b135",
        "number_of_missing_values": "0"
      },
      {
        "data_type": "numeric",
        "index": "13",
        "is_ignore": "false",
        "is_row_identifier": "false",
        "is_target": "false",
        "name": "FCFP4_1024b131",
        "number_of_missing_values": "0"
      },
      {
        "data_type": "numeric",
        "index": "14",
        "is_ignore": "false",
        "is_row_identifier": "false",
        "is_target": "false",
        "name": "FCFP4_1024b85",
        "number_of_missing_values": "0"
      },
      {
        "data_type": "numeric",
        "index": "15",
        "is_ignore": "false",
        "is_row_identifier": "false",
        "is_target": "false",
        "name": "FCFP4_1024b429",
        "number_of_missing_values": "0"
      },
      {
        "data_type": "numeric",
        "index": "16",
        "is_ignore": "false",
        "is_row_identifier": "false",
        "is_target": "false",
        "name": "FCFP4_1024b92",
        "number_of_missing_values": "0"
      },
      {
        "data_type": "numeric",
        "index": "17",
        "is_ignore": "false",
        "is_row_identifier": "false",
        "is_target": "false",
        "name": "FCFP4_1024b630",
        "number_of_missing_values": "0"
      },
      {
        "data_type": "numeric",
        "index": "18",
        "is_ignore": "false",
        "is_row_identifier": "false",
        "is_target": "false",
        "name": "FCFP4_1024b171",
        "number_of_missing_values": "0"
      },
      {
        "data_type": "numeric",
        "index": "19",
        "is_ignore": "false",
        "is_row_identifier": "false",
        "is_target": "false",
        "name": "FCFP4_1024b182",
        "number_of_missing_values": "0"
      },
      {
        "data_type": "numeric",
        "index": "20",
        "is_ignore": "false",
        "is_row_identifier": "false",
        "is_target": "false",
        "name": "FCFP4_1024b682",
        "number_of_missing_values": "0"
      },
      {
        "data_type": "numeric",
        "index": "21",
        "is_ignore": "false",
        "is_row_identifier": "false",
        "is_target": "false",
        "name": "FCFP4_1024b942",
        "number_of_missing_values": "0"
      },
      {
        "data_type": "numeric",
        "index": "22",
        "is_ignore": "false",
        "is_row_identifier": "false",
        "is_target": "false",
        "name": "FCFP4_1024b913",
        "number_of_missing_values": "0"
      },
      {
        "data_type": "numeric",
        "index": "23",
        "is_ignore": "false",
        "is_row_identifier": "false",
        "is_target": "false",
        "name": "FCFP4_1024b365",
        "number_of_missing_values": "0"
      },
      {
        "data_type": "numeric",
        "index": "24",
        "is_ignore": "false",
        "is_row_identifier": "false",
        "is_target": "false",
        "name": "FCFP4_1024b2",
        "number_of_missing_values": "0"
      },
      {
        "data_type": "numeric",
        "index": "25",
        "is_ignore": "false",
        "is_row_identifier": "false",
        "is_target": "false",
        "name": "FCFP4_1024b399",
        "number_of_missing_values": "0"
      },
      {
        "data_type": "numeric",
        "index": "26",
        "is_ignore": "false",
        "is_row_identifier": "false",
        "is_target": "false",
        "name": "FCFP4_1024b669",
        "number_of_missing_values": "0"
      },
      {
        "data_type": "numeric",
        "index": "27",
        "is_ignore": "false",
        "is_row_identifier": "false",
        "is_target": "false",
        "name": "FCFP4_1024b720",
        "number_of_missing_values": "0"
      },
      {
        "data_type": "numeric",
        "index": "28",
        "is_ignore": "false",
        "is_row_identifier": "false",
        "is_target": "false",
        "name": "FCFP4_1024b139",
        "number_of_missing_values": "0"
      },
      {
        "data_type": "numeric",
        "index": "29",
        "is_ignore": "false",
        "is_row_identifier": "false",
        "is_target": "false",
        "name": "FCFP4_1024b983",
        "number_of_missing_values": "0"
      },
      {
        "data_type": "numeric",
        "index": "30",
        "is_ignore": "false",
        "is_row_identifier": "false",
        "is_target": "false",
        "name": "FCFP4_1024b943",
        "number_of_missing_values": "0"
      },
      {
        "data_type": "numeric",
        "index": "31",
        "is_ignore": "false",
        "is_row_identifier": "false",
        "is_target": "false",
        "name": "FCFP4_1024b65",
        "number_of_missing_values": "0"
      },
      {
        "data_type": "numeric",
        "index": "32",
        "is_ignore": "false",
        "is_row_identifier": "false",
        "is_target": "false",
        "name": "FCFP4_1024b817",
        "number_of_missing_values": "0"
      },
      {
        "data_type": "numeric",
        "index": "33",
        "is_ignore": "false",
        "is_row_identifier": "false",
        "is_target": "false",
        "name": "FCFP4_1024b376",
        "number_of_missing_values": "0"
      },
      {
        "data_type": "numeric",
        "index": "34",
        "is_ignore": "false",
        "is_row_identifier": "false",
        "is_target": "false",
        "name": "FCFP4_1024b395",
        "number_of_missing_values": "0"
      },
      {
        "data_type": "numeric",
        "index": "35",
        "is_ignore": "false",
        "is_row_identifier": "false",
        "is_target": "false",
        "name": "FCFP4_1024b25",
        "number_of_missing_values": "0"
      },
      {
        "data_type": "numeric",
        "index": "36",
        "is_ignore": "false",
        "is_row_identifier": "false",
        "is_target": "false",
        "name": "FCFP4_1024b75",
        "number_of_missing_values": "0"
      },
      {
        "data_type": "numeric",
        "index": "37",
        "is_ignore": "false",
        "is_row_identifier": "false",
        "is_target": "false",
        "name": "FCFP4_1024b412",
        "number_of_missing_values": "0"
      },
      {
        "data_type": "numeric",
        "index": "38",
        "is_ignore": "false",
        "is_row_identifier": "false",
        "is_target": "false",
        "name": "FCFP4_1024b704",
        "number_of_missing_values": "0"
      },
      {
        "data_type": "numeric",
        "index": "39",
        "is_ignore": "false",
        "is_row_identifier": "false",
        "is_target": "false",
        "name": "FCFP4_1024b8",
        "number_of_missing_values": "0"
      },
      {
        "data_type": "numeric",
        "index": "40",
        "is_ignore": "false",
        "is_row_identifier": "false",
        "is_target": "false",
        "name": "FCFP4_1024b589",
        "number_of_missing_values": "0"
      },
      {
        "data_type": "numeric",
        "index": "41",
        "is_ignore": "false",
        "is_row_identifier": "false",
        "is_target": "false",
        "name": "FCFP4_1024b526",
        "number_of_missing_values": "0"
      },
      {
        "data_type": "numeric",
        "index": "42",
        "is_ignore": "false",
        "is_row_identifier": "false",
        "is_target": "false",
        "name": "FCFP4_1024b199",
        "number_of_missing_values": "0"
      },
      {
        "data_type": "numeric",
        "index": "43",
        "is_ignore": "false",
        "is_row_identifier": "false",
        "is_target": "false",
        "name": "FCFP4_1024b671",
        "number_of_missing_values": "0"
      },
      {
        "data_type": "numeric",
        "index": "44",
        "is_ignore": "false",
        "is_row_identifier": "false",
        "is_target": "false",
        "name": "FCFP4_1024b888",
        "number_of_missing_values": "0"
      },
      {
        "data_type": "numeric",
        "index": "45",
        "is_ignore": "false",
        "is_row_identifier": "false",
        "is_target": "false",
        "name": "FCFP4_1024b606",
        "number_of_missing_values": "0"
      },
      {
        "data_type": "numeric",
        "index": "46",
        "is_ignore": "false",
        "is_row_identifier": "false",
        "is_target": "false",
        "name": "FCFP4_1024b738",
        "number_of_missing_values": "0"
      },
      {
        "data_type": "numeric",
        "index": "47",
        "is_ignore": "false",
        "is_row_identifier": "false",
        "is_target": "false",
        "name": "FCFP4_1024b563",
        "number_of_missing_values": "0"
      },
      {
        "data_type": "numeric",
        "index": "48",
        "is_ignore": "false",
        "is_row_identifier": "false",
        "is_target": "false",
        "name": "FCFP4_1024b553",
        "number_of_missing_values": "0"
      },
      {
        "data_type": "numeric",
        "index": "49",
        "is_ignore": "false",
        "is_row_identifier": "false",
        "is_target": "false",
        "name": "FCFP4_1024b136",
        "number_of_missing_values": "0"
      },
      {
        "data_type": "numeric",
        "index": "50",
        "is_ignore": "false",
        "is_row_identifier": "false",
        "is_target": "false",
        "name": "FCFP4_1024b560",
        "number_of_missing_values": "0"
      },
      {
        "data_type": "numeric",
        "index": "51",
        "is_ignore": "false",
        "is_row_identifier": "false",
        "is_target": "false",
        "name": "FCFP4_1024b99",
        "number_of_missing_values": "0"
      },
      {
        "data_type": "numeric",
        "index": "52",
        "is_ignore": "false",
        "is_row_identifier": "false",
        "is_target": "false",
        "name": "FCFP4_1024b925",
        "number_of_missing_values": "0"
      },
      {
        "data_type": "numeric",
        "index": "53",
        "is_ignore": "false",
        "is_row_identifier": "false",
        "is_target": "false",
        "name": "FCFP4_1024b368",
        "number_of_missing_values": "0"
      },
      {
        "data_type": "numeric",
        "index": "54",
        "is_ignore": "false",
        "is_row_identifier": "false",
        "is_target": "false",
        "name": "FCFP4_1024b760",
        "number_of_missing_values": "0"
      },
      {
        "data_type": "numeric",
        "index": "55",
        "is_ignore": "false",
        "is_row_identifier": "false",
        "is_target": "false",
        "name": "FCFP4_1024b128",
        "number_of_missing_values": "0"
      },
      {
        "data_type": "numeric",
        "index": "56",
        "is_ignore": "false",
        "is_row_identifier": "false",
        "is_target": "false",
        "name": "FCFP4_1024b539",
        "number_of_missing_values": "0"
      },
      {
        "data_type": "numeric",
        "index": "57",
        "is_ignore": "false",
        "is_row_identifier": "false",
        "is_target": "false",
        "name": "FCFP4_1024b787",
        "number_of_missing_values": "0"
      },
      {
        "data_type": "numeric",
        "index": "58",
        "is_ignore": "false",
        "is_row_identifier": "false",
        "is_target": "false",
        "name": "FCFP4_1024b435",
        "number_of_missing_values": "0"
      },
      {
        "data_type": "numeric",
        "index": "59",
        "is_ignore": "false",
        "is_row_identifier": "false",
        "is_target": "false",
        "name": "FCFP4_1024b556",
        "number_of_missing_values": "0"
      },
      {
        "data_type": "numeric",
        "index": "60",
        "is_ignore": "false",
        "is_row_identifier": "false",
        "is_target": "false",
        "name": "FCFP4_1024b986",
        "number_of_missing_values": "0"
      },
      {
        "data_type": "numeric",
        "index": "61",
        "is_ignore": "false",
        "is_row_identifier": "false",
        "is_target": "false",
        "name": "FCFP4_1024b466",
        "number_of_missing_values": "0"
      },
      {
        "data_type": "numeric",
        "index": "62",
        "is_ignore": "false",
        "is_row_identifier": "false",
        "is_target": "false",
        "name": "FCFP4_1024b162",
        "number_of_missing_values": "0"
      },
      {
        "data_type": "numeric",
        "index": "63",
        "is_ignore": "false",
        "is_row_identifier": "false",
        "is_target": "false",
        "name": "FCFP4_1024b100",
        "number_of_missing_values": "0"
      },
      {
        "data_type": "numeric",
        "index": "64",
        "is_ignore": "false",
        "is_row_identifier": "false",
        "is_target": "false",
        "name": "FCFP4_1024b1",
        "number_of_missing_values": "0"
      },
      {
        "data_type": "numeric",
        "index": "65",
        "is_ignore": "false",
        "is_row_identifier": "false",
        "is_target": "false",
        "name": "FCFP4_1024b10",
        "number_of_missing_values": "0"
      },
      {
        "data_type": "numeric",
        "index": "66",
        "is_ignore": "false",
        "is_row_identifier": "false",
        "is_target": "false",
        "name": "FCFP4_1024b1000",
        "number_of_missing_values": "0"
      },
      {
        "data_type": "numeric",
        "index": "67",
        "is_ignore": "false",
        "is_row_identifier": "false",
        "is_target": "false",
        "name": "FCFP4_1024b1001",
        "number_of_missing_values": "0"
      },
      {
        "data_type": "numeric",
        "index": "68",
        "is_ignore": "false",
        "is_row_identifier": "false",
        "is_target": "false",
        "name": "FCFP4_1024b1002",
        "number_of_missing_values": "0"
      },
      {
        "data_type": "numeric",
        "index": "69",
        "is_ignore": "false",
        "is_row_identifier": "false",
        "is_target": "false",
        "name": "FCFP4_1024b1003",
        "number_of_missing_values": "0"
      },
      {
        "data_type": "numeric",
        "index": "70",
        "is_ignore": "false",
        "is_row_identifier": "false",
        "is_target": "false",
        "name": "FCFP4_1024b1004",
        "number_of_missing_values": "0"
      },
      {
        "data_type": "numeric",
        "index": "71",
        "is_ignore": "false",
        "is_row_identifier": "false",
        "is_target": "false",
        "name": "FCFP4_1024b1005",
        "number_of_missing_values": "0"
      },
      {
        "data_type": "numeric",
        "index": "72",
        "is_ignore": "false",
        "is_row_identifier": "false",
        "is_target": "false",
        "name": "FCFP4_1024b1006",
        "number_of_missing_values": "0"
      },
      {
        "data_type": "numeric",
        "index": "73",
        "is_ignore": "false",
        "is_row_identifier": "false",
        "is_target": "false",
        "name": "FCFP4_1024b1007",
        "number_of_missing_values": "0"
      },
      {
        "data_type": "numeric",
        "index": "74",
        "is_ignore": "false",
        "is_row_identifier": "false",
        "is_target": "false",
        "name": "FCFP4_1024b1008",
        "number_of_missing_values": "0"
      },
      {
        "data_type": "numeric",
        "index": "75",
        "is_ignore": "false",
        "is_row_identifier": "false",
        "is_target": "false",
        "name": "FCFP4_1024b1009",
        "number_of_missing_values": "0"
      },
      {
        "data_type": "numeric",
        "index": "76",
        "is_ignore": "false",
        "is_row_identifier": "false",
        "is_target": "false",
        "name": "FCFP4_1024b101",
        "number_of_missing_values": "0"
      },
      {
        "data_type": "numeric",
        "index": "77",
        "is_ignore": "false",
        "is_row_identifier": "false",
        "is_target": "false",
        "name": "FCFP4_1024b1010",
        "number_of_missing_values": "0"
      },
      {
        "data_type": "numeric",
        "index": "78",
        "is_ignore": "false",
        "is_row_identifier": "false",
        "is_target": "false",
        "name": "FCFP4_1024b1011",
        "number_of_missing_values": "0"
      },
      {
        "data_type": "numeric",
        "index": "79",
        "is_ignore": "false",
        "is_row_identifier": "false",
        "is_target": "false",
        "name": "FCFP4_1024b1012",
        "number_of_missing_values": "0"
      },
      {
        "data_type": "numeric",
        "index": "80",
        "is_ignore": "false",
        "is_row_identifier": "false",
        "is_target": "false",
        "name": "FCFP4_1024b1013",
        "number_of_missing_values": "0"
      },
      {
        "data_type": "numeric",
        "index": "81",
        "is_ignore": "false",
        "is_row_identifier": "false",
        "is_target": "false",
        "name": "FCFP4_1024b1014",
        "number_of_missing_values": "0"
      },
      {
        "data_type": "numeric",
        "index": "82",
        "is_ignore": "false",
        "is_row_identifier": "false",
        "is_target": "false",
        "name": "FCFP4_1024b1015",
        "number_of_missing_values": "0"
      },
      {
        "data_type": "numeric",
        "index": "83",
        "is_ignore": "false",
        "is_row_identifier": "false",
        "is_target": "false",
        "name": "FCFP4_1024b1016",
        "number_of_missing_values": "0"
      },
      {
        "data_type": "numeric",
        "index": "84",
        "is_ignore": "false",
        "is_row_identifier": "false",
        "is_target": "false",
        "name": "FCFP4_1024b1017",
        "number_of_missing_values": "0"
      },
      {
        "data_type": "numeric",
        "index": "85",
        "is_ignore": "false",
        "is_row_identifier": "false",
        "is_target": "false",
        "name": "FCFP4_1024b1018",
        "number_of_missing_values": "0"
      },
      {
        "data_type": "numeric",
        "index": "86",
        "is_ignore": "false",
        "is_row_identifier": "false",
        "is_target": "false",
        "name": "FCFP4_1024b1019",
        "number_of_missing_values": "0"
      },
      {
        "data_type": "numeric",
        "index": "87",
        "is_ignore": "false",
        "is_row_identifier": "false",
        "is_target": "false",
        "name": "FCFP4_1024b102",
        "number_of_missing_values": "0"
      },
      {
        "data_type": "numeric",
        "index": "88",
        "is_ignore": "false",
        "is_row_identifier": "false",
        "is_target": "false",
        "name": "FCFP4_1024b1020",
        "number_of_missing_values": "0"
      },
      {
        "data_type": "numeric",
        "index": "89",
        "is_ignore": "false",
        "is_row_identifier": "false",
        "is_target": "false",
        "name": "FCFP4_1024b1021",
        "number_of_missing_values": "0"
      },
      {
        "data_type": "numeric",
        "index": "90",
        "is_ignore": "false",
        "is_row_identifier": "false",
        "is_target": "false",
        "name": "FCFP4_1024b1022",
        "number_of_missing_values": "0"
      },
      {
        "data_type": "numeric",
        "index": "91",
        "is_ignore": "false",
        "is_row_identifier": "false",
        "is_target": "false",
        "name": "FCFP4_1024b1023",
        "number_of_missing_values": "0"
      },
      {
        "data_type": "numeric",
        "index": "92",
        "is_ignore": "false",
        "is_row_identifier": "false",
        "is_target": "false",
        "name": "FCFP4_1024b1024",
        "number_of_missing_values": "0"
      },
      {
        "data_type": "numeric",
        "index": "93",
        "is_ignore": "false",
        "is_row_identifier": "false",
        "is_target": "false",
        "name": "FCFP4_1024b103",
        "number_of_missing_values": "0"
      },
      {
        "data_type": "numeric",
        "index": "94",
        "is_ignore": "false",
        "is_row_identifier": "false",
        "is_target": "false",
        "name": "FCFP4_1024b104",
        "number_of_missing_values": "0"
      },
      {
        "data_type": "numeric",
        "index": "95",
        "is_ignore": "false",
        "is_row_identifier": "false",
        "is_target": "false",
        "name": "FCFP4_1024b105",
        "number_of_missing_values": "0"
      },
      {
        "data_type": "numeric",
        "index": "96",
        "is_ignore": "false",
        "is_row_identifier": "false",
        "is_target": "false",
        "name": "FCFP4_1024b106",
        "number_of_missing_values": "0"
      },
      {
        "data_type": "numeric",
        "index": "97",
        "is_ignore": "false",
        "is_row_identifier": "false",
        "is_target": "false",
        "name": "FCFP4_1024b107",
        "number_of_missing_values": "0"
      },
      {
        "data_type": "numeric",
        "index": "98",
        "is_ignore": "false",
        "is_row_identifier": "false",
        "is_target": "false",
        "name": "FCFP4_1024b108",
        "number_of_missing_values": "0"
      },
      {
        "data_type": "numeric",
        "index": "99",
        "is_ignore": "false",
        "is_row_identifier": "false",
        "is_target": "false",
        "name": "FCFP4_1024b109",
        "number_of_missing_values": "0"
      },
      {
        "data_type": "numeric",
        "index": "100",
        "is_ignore": "false",
        "is_row_identifier": "false",
        "is_target": "false",
        "name": "FCFP4_1024b11",
        "number_of_missing_values": "0"
      },
      {
        "data_type": "numeric",
        "index": "101",
        "is_ignore": "false",
        "is_row_identifier": "false",
        "is_target": "false",
        "name": "FCFP4_1024b110",
        "number_of_missing_values": "0"
      },
      {
        "data_type": "numeric",
        "index": "102",
        "is_ignore": "false",
        "is_row_identifier": "false",
        "is_target": "false",
        "name": "FCFP4_1024b111",
        "number_of_missing_values": "0"
      },
      {
        "data_type": "numeric",
        "index": "103",
        "is_ignore": "false",
        "is_row_identifier": "false",
        "is_target": "false",
        "name": "FCFP4_1024b112",
        "number_of_missing_values": "0"
      },
      {
        "data_type": "numeric",
        "index": "104",
        "is_ignore": "false",
        "is_row_identifier": "false",
        "is_target": "false",
        "name": "FCFP4_1024b113",
        "number_of_missing_values": "0"
      },
      {
        "data_type": "numeric",
        "index": "105",
        "is_ignore": "false",
        "is_row_identifier": "false",
        "is_target": "false",
        "name": "FCFP4_1024b114",
        "number_of_missing_values": "0"
      },
      {
        "data_type": "numeric",
        "index": "106",
        "is_ignore": "false",
        "is_row_identifier": "false",
        "is_target": "false",
        "name": "FCFP4_1024b115",
        "number_of_missing_values": "0"
      },
      {
        "data_type": "numeric",
        "index": "107",
        "is_ignore": "false",
        "is_row_identifier": "false",
        "is_target": "false",
        "name": "FCFP4_1024b116",
        "number_of_missing_values": "0"
      },
      {
        "data_type": "numeric",
        "index": "108",
        "is_ignore": "false",
        "is_row_identifier": "false",
        "is_target": "false",
        "name": "FCFP4_1024b117",
        "number_of_missing_values": "0"
      },
      {
        "data_type": "numeric",
        "index": "109",
        "is_ignore": "false",
        "is_row_identifier": "false",
        "is_target": "false",
        "name": "FCFP4_1024b118",
        "number_of_missing_values": "0"
      },
      {
        "data_type": "numeric",
        "index": "110",
        "is_ignore": "false",
        "is_row_identifier": "false",
        "is_target": "false",
        "name": "FCFP4_1024b119",
        "number_of_missing_values": "0"
      },
      {
        "data_type": "numeric",
        "index": "111",
        "is_ignore": "false",
        "is_row_identifier": "false",
        "is_target": "false",
        "name": "FCFP4_1024b12",
        "number_of_missing_values": "0"
      },
      {
        "data_type": "numeric",
        "index": "112",
        "is_ignore": "false",
        "is_row_identifier": "false",
        "is_target": "false",
        "name": "FCFP4_1024b120",
        "number_of_missing_values": "0"
      },
      {
        "data_type": "numeric",
        "index": "113",
        "is_ignore": "false",
        "is_row_identifier": "false",
        "is_target": "false",
        "name": "FCFP4_1024b121",
        "number_of_missing_values": "0"
      },
      {
        "data_type": "numeric",
        "index": "114",
        "is_ignore": "false",
        "is_row_identifier": "false",
        "is_target": "false",
        "name": "FCFP4_1024b122",
        "number_of_missing_values": "0"
      },
      {
        "data_type": "numeric",
        "index": "115",
        "is_ignore": "false",
        "is_row_identifier": "false",
        "is_target": "false",
        "name": "FCFP4_1024b123",
        "number_of_missing_values": "0"
      },
      {
        "data_type": "numeric",
        "index": "116",
        "is_ignore": "false",
        "is_row_identifier": "false",
        "is_target": "false",
        "name": "FCFP4_1024b124",
        "number_of_missing_values": "0"
      },
      {
        "data_type": "numeric",
        "index": "117",
        "is_ignore": "false",
        "is_row_identifier": "false",
        "is_target": "false",
        "name": "FCFP4_1024b125",
        "number_of_missing_values": "0"
      },
      {
        "data_type": "numeric",
        "index": "118",
        "is_ignore": "false",
        "is_row_identifier": "false",
        "is_target": "false",
        "name": "FCFP4_1024b126",
        "number_of_missing_values": "0"
      },
      {
        "data_type": "numeric",
        "index": "119",
        "is_ignore": "false",
        "is_row_identifier": "false",
        "is_target": "false",
        "name": "FCFP4_1024b127",
        "number_of_missing_values": "0"
      },
      {
        "data_type": "numeric",
        "index": "120",
        "is_ignore": "false",
        "is_row_identifier": "false",
        "is_target": "false",
        "name": "FCFP4_1024b129",
        "number_of_missing_values": "0"
      },
      {
        "data_type": "numeric",
        "index": "121",
        "is_ignore": "false",
        "is_row_identifier": "false",
        "is_target": "false",
        "name": "FCFP4_1024b13",
        "number_of_missing_values": "0"
      },
      {
        "data_type": "numeric",
        "index": "122",
        "is_ignore": "false",
        "is_row_identifier": "false",
        "is_target": "false",
        "name": "FCFP4_1024b130",
        "number_of_missing_values": "0"
      },
      {
        "data_type": "numeric",
        "index": "123",
        "is_ignore": "false",
        "is_row_identifier": "false",
        "is_target": "false",
        "name": "FCFP4_1024b132",
        "number_of_missing_values": "0"
      },
      {
        "data_type": "numeric",
        "index": "124",
        "is_ignore": "false",
        "is_row_identifier": "false",
        "is_target": "false",
        "name": "FCFP4_1024b133",
        "number_of_missing_values": "0"
      },
      {
        "data_type": "numeric",
        "index": "125",
        "is_ignore": "false",
        "is_row_identifier": "false",
        "is_target": "false",
        "name": "FCFP4_1024b134",
        "number_of_missing_values": "0"
      },
      {
        "data_type": "numeric",
        "index": "126",
        "is_ignore": "false",
        "is_row_identifier": "false",
        "is_target": "false",
        "name": "FCFP4_1024b137",
        "number_of_missing_values": "0"
      },
      {
        "data_type": "numeric",
        "index": "127",
        "is_ignore": "false",
        "is_row_identifier": "false",
        "is_target": "false",
        "name": "FCFP4_1024b138",
        "number_of_missing_values": "0"
      },
      {
        "data_type": "numeric",
        "index": "128",
        "is_ignore": "false",
        "is_row_identifier": "false",
        "is_target": "false",
        "name": "FCFP4_1024b14",
        "number_of_missing_values": "0"
      },
      {
        "data_type": "numeric",
        "index": "129",
        "is_ignore": "false",
        "is_row_identifier": "false",
        "is_target": "false",
        "name": "FCFP4_1024b140",
        "number_of_missing_values": "0"
      },
      {
        "data_type": "numeric",
        "index": "130",
        "is_ignore": "false",
        "is_row_identifier": "false",
        "is_target": "false",
        "name": "FCFP4_1024b141",
        "number_of_missing_values": "0"
      },
      {
        "data_type": "numeric",
        "index": "131",
        "is_ignore": "false",
        "is_row_identifier": "false",
        "is_target": "false",
        "name": "FCFP4_1024b142",
        "number_of_missing_values": "0"
      },
      {
        "data_type": "numeric",
        "index": "132",
        "is_ignore": "false",
        "is_row_identifier": "false",
        "is_target": "false",
        "name": "FCFP4_1024b143",
        "number_of_missing_values": "0"
      },
      {
        "data_type": "numeric",
        "index": "133",
        "is_ignore": "false",
        "is_row_identifier": "false",
        "is_target": "false",
        "name": "FCFP4_1024b144",
        "number_of_missing_values": "0"
      },
      {
        "data_type": "numeric",
        "index": "134",
        "is_ignore": "false",
        "is_row_identifier": "false",
        "is_target": "false",
        "name": "FCFP4_1024b145",
        "number_of_missing_values": "0"
      },
      {
        "data_type": "numeric",
        "index": "135",
        "is_ignore": "false",
        "is_row_identifier": "false",
        "is_target": "false",
        "name": "FCFP4_1024b146",
        "number_of_missing_values": "0"
      },
      {
        "data_type": "numeric",
        "index": "136",
        "is_ignore": "false",
        "is_row_identifier": "false",
        "is_target": "false",
        "name": "FCFP4_1024b147",
        "number_of_missing_values": "0"
      },
      {
        "data_type": "numeric",
        "index": "137",
        "is_ignore": "false",
        "is_row_identifier": "false",
        "is_target": "false",
        "name": "FCFP4_1024b148",
        "number_of_missing_values": "0"
      },
      {
        "data_type": "numeric",
        "index": "138",
        "is_ignore": "false",
        "is_row_identifier": "false",
        "is_target": "false",
        "name": "FCFP4_1024b149",
        "number_of_missing_values": "0"
      },
      {
        "data_type": "numeric",
        "index": "139",
        "is_ignore": "false",
        "is_row_identifier": "false",
        "is_target": "false",
        "name": "FCFP4_1024b15",
        "number_of_missing_values": "0"
      },
      {
        "data_type": "numeric",
        "index": "140",
        "is_ignore": "false",
        "is_row_identifier": "false",
        "is_target": "false",
        "name": "FCFP4_1024b150",
        "number_of_missing_values": "0"
      },
      {
        "data_type": "numeric",
        "index": "141",
        "is_ignore": "false",
        "is_row_identifier": "false",
        "is_target": "false",
        "name": "FCFP4_1024b151",
        "number_of_missing_values": "0"
      },
      {
        "data_type": "numeric",
        "index": "142",
        "is_ignore": "false",
        "is_row_identifier": "false",
        "is_target": "false",
        "name": "FCFP4_1024b152",
        "number_of_missing_values": "0"
      },
      {
        "data_type": "numeric",
        "index": "143",
        "is_ignore": "false",
        "is_row_identifier": "false",
        "is_target": "false",
        "name": "FCFP4_1024b153",
        "number_of_missing_values": "0"
      },
      {
        "data_type": "numeric",
        "index": "144",
        "is_ignore": "false",
        "is_row_identifier": "false",
        "is_target": "false",
        "name": "FCFP4_1024b154",
        "number_of_missing_values": "0"
      },
      {
        "data_type": "numeric",
        "index": "145",
        "is_ignore": "false",
        "is_row_identifier": "false",
        "is_target": "false",
        "name": "FCFP4_1024b155",
        "number_of_missing_values": "0"
      },
      {
        "data_type": "numeric",
        "index": "146",
        "is_ignore": "false",
        "is_row_identifier": "false",
        "is_target": "false",
        "name": "FCFP4_1024b156",
        "number_of_missing_values": "0"
      },
      {
        "data_type": "numeric",
        "index": "147",
        "is_ignore": "false",
        "is_row_identifier": "false",
        "is_target": "false",
        "name": "FCFP4_1024b157",
        "number_of_missing_values": "0"
      },
      {
        "data_type": "numeric",
        "index": "148",
        "is_ignore": "false",
        "is_row_identifier": "false",
        "is_target": "false",
        "name": "FCFP4_1024b158",
        "number_of_missing_values": "0"
      },
      {
        "data_type": "numeric",
        "index": "149",
        "is_ignore": "false",
        "is_row_identifier": "false",
        "is_target": "false",
        "name": "FCFP4_1024b159",
        "number_of_missing_values": "0"
      },
      {
        "data_type": "numeric",
        "index": "150",
        "is_ignore": "false",
        "is_row_identifier": "false",
        "is_target": "false",
        "name": "FCFP4_1024b16",
        "number_of_missing_values": "0"
      },
      {
        "data_type": "numeric",
        "index": "151",
        "is_ignore": "false",
        "is_row_identifier": "false",
        "is_target": "false",
        "name": "FCFP4_1024b160",
        "number_of_missing_values": "0"
      },
      {
        "data_type": "numeric",
        "index": "152",
        "is_ignore": "false",
        "is_row_identifier": "false",
        "is_target": "false",
        "name": "FCFP4_1024b161",
        "number_of_missing_values": "0"
      },
      {
        "data_type": "numeric",
        "index": "153",
        "is_ignore": "false",
        "is_row_identifier": "false",
        "is_target": "false",
        "name": "FCFP4_1024b163",
        "number_of_missing_values": "0"
      },
      {
        "data_type": "numeric",
        "index": "154",
        "is_ignore": "false",
        "is_row_identifier": "false",
        "is_target": "false",
        "name": "FCFP4_1024b164",
        "number_of_missing_values": "0"
      },
      {
        "data_type": "numeric",
        "index": "155",
        "is_ignore": "false",
        "is_row_identifier": "false",
        "is_target": "true",
        "name": "pXC50",
        "number_of_missing_values": "0"
      }
    ]
  }
}