"molecule_id","FCFP4_1024b639","FCFP4_1024b899","FCFP4_1024b392","FCFP4_1024b555","FCFP4_1024b1015","FCFP4_1024b412","FCFP4_1024b685","FCFP4_1024b128","FCFP4_1024b850","FCFP4_1024b888","FCFP4_1024b420","FCFP4_1024b611","FCFP4_1024b253","FCFP4_1024b290","FCFP4_1024b330","FCFP4_1024b354","FCFP4_1024b68","FCFP4_1024b790","FCFP4_1024b855","FCFP4_1024b769","FCFP4_1024b264","FCFP4_1024b872","FCFP4_1024b369","FCFP4_1024b607","FCFP4_1024b1","FCFP4_1024b10","FCFP4_1024b100","FCFP4_1024b1000","FCFP4_1024b1001","FCFP4_1024b1002","FCFP4_1024b1003","FCFP4_1024b1004","FCFP4_1024b1005","FCFP4_1024b1006","FCFP4_1024b1007","FCFP4_1024b1008","FCFP4_1024b1009","FCFP4_1024b101","FCFP4_1024b1010","FCFP4_1024b1011","FCFP4_1024b1012","FCFP4_1024b1013","FCFP4_1024b1014","FCFP4_1024b1016","FCFP4_1024b1017","FCFP4_1024b1018","FCFP4_1024b1019","FCFP4_1024b102","FCFP4_1024b1020","FCFP4_1024b1021","FCFP4_1024b1022","pXC50"
{25 1,52 4.155}
{0 CHEMBL107316,2 1,8 1,25 1,26 1,52 8.481}
{0 CHEMBL107504,11 1,12 1,25 1,48 1,52 7.444}
{0 CHEMBL107516,11 1,12 1,25 1,49 1,52 8.62}
{0 CHEMBL107931,25 1,49 1,52 5.585}
{0 CHEMBL108143,1 1,21 1,25 1,46 1,49 1,52 5.143}
{0 CHEMBL108313,25 1,47 1,49 1,52 8.523}
{0 CHEMBL108434,22 1,25 1,49 1,52 7.745}
{0 CHEMBL108696,25 1,47 1,49 1,52 8.523}
{0 CHEMBL108726,2 1,8 1,25 1,26 1,52 7.757}
{0 CHEMBL108749,25 1,47 1,49 1,52 8.292}
{0 CHEMBL108872,7 1,11 1,12 1,25 1,27 1,52 6.131}
{0 CHEMBL109105,11 1,12 1,25 1,48 1,52 7.854}
{0 CHEMBL109152,25 1,47 1,49 1,52 4.824}
{0 CHEMBL117651,11 1,12 1,25 1,28 1,46 1,49 1,52 10.114}
{0 CHEMBL118539,25 1,52 8.622}
{0 CHEMBL1203984,2 1,3 1,4 1,7 1,9 1,10 1,11 1,12 1,20 1,22 1,25 1,52 7.558}
{0 CHEMBL1203985,3 1,4 1,7 1,9 1,10 1,11 1,12 1,20 1,22 1,25 1,52 7.754}
{0 CHEMBL1203986,3 1,4 1,7 1,9 1,10 1,11 1,12 1,20 1,22 1,25 1,52 8.066}
{0 CHEMBL137039,6 1,21 1,24 1,25 1,26 1,45 1,52 5.407}
{0 CHEMBL145957,20 1,25 1,52 8.056}
{0 CHEMBL145973,6 1,25 1,52 8.431}
{0 CHEMBL146205,25 1,52 8.09}
{0 CHEMBL146254,6 1,21 1,23 1,24 1,25 1,26 1,52 4.754}
{0 CHEMBL146494,20 1,25 1,52 8.072}
{0 CHEMBL146674,25 1,52 8.762}
{0 CHEMBL147334,25 1,49 1,52 8.717}
{0 CHEMBL147380,25 1,46 1,52 8.64}
{0 CHEMBL147699,25 1,52 8.357}
{0 CHEMBL148369,25 1,52 8.936}
{0 CHEMBL148484,25 1,52 8.202}
{0 CHEMBL148522,25 1,26 1,52 8.947}
{0 CHEMBL148530,25 1,46 1,52 8.9}
{0 CHEMBL148531,20 1,25 1,52 8.327}
{0 CHEMBL148907,6 1,25 1,52 8.754}
{0 CHEMBL148939,25 1,49 1,52 8.161}
{0 CHEMBL150001,20 1,25 1,52 8.072}
{0 CHEMBL150054,20 1,25 1,52 8.088}
{0 CHEMBL150104,25 1,52 8.821}
{0 CHEMBL150123,20 1,25 1,52 8.272}
{0 CHEMBL152361,6 1,25 1,52 5.155}
{0 CHEMBL153934,6 1,25 1,52 5.439}
{0 CHEMBL157336,6 1,25 1,52 5.613}
{0 CHEMBL157429,6 1,25 1,52 5.469}
{0 CHEMBL1678,2 1,8 1,25 1,26 1,52 8.244}
{0 CHEMBL208599,25 1,35 1,43 1,49 1,52 9.886}
{0 CHEMBL2093912,2 1,8 1,25 1,26 1,52 8.098}
{0 CHEMBL216159,2 1,3 1,4 1,5 1,7 1,8 1,9 1,10 1,11 1,12 1,20 1,22 1,25 1,52 7.764}
{0 CHEMBL219063,2 1,3 1,4 1,5 1,7 1,8 1,9 1,10 1,11 1,12 1,20 1,22 1,25 1,52 7.58}
{0 CHEMBL219262,2 1,3 1,4 1,5 1,7 1,8 1,10 1,11 1,12 1,25 1,52 7.676}
{0 CHEMBL219264,2 1,3 1,4 1,5 1,7 1,8 1,9 1,10 1,11 1,12 1,22 1,25 1,52 7.4}
{0 CHEMBL219316,2 1,3 1,4 1,5 1,7 1,8 1,9 1,10 1,11 1,12 1,22 1,25 1,52 6.991}
{0 CHEMBL219550,2 1,3 1,4 1,5 1,7 1,8 1,9 1,10 1,11 1,12 1,20 1,22 1,25 1,52 7.742}
{0 CHEMBL219569,2 1,3 1,4 1,5 1,7 1,8 1,9 1,10 1,11 1,12 1,20 1,22 1,25 1,52 7.599}
{0 CHEMBL219911,2 1,3 1,4 1,5 1,7 1,8 1,9 1,10 1,11 1,12 1,22 1,25 1,52 7.397}
{0 CHEMBL220141,2 1,3 1,4 1,5 1,7 1,8 1,9 1,10 1,11 1,12 1,22 1,25 1,52 7.162}
{0 CHEMBL232590,25 1,47 1,52 4.005}
{0 CHEMBL235548,6 1,24 1,25 1,26 1,52 6.35}
{0 CHEMBL235565,25 1,47 1,52 6.553}
{0 CHEMBL237870,6 1,24 1,25 1,52 6.314}
{0 CHEMBL238062,6 1,25 1,26 1,52 8.699}
{0 CHEMBL238063,6 1,25 1,26 1,52 8.699}
{0 CHEMBL241536,6 1,24 1,25 1,26 1,52 6.429}
{0 CHEMBL245079,25 1,52 6.476}
{0 CHEMBL266045,2 1,3 1,4 1,5 1,7 1,8 1,9 1,10 1,11 1,12 1,20 1,22 1,25 1,52 7.305}
{0 CHEMBL293410,52 8.521}
{0 CHEMBL296834,25 1,39 1,52 7.034}
{0 CHEMBL315634,25 1,47 1,52 9.409}
{0 CHEMBL321926,25 1,49 1,52 5.585}
{0 CHEMBL322727,25 1,47 1,52 6.444}
{0 CHEMBL322791,1 1,21 1,25 1,46 1,49 1,52 4.854}
{0 CHEMBL322994,11 1,12 1,25 1,27 1,52 7.921}
{0 CHEMBL323772,25 1,49 1,52 5.699}
{0 CHEMBL325142,25 1,49 1,52 5.721}
{0 CHEMBL325766,25 1,47 1,49 1,52 4.959}
{0 CHEMBL335133,6 1,21 1,23 1,24 1,25 1,26 1,38 1,52 5.402}
{0 CHEMBL338975,6 1,25 1,26 1,52 7.672}
{0 CHEMBL342537,25 1,52 9}
{0 CHEMBL342564,25 1,26 1,52 8.936}
{0 CHEMBL343054,6 1,21 1,23 1,24 1,25 1,26 1,52 4.213}
{0 CHEMBL343365,6 1,21 1,23 1,24 1,25 1,26 1,52 4.107}
{0 CHEMBL343780,6 1,21 1,23 1,24 1,25 1,26 1,45 1,52 5.209}
{0 CHEMBL344593,6 1,21 1,23 1,24 1,25 1,26 1,52 5.294}
{0 CHEMBL345124,20 1,25 1,49 1,52 5.428}
{0 CHEMBL356328,25 1,52 8.535}
{0 CHEMBL356969,25 1,52 8.417}
{0 CHEMBL356982,25 1,52 8.684}
{0 CHEMBL357451,20 1,25 1,52 8.224}
{0 CHEMBL357551,6 1,25 1,52 5.13}
{0 CHEMBL359415,6 1,21 1,23 1,24 1,25 1,26 1,52 4.296}
{0 CHEMBL360055,2 1,5 1,25 1,52 4.824}
{0 CHEMBL374981,2 1,3 1,4 1,5 1,7 1,8 1,9 1,10 1,20 1,22 1,25 1,52 8.223}
{0 CHEMBL376514,25 1,26 1,52 4.46}
{0 CHEMBL384886,2 1,3 1,4 1,5 1,7 1,8 1,9 1,10 1,11 1,12 1,22 1,25 1,52 6.801}
{0 CHEMBL385269,2 1,3 1,4 1,5 1,7 1,8 1,9 1,10 1,11 1,12 1,20 1,25 1,52 6.788}
{0 CHEMBL391918,6 1,24 1,25 1,26 1,52 5.554}
{0 CHEMBL393212,6 1,24 1,25 1,26 1,52 6.625}
{0 CHEMBL393621,6 1,24 1,25 1,26 1,52 6.415}
{0 CHEMBL394901,25 1,47 1,52 6.721}
{0 CHEMBL395280,25 1,52 6.757}
{0 CHEMBL396190,6 1,24 1,25 1,26 1,52 6.14}
{0 CHEMBL396941,25 1,47 1,52 5.305}
{0 CHEMBL409854,6 1,21 1,23 1,24 1,25 1,26 1,52 4.808}
{0 CHEMBL419926,25 1,47 1,49 1,52 8.42}
{0 CHEMBL421974,6 1,25 1,52 5.678}
{0 CHEMBL422098,6 1,21 1,23 1,24 1,25 1,26 1,52 4.1}
{0 CHEMBL424100,6 1,23 1,24 1,25 1,26 1,52 4.971}
{0 CHEMBL434378,2 1,3 1,4 1,5 1,7 1,8 1,9 1,10 1,11 1,12 1,20 1,22 1,25 1,52 7.254}
{0 CHEMBL439814,25 1,52 8.291}
{0 CHEMBL441433,6 1,25 1,29 1,39 1,52 6.592}
{0 CHEMBL445846,2 1,3 1,4 1,5 1,7 1,8 1,9 1,10 1,11 1,12 1,25 1,52 7.397}
{0 CHEMBL481,25 1,26 1,36 1,52 7.578}
{0 CHEMBL483090,25 1,52 8.62}
{0 CHEMBL490866,2 1,8 1,22 1,25 1,50 1,52 8.398}
{0 CHEMBL502,2 1,8 1,25 1,26 1,52 7.62}
{0 CHEMBL519154,25 1,52 7.796}
{0 CHEMBL519475,6 1,25 1,50 1,52 5.291}
{0 CHEMBL525622,25 1,52 10.824}
{0 CHEMBL52722,6 1,25 1,39 1,46 1,52 7.476}
{0 CHEMBL537388,1 1,13 1,14 1,15 1,16 1,17 1,18 1,19 1,25 1,26 1,52 4.456}
{0 CHEMBL538098,1 1,13 1,14 1,15 1,16 1,17 1,18 1,19 1,25 1,26 1,52 4.149}
{0 CHEMBL538296,2 1,8 1,25 1,26 1,52 7.268}
{0 CHEMBL538358,20 1,25 1,49 1,52 7.672}
{0 CHEMBL538602,6 1,25 1,50 1,52 5.29}
{0 CHEMBL539062,1 1,13 1,14 1,15 1,16 1,17 1,18 1,19 1,25 1,26 1,52 4.187}
{0 CHEMBL539319,1 1,13 1,14 1,15 1,16 1,17 1,18 1,19 1,25 1,26 1,52 4.208}
{0 CHEMBL539623,6 1,25 1,50 1,52 5.394}
{0 CHEMBL539624,6 1,25 1,50 1,52 5.291}
{0 CHEMBL539625,6 1,25 1,47 1,50 1,52 5.067}
{0 CHEMBL53968,25 1,39 1,52 6.447}
{0 CHEMBL539873,6 1,25 1,50 1,52 5.009}
{0 CHEMBL539874,6 1,25 1,50 1,52 5.759}
{0 CHEMBL539875,6 1,25 1,50 1,52 5.074}
{0 CHEMBL540131,3 1,4 1,7 1,9 1,10 1,11 1,12 1,20 1,22 1,25 1,35 1,52 6.896}
{0 CHEMBL540132,3 1,4 1,7 1,9 1,10 1,11 1,12 1,20 1,22 1,25 1,35 1,52 6.521}
{0 CHEMBL540657,11 1,12 1,25 1,46 1,49 1,52 9.143}
{0 CHEMBL541350,1 1,13 1,14 1,15 1,16 1,17 1,18 1,19 1,25 1,26 1,52 4.824}
{0 CHEMBL541613,1 1,13 1,14 1,15 1,16 1,17 1,18 1,19 1,25 1,26 1,52 4.081}
{0 CHEMBL541663,6 1,25 1,50 1,52 5.324}
{0 CHEMBL543711,1 1,13 1,14 1,15 1,16 1,17 1,18 1,19 1,25 1,26 1,52 5}
{0 CHEMBL545126,1 1,13 1,14 1,15 1,16 1,17 1,18 1,19 1,25 1,26 1,52 4.959}
{0 CHEMBL545317,2 1,8 1,25 1,26 1,52 7.569}
{0 CHEMBL545585,1 1,13 1,14 1,15 1,16 1,17 1,18 1,19 1,25 1,26 1,52 4.886}
{0 CHEMBL545587,1 1,13 1,14 1,15 1,16 1,17 1,18 1,19 1,25 1,26 1,52 6.921}
{0 CHEMBL553187,1 1,13 1,14 1,15 1,16 1,17 1,18 1,19 1,25 1,26 1,52 6.131}
{0 CHEMBL554861,1 1,13 1,14 1,15 1,16 1,17 1,18 1,19 1,25 1,26 1,52 5.252}
{0 CHEMBL555247,2 1,3 1,4 1,7 1,9 1,10 1,11 1,12 1,20 1,22 1,25 1,35 1,52 6.476}
{0 CHEMBL556603,6 1,25 1,50 1,52 5.119}
{0 CHEMBL557422,24 1,25 1,52 7.041}
{0 CHEMBL558409,6 1,25 1,50 1,52 5.077}
{0 CHEMBL593933,8 1,25 1,52 10.351}
{0 CHEMBL594186,25 1,52 6.099}
{0 CHEMBL594187,25 1,52 8.788}
{0 CHEMBL594870,8 1,25 1,47 1,52 10.609}
{0 CHEMBL595114,25 1,52 8.742}
{0 CHEMBL595115,6 1,25 1,47 1,52 7.633}
{0 CHEMBL596236,25 1,26 1,47 1,52 10.385}
{0 CHEMBL596457,25 1,52 7.74}
{0 CHEMBL604478,8 1,10 1,25 1,47 1,52 8.174}
{0 CHEMBL605303,10 1,25 1,47 1,52 9.075}
{0 CHEMBL606348,8 1,25 1,47 1,52 10.699}
{0 CHEMBL606372,6 1,25 1,52 9.917}
{0 CHEMBL606538,25 1,26 1,47 1,52 7.857}
{0 CHEMBL659,2 1,8 1,25 1,26 1,52 6.245}
{0 CHEMBL86546,25 1,47 1,52 9.409}
{0 CHEMBL86868,25 1,47 1,52 8.62}
{0 CHEMBL94,6 1,25 1,26 1,52 7.337}
{0 CHEMBL95,11 1,12 1,25 1,49 1,52 7.398}
