{
  "data_features": {
    "feature": [
      {
        "data_type": "nominal",
        "index": "0",
        "is_ignore": "false",
        "is_row_identifier": "true",
        "is_target": "false",
        "name": "molecule_id",
        "nominal_value": [
          "CHEMBL1077119",
          "CHEMBL1077121",
          "CHEMBL1077122",
          "CHEMBL1077126",
          "CHEMBL1082723",
          "CHEMBL1086786",
          "CHEMBL1088484",
          "CHEMBL1089686",
          "CHEMBL1089687",
          "CHEMBL1090016",
          "CHEMBL1090017",
          "CHEMBL1090031",
          "CHEMBL1090032",
          "CHEMBL1090048",
          "CHEMBL1090049",
          "CHEMBL1090373",
          "CHEMBL1090405",
          "CHEMBL1090701",
          "CHEMBL1090702",
          "CHEMBL1090703",
          "CHEMBL1091062",
          "CHEMBL1091447",
          "CHEMBL1091448",
          "CHEMBL1091451",
          "CHEMBL1091807",
          "CHEMBL1092099",
          "CHEMBL1092142",
          "CHEMBL1092165",
          "CHEMBL1092166",
          "CHEMBL1092794",
          "CHEMBL1093070",
          "CHEMBL1093071",
          "CHEMBL1093094",
          "CHEMBL1093347",
          "CHEMBL1094023",
          "CHEMBL114535",
          "CHEMBL1203921",
          "CHEMBL1221434",
          "CHEMBL1223618",
          "CHEMBL1223619",
          "CHEMBL1223620",
          "CHEMBL1223621",
          "CHEMBL1223684",
          "CHEMBL1223685",
          "CHEMBL1223686",
          "CHEMBL1223687",
          "CHEMBL1224653",
          "CHEMBL1224717",
          "CHEMBL1224718",
          "CHEMBL1224719",
          "CHEMBL1224720",
          "CHEMBL1224721",
          "CHEMBL1255597",
          "CHEMBL1255772",
          "CHEMBL1257188",
          "CHEMBL1257189",
          "CHEMBL1257421",
          "CHEMBL1257422",
          "CHEMBL1257536",
          "CHEMBL1257537",
          "CHEMBL1257654",
          "CHEMBL1257655",
          "CHEMBL1257778",
          "CHEMBL1258123",
          "CHEMBL1258124",
          "CHEMBL1258470",
          "CHEMBL1258806",
          "CHEMBL1258807",
          "CHEMBL1258921",
          "CHEMBL1258922",
          "CHEMBL158286",
          "CHEMBL161115",
          "CHEMBL161465",
          "CHEMBL161602",
          "CHEMBL161714",
          "CHEMBL161740",
          "CHEMBL162188",
          "CHEMBL1641615",
          "CHEMBL1642568",
          "CHEMBL1779382",
          "CHEMBL178099",
          "CHEMBL1782286",
          "CHEMBL1782288",
          "CHEMBL1782289",
          "CHEMBL1782290",
          "CHEMBL1782291",
          "CHEMBL1782292",
          "CHEMBL1782293",
          "CHEMBL1782294",
          "CHEMBL1782295",
          "CHEMBL1782296",
          "CHEMBL1782297",
          "CHEMBL1782298",
          "CHEMBL1782299",
          "CHEMBL1782300",
          "CHEMBL1782301",
          "CHEMBL1782302",
          "CHEMBL1782303",
          "CHEMBL1782304",
          "CHEMBL1782305",
          "CHEMBL1782306",
          "CHEMBL1782307",
          "CHEMBL1782308",
          "CHEMBL1784107",
          "CHEMBL1784108",
          "CHEMBL1784109",
          "CHEMBL1784110",
          "CHEMBL1784114",
          "CHEMBL1784116",
          "CHEMBL1784117",
          "CHEMBL1784118",
          "CHEMBL178460",
          "CHEMBL178712",
          "CHEMBL178801",
          "CHEMBL179321",
          "CHEMBL179868",
          "CHEMBL180015",
          "CHEMBL1801067",
          "CHEMBL1801068",
          "CHEMBL1801069",
          "CHEMBL1801070",
          "CHEMBL1801071",
          "CHEMBL1801151",
          "CHEMBL1801152",
          "CHEMBL1801153",
          "CHEMBL1801154",
          "CHEMBL1801155",
          "CHEMBL1801156",
          "CHEMBL1801157",
          "CHEMBL1801158",
          "CHEMBL1801159",
          "CHEMBL1801160",
          "CHEMBL1801161",
          "CHEMBL182227",
          "CHEMBL182294",
          "CHEMBL182536",
          "CHEMBL182574",
          "CHEMBL182617",
          "CHEMBL182681",
          "CHEMBL182703",
          "CHEMBL182788",
          "CHEMBL1828652",
          "CHEMBL1830635",
          "CHEMBL1830636",
          "CHEMBL1830638",
          "CHEMBL1830640",
          "CHEMBL1830641",
          "CHEMBL1830642",
          "CHEMBL1830643",
          "CHEMBL1830644",
          "CHEMBL1830645",
          "CHEMBL1830646",
          "CHEMBL1830647",
          "CHEMBL1830790",
          "CHEMBL183119",
          "CHEMBL183280",
          "CHEMBL183465",
          "CHEMBL183816",
          "CHEMBL183952",
          "CHEMBL183965",
          "CHEMBL184013",
          "CHEMBL184016",
          "CHEMBL184017",
          "CHEMBL184057",
          "CHEMBL184089",
          "CHEMBL184154",
          "CHEMBL184279",
          "CHEMBL184334",
          "CHEMBL184470",
          "CHEMBL184701",
          "CHEMBL184806",
          "CHEMBL184829",
          "CHEMBL184837",
          "CHEMBL184861",
          "CHEMBL184903",
          "CHEMBL184945",
          "CHEMBL184960",
          "CHEMBL184979",
          "CHEMBL185108",
          "CHEMBL185144",
          "CHEMBL185203",
          "CHEMBL185208",
          "CHEMBL185275",
          "CHEMBL185296",
          "CHEMBL185304",
          "CHEMBL185370",
          "CHEMBL185439",
          "CHEMBL185446",
          "CHEMBL185502",
          "CHEMBL185523",
          "CHEMBL185588",
          "CHEMBL185604",
          "CHEMBL186615",
          "CHEMBL186868",
          "CHEMBL18701",
          "CHEMBL187201",
          "CHEMBL192",
          "CHEMBL1922942",
          "CHEMBL1922946",
          "CHEMBL1923060",
          "CHEMBL1923066",
          "CHEMBL193240",
          "CHEMBL19449",
          "CHEMBL196969",
          "CHEMBL197386",
          "CHEMBL197392",
          "CHEMBL197494",
          "CHEMBL198432",
          "CHEMBL198464",
          "CHEMBL198527",
          "CHEMBL198564",
          "CHEMBL198674",
          "CHEMBL198722",
          "CHEMBL198732",
          "CHEMBL198853",
          "CHEMBL199015",
          "CHEMBL200906",
          "CHEMBL2012219",
          "CHEMBL2018876",
          "CHEMBL2041596",
          "CHEMBL204449",
          "CHEMBL204522",
          "CHEMBL206592",
          "CHEMBL206968",
          "CHEMBL207424",
          "CHEMBL207559",
          "CHEMBL207775",
          "CHEMBL207996",
          "CHEMBL208100",
          "CHEMBL208149",
          "CHEMBL208236",
          "CHEMBL208382",
          "CHEMBL209295",
          "CHEMBL210840",
          "CHEMBL2171421",
          "CHEMBL2171423",
          "CHEMBL2171452",
          "CHEMBL2172366",
          "CHEMBL2172367",
          "CHEMBL2172368",
          "CHEMBL2172369",
          "CHEMBL2172370",
          "CHEMBL2172371",
          "CHEMBL2172372",
          "CHEMBL2172373",
          "CHEMBL2172374",
          "CHEMBL2172375",
          "CHEMBL2172376",
          "CHEMBL2172707",
          "CHEMBL2172710",
          "CHEMBL2172731",
          "CHEMBL2172734",
          "CHEMBL2178115",
          "CHEMBL217899",
          "CHEMBL218103",
          "CHEMBL218653",
          "CHEMBL218793",
          "CHEMBL218990",
          "CHEMBL2206212",
          "CHEMBL2206213",
          "CHEMBL2206214",
          "CHEMBL2206215",
          "CHEMBL2206216",
          "CHEMBL2206217",
          "CHEMBL2206218",
          "CHEMBL2206219",
          "CHEMBL2206220",
          "CHEMBL2206221",
          "CHEMBL2206222",
          "CHEMBL2206223",
          "CHEMBL2206224",
          "CHEMBL2206225",
          "CHEMBL2206226",
          "CHEMBL226630",
          "CHEMBL2315588",
          "CHEMBL2315591",
          "CHEMBL2315889",
          "CHEMBL2315896",
          "CHEMBL251785",
          "CHEMBL252387",
          "CHEMBL253083",
          "CHEMBL263311",
          "CHEMBL28079",
          "CHEMBL296435",
          "CHEMBL298000",
          "CHEMBL307646",
          "CHEMBL313041",
          "CHEMBL313842",
          "CHEMBL318444",
          "CHEMBL319809",
          "CHEMBL32442",
          "CHEMBL330641",
          "CHEMBL345360",
          "CHEMBL345812",
          "CHEMBL351500",
          "CHEMBL351613",
          "CHEMBL351900",
          "CHEMBL351915",
          "CHEMBL359562",
          "CHEMBL359890",
          "CHEMBL360285",
          "CHEMBL360434",
          "CHEMBL360481",
          "CHEMBL360527",
          "CHEMBL360627",
          "CHEMBL360770",
          "CHEMBL360874",
          "CHEMBL360932",
          "CHEMBL361104",
          "CHEMBL361201",
          "CHEMBL361469",
          "CHEMBL361512",
          "CHEMBL361706",
          "CHEMBL362033",
          "CHEMBL362175",
          "CHEMBL362264",
          "CHEMBL362652",
          "CHEMBL363084",
          "CHEMBL363097",
          "CHEMBL363118",
          "CHEMBL363236",
          "CHEMBL363658",
          "CHEMBL363673",
          "CHEMBL363709",
          "CHEMBL364200",
          "CHEMBL365447",
          "CHEMBL365634",
          "CHEMBL365659",
          "CHEMBL366149",
          "CHEMBL367135",
          "CHEMBL367846",
          "CHEMBL368696",
          "CHEMBL368739",
          "CHEMBL369134",
          "CHEMBL369541",
          "CHEMBL370220",
          "CHEMBL371037",
          "CHEMBL371089",
          "CHEMBL372575",
          "CHEMBL377709",
          "CHEMBL378681",
          "CHEMBL379768",
          "CHEMBL380321",
          "CHEMBL380933",
          "CHEMBL381681",
          "CHEMBL382168",
          "CHEMBL382545",
          "CHEMBL383225",
          "CHEMBL383762",
          "CHEMBL383837",
          "CHEMBL418785",
          "CHEMBL420454",
          "CHEMBL420999",
          "CHEMBL42126",
          "CHEMBL427505",
          "CHEMBL427513",
          "CHEMBL430893",
          "CHEMBL431806",
          "CHEMBL433757",
          "CHEMBL433761",
          "CHEMBL433774",
          "CHEMBL434332",
          "CHEMBL440593",
          "CHEMBL440878",
          "CHEMBL44109",
          "CHEMBL443679",
          "CHEMBL444808",
          "CHEMBL445832",
          "CHEMBL446547",
          "CHEMBL447757",
          "CHEMBL45055",
          "CHEMBL451369",
          "CHEMBL451500",
          "CHEMBL454507",
          "CHEMBL455962",
          "CHEMBL456170",
          "CHEMBL456327",
          "CHEMBL456366",
          "CHEMBL456367",
          "CHEMBL456368",
          "CHEMBL456573",
          "CHEMBL456574",
          "CHEMBL456590",
          "CHEMBL456591",
          "CHEMBL456617",
          "CHEMBL456618",
          "CHEMBL456826",
          "CHEMBL457215",
          "CHEMBL457216",
          "CHEMBL457217",
          "CHEMBL457431",
          "CHEMBL457662",
          "CHEMBL457663",
          "CHEMBL458296",
          "CHEMBL458297",
          "CHEMBL458298",
          "CHEMBL45834",
          "CHEMBL45854",
          "CHEMBL458931",
          "CHEMBL458932",
          "CHEMBL458933",
          "CHEMBL460188",
          "CHEMBL462448",
          "CHEMBL462517",
          "CHEMBL462518",
          "CHEMBL463431",
          "CHEMBL465123",
          "CHEMBL466068",
          "CHEMBL466280",
          "CHEMBL466481",
          "CHEMBL47113",
          "CHEMBL47683",
          "CHEMBL480988",
          "CHEMBL485629",
          "CHEMBL486068",
          "CHEMBL499461",
          "CHEMBL500181",
          "CHEMBL505431",
          "CHEMBL507064",
          "CHEMBL508134",
          "CHEMBL509969",
          "CHEMBL511115",
          "CHEMBL511686",
          "CHEMBL512578",
          "CHEMBL513099",
          "CHEMBL514277",
          "CHEMBL516301",
          "CHEMBL517124",
          "CHEMBL537889",
          "CHEMBL549560",
          "CHEMBL564209",
          "CHEMBL565565",
          "CHEMBL565768",
          "CHEMBL567470",
          "CHEMBL568003",
          "CHEMBL568004",
          "CHEMBL568465",
          "CHEMBL569624",
          "CHEMBL570355",
          "CHEMBL570803",
          "CHEMBL572161",
          "CHEMBL572177",
          "CHEMBL572539",
          "CHEMBL576436",
          "CHEMBL576656",
          "CHEMBL578985",
          "CHEMBL579190",
          "CHEMBL583841",
          "CHEMBL584684",
          "CHEMBL584893",
          "CHEMBL589514",
          "CHEMBL591501",
          "CHEMBL592931",
          "CHEMBL592942",
          "CHEMBL593656",
          "CHEMBL593877",
          "CHEMBL594108",
          "CHEMBL594109",
          "CHEMBL595038",
          "CHEMBL595039",
          "CHEMBL595064",
          "CHEMBL595272",
          "CHEMBL595959",
          "CHEMBL596394",
          "CHEMBL596447",
          "CHEMBL596696",
          "CHEMBL597071",
          "CHEMBL597072",
          "CHEMBL597078",
          "CHEMBL597718",
          "CHEMBL598049",
          "CHEMBL598085",
          "CHEMBL598086",
          "CHEMBL598116",
          "CHEMBL598318",
          "CHEMBL598500",
          "CHEMBL598654",
          "CHEMBL598670",
          "CHEMBL598671",
          "CHEMBL598719",
          "CHEMBL598745",
          "CHEMBL598906",
          "CHEMBL598907",
          "CHEMBL598909",
          "CHEMBL598946",
          "CHEMBL599109",
          "CHEMBL599326",
          "CHEMBL599327",
          "CHEMBL599525",
          "CHEMBL599526",
          "CHEMBL600468",
          "CHEMBL600791",
          "CHEMBL600989",
          "CHEMBL600990",
          "CHEMBL602046",
          "CHEMBL602666",
          "CHEMBL603070",
          "CHEMBL603071",
          "CHEMBL603194",
          "CHEMBL603230",
          "CHEMBL603626",
          "CHEMBL603892",
          "CHEMBL604107",
          "CHEMBL604519",
          "CHEMBL604721",
          "CHEMBL604731",
          "CHEMBL604930",
          "CHEMBL604940",
          "CHEMBL605096",
          "CHEMBL605146",
          "CHEMBL605340",
          "CHEMBL605355",
          "CHEMBL605362",
          "CHEMBL605935",
          "CHEMBL606171",
          "CHEMBL606214",
          "CHEMBL606386",
          "CHEMBL608268",
          "CHEMBL63",
          "CHEMBL74078",
          "CHEMBL77826",
          "CHEMBL90375",
          "CHEMBL91551",
          "CHEMBL91571",
          "CHEMBL95715",
          "CHEMBL95979",
          "CHEMBL96034",
          "CHEMBL96039",
          "CHEMBL97213",
          "CHEMBL97214",
          "CHEMBL97785",
          "CHEMBL97817",
          "CHEMBL97866",
          "CHEMBL98662",
          "CHEMBL98730",
          "CHEMBL99101",
          "CHEMBL99470"
        ],
        "number_of_missing_values": "0"
      },
      {
        "data_type": "numeric",
        "index": "1",
        "is_ignore": "false",
        "is_row_identifier": "false",
        "is_target": "false",
        "name": "nCsp2",
        "number_of_missing_values": "0"
      },
      {
        "data_type": "numeric",
        "index": "2",
        "is_ignore": "false",
        "is_row_identifier": "false",
        "is_target": "false",
        "name": "Mi",
        "number_of_missing_values": "0"
      },
      {
        "data_type": "numeric",
        "index": "3",
        "is_ignore": "false",
        "is_row_identifier": "false",
        "is_target": "false",
        "name": "nSK",
        "number_of_missing_values": "0"
      },
      {
        "data_type": "numeric",
        "index": "4",
        "is_ignore": "false",
        "is_row_identifier": "false",
        "is_target": "false",
        "name": "nAB",
        "number_of_missing_values": "0"
      },
      {
        "data_type": "numeric",
        "index": "5",
        "is_ignore": "false",
        "is_row_identifier": "false",
        "is_target": "false",
        "name": "nBT",
        "number_of_missing_values": "0"
      },
      {
        "data_type": "numeric",
        "index": "6",
        "is_ignore": "false",
        "is_row_identifier": "false",
        "is_target": "false",
        "name": "Si",
        "number_of_missing_values": "0"
      },
      {
        "data_type": "numeric",
        "index": "7",
        "is_ignore": "false",
        "is_row_identifier": "false",
        "is_target": "false",
        "name": "Sv",
        "number_of_missing_values": "0"
      },
      {
        "data_type": "numeric",
        "index": "8",
        "is_ignore": "false",
        "is_row_identifier": "false",
        "is_target": "false",
        "name": "nAT",
        "number_of_missing_values": "0"
      },
      {
        "data_type": "numeric",
        "index": "9",
        "is_ignore": "false",
        "is_row_identifier": "false",
        "is_target": "false",
        "name": "MW",
        "number_of_missing_values": "0"
      },
      {
        "data_type": "numeric",
        "index": "10",
        "is_ignore": "false",
        "is_row_identifier": "false",
        "is_target": "false",
        "name": "nDB",
        "number_of_missing_values": "0"
      },
      {
        "data_type": "numeric",
        "index": "11",
        "is_ignore": "false",
        "is_row_identifier": "false",
        "is_target": "false",
        "name": "C.",
        "number_of_missing_values": "0"
      },
      {
        "data_type": "numeric",
        "index": "12",
        "is_ignore": "false",
        "is_row_identifier": "false",
        "is_target": "false",
        "name": "SCBO",
        "number_of_missing_values": "0"
      },
      {
        "data_type": "numeric",
        "index": "13",
        "is_ignore": "false",
        "is_row_identifier": "false",
        "is_target": "false",
        "name": "nO",
        "number_of_missing_values": "0"
      },
      {
        "data_type": "numeric",
        "index": "14",
        "is_ignore": "false",
        "is_row_identifier": "false",
        "is_target": "true",
        "name": "pXC50",
        "number_of_missing_values": "0"
      }
    ]
  }
}