{
  "data_features": {
    "feature": [
      {
        "data_type": "nominal",
        "index": "0",
        "is_ignore": "false",
        "is_row_identifier": "true",
        "is_target": "false",
        "name": "molecule_id",
        "nominal_value": [
          "CHEMBL551052",
          "CHEMBL551250",
          "CHEMBL565305",
          "CHEMBL565306",
          "CHEMBL565308",
          "CHEMBL565331",
          "CHEMBL565518",
          "CHEMBL566367",
          "CHEMBL566375",
          "CHEMBL566596",
          "CHEMBL566598",
          "CHEMBL566797",
          "CHEMBL566819",
          "CHEMBL566820",
          "CHEMBL567016",
          "CHEMBL567229",
          "CHEMBL567251",
          "CHEMBL567252",
          "CHEMBL567255",
          "CHEMBL567445",
          "CHEMBL567446",
          "CHEMBL567447",
          "CHEMBL567469",
          "CHEMBL567470",
          "CHEMBL567471",
          "CHEMBL568839",
          "CHEMBL569045",
          "CHEMBL569264",
          "CHEMBL569265",
          "CHEMBL569481",
          "CHEMBL569491",
          "CHEMBL569492",
          "CHEMBL571469",
          "CHEMBL571693",
          "CHEMBL571912",
          "CHEMBL571913",
          "CHEMBL579669",
          "CHEMBL583835",
          "CHEMBL583854",
          "CHEMBL584056",
          "CHEMBL584270",
          "CHEMBL584285",
          "CHEMBL584317",
          "CHEMBL585015",
          "CHEMBL585327",
          "CHEMBL585352",
          "CHEMBL585918"
        ],
        "number_of_missing_values": "0"
      },
      {
        "data_type": "numeric",
        "index": "1",
        "is_ignore": "false",
        "is_row_identifier": "false",
        "is_target": "false",
        "name": "ATSC5s",
        "number_of_missing_values": "0"
      },
      {
        "data_type": "numeric",
        "index": "2",
        "is_ignore": "false",
        "is_row_identifier": "false",
        "is_target": "false",
        "name": "P_VSA_MR_6",
        "number_of_missing_values": "0"
      },
      {
        "data_type": "numeric",
        "index": "3",
        "is_ignore": "false",
        "is_row_identifier": "false",
        "is_target": "false",
        "name": "AAC",
        "number_of_missing_values": "0"
      },
      {
        "data_type": "numeric",
        "index": "4",
        "is_ignore": "false",
        "is_row_identifier": "false",
        "is_target": "false",
        "name": "AECC",
        "number_of_missing_values": "0"
      },
      {
        "data_type": "numeric",
        "index": "5",
        "is_ignore": "false",
        "is_row_identifier": "false",
        "is_target": "false",
        "name": "ALOGP",
        "number_of_missing_values": "0"
      },
      {
        "data_type": "numeric",
        "index": "6",
        "is_ignore": "false",
        "is_row_identifier": "false",
        "is_target": "false",
        "name": "ALOGP2",
        "number_of_missing_values": "0"
      },
      {
        "data_type": "numeric",
        "index": "7",
        "is_ignore": "false",
        "is_row_identifier": "false",
        "is_target": "false",
        "name": "AMR",
        "number_of_missing_values": "0"
      },
      {
        "data_type": "numeric",
        "index": "8",
        "is_ignore": "false",
        "is_row_identifier": "false",
        "is_target": "false",
        "name": "AMW",
        "number_of_missing_values": "0"
      },
      {
        "data_type": "numeric",
        "index": "9",
        "is_ignore": "false",
        "is_row_identifier": "false",
        "is_target": "false",
        "name": "ARR",
        "number_of_missing_values": "0"
      },
      {
        "data_type": "numeric",
        "index": "10",
        "is_ignore": "false",
        "is_row_identifier": "false",
        "is_target": "false",
        "name": "ATS1e",
        "number_of_missing_values": "0"
      },
      {
        "data_type": "numeric",
        "index": "11",
        "is_ignore": "false",
        "is_row_identifier": "false",
        "is_target": "false",
        "name": "ATS1i",
        "number_of_missing_values": "0"
      },
      {
        "data_type": "numeric",
        "index": "12",
        "is_ignore": "false",
        "is_row_identifier": "false",
        "is_target": "false",
        "name": "ATS1m",
        "number_of_missing_values": "0"
      },
      {
        "data_type": "numeric",
        "index": "13",
        "is_ignore": "false",
        "is_row_identifier": "false",
        "is_target": "false",
        "name": "ATS1p",
        "number_of_missing_values": "0"
      },
      {
        "data_type": "numeric",
        "index": "14",
        "is_ignore": "false",
        "is_row_identifier": "false",
        "is_target": "false",
        "name": "ATS1s",
        "number_of_missing_values": "0"
      },
      {
        "data_type": "numeric",
        "index": "15",
        "is_ignore": "false",
        "is_row_identifier": "false",
        "is_target": "false",
        "name": "ATS1v",
        "number_of_missing_values": "0"
      },
      {
        "data_type": "numeric",
        "index": "16",
        "is_ignore": "false",
        "is_row_identifier": "false",
        "is_target": "false",
        "name": "ATS2e",
        "number_of_missing_values": "0"
      },
      {
        "data_type": "numeric",
        "index": "17",
        "is_ignore": "false",
        "is_row_identifier": "false",
        "is_target": "false",
        "name": "ATS2i",
        "number_of_missing_values": "0"
      },
      {
        "data_type": "numeric",
        "index": "18",
        "is_ignore": "false",
        "is_row_identifier": "false",
        "is_target": "false",
        "name": "ATS2m",
        "number_of_missing_values": "0"
      },
      {
        "data_type": "numeric",
        "index": "19",
        "is_ignore": "false",
        "is_row_identifier": "false",
        "is_target": "false",
        "name": "ATS2p",
        "number_of_missing_values": "0"
      },
      {
        "data_type": "numeric",
        "index": "20",
        "is_ignore": "false",
        "is_row_identifier": "false",
        "is_target": "false",
        "name": "ATS2s",
        "number_of_missing_values": "0"
      },
      {
        "data_type": "numeric",
        "index": "21",
        "is_ignore": "false",
        "is_row_identifier": "false",
        "is_target": "false",
        "name": "ATS2v",
        "number_of_missing_values": "0"
      },
      {
        "data_type": "numeric",
        "index": "22",
        "is_ignore": "false",
        "is_row_identifier": "false",
        "is_target": "false",
        "name": "ATS3e",
        "number_of_missing_values": "0"
      },
      {
        "data_type": "numeric",
        "index": "23",
        "is_ignore": "false",
        "is_row_identifier": "false",
        "is_target": "false",
        "name": "ATS3i",
        "number_of_missing_values": "0"
      },
      {
        "data_type": "numeric",
        "index": "24",
        "is_ignore": "false",
        "is_row_identifier": "false",
        "is_target": "false",
        "name": "ATS3m",
        "number_of_missing_values": "0"
      },
      {
        "data_type": "numeric",
        "index": "25",
        "is_ignore": "false",
        "is_row_identifier": "false",
        "is_target": "false",
        "name": "ATS3p",
        "number_of_missing_values": "0"
      },
      {
        "data_type": "numeric",
        "index": "26",
        "is_ignore": "false",
        "is_row_identifier": "false",
        "is_target": "false",
        "name": "ATS3s",
        "number_of_missing_values": "0"
      },
      {
        "data_type": "numeric",
        "index": "27",
        "is_ignore": "false",
        "is_row_identifier": "false",
        "is_target": "false",
        "name": "ATS3v",
        "number_of_missing_values": "0"
      },
      {
        "data_type": "numeric",
        "index": "28",
        "is_ignore": "false",
        "is_row_identifier": "false",
        "is_target": "false",
        "name": "ATS4e",
        "number_of_missing_values": "0"
      },
      {
        "data_type": "numeric",
        "index": "29",
        "is_ignore": "false",
        "is_row_identifier": "false",
        "is_target": "false",
        "name": "ATS4i",
        "number_of_missing_values": "0"
      },
      {
        "data_type": "numeric",
        "index": "30",
        "is_ignore": "false",
        "is_row_identifier": "false",
        "is_target": "false",
        "name": "ATS4m",
        "number_of_missing_values": "0"
      },
      {
        "data_type": "numeric",
        "index": "31",
        "is_ignore": "false",
        "is_row_identifier": "false",
        "is_target": "false",
        "name": "ATS4p",
        "number_of_missing_values": "0"
      },
      {
        "data_type": "numeric",
        "index": "32",
        "is_ignore": "false",
        "is_row_identifier": "false",
        "is_target": "false",
        "name": "ATS4s",
        "number_of_missing_values": "0"
      },
      {
        "data_type": "numeric",
        "index": "33",
        "is_ignore": "false",
        "is_row_identifier": "false",
        "is_target": "false",
        "name": "ATS4v",
        "number_of_missing_values": "0"
      },
      {
        "data_type": "numeric",
        "index": "34",
        "is_ignore": "false",
        "is_row_identifier": "false",
        "is_target": "false",
        "name": "ATS5e",
        "number_of_missing_values": "0"
      },
      {
        "data_type": "numeric",
        "index": "35",
        "is_ignore": "false",
        "is_row_identifier": "false",
        "is_target": "false",
        "name": "ATS5i",
        "number_of_missing_values": "0"
      },
      {
        "data_type": "numeric",
        "index": "36",
        "is_ignore": "false",
        "is_row_identifier": "false",
        "is_target": "false",
        "name": "ATS5m",
        "number_of_missing_values": "0"
      },
      {
        "data_type": "numeric",
        "index": "37",
        "is_ignore": "false",
        "is_row_identifier": "false",
        "is_target": "false",
        "name": "ATS5p",
        "number_of_missing_values": "0"
      },
      {
        "data_type": "numeric",
        "index": "38",
        "is_ignore": "false",
        "is_row_identifier": "false",
        "is_target": "false",
        "name": "ATS5s",
        "number_of_missing_values": "0"
      },
      {
        "data_type": "numeric",
        "index": "39",
        "is_ignore": "false",
        "is_row_identifier": "false",
        "is_target": "false",
        "name": "ATS5v",
        "number_of_missing_values": "0"
      },
      {
        "data_type": "numeric",
        "index": "40",
        "is_ignore": "false",
        "is_row_identifier": "false",
        "is_target": "false",
        "name": "ATS6e",
        "number_of_missing_values": "0"
      },
      {
        "data_type": "numeric",
        "index": "41",
        "is_ignore": "false",
        "is_row_identifier": "false",
        "is_target": "false",
        "name": "ATS6i",
        "number_of_missing_values": "0"
      },
      {
        "data_type": "numeric",
        "index": "42",
        "is_ignore": "false",
        "is_row_identifier": "false",
        "is_target": "false",
        "name": "ATS6m",
        "number_of_missing_values": "0"
      },
      {
        "data_type": "numeric",
        "index": "43",
        "is_ignore": "false",
        "is_row_identifier": "false",
        "is_target": "false",
        "name": "ATS6p",
        "number_of_missing_values": "0"
      },
      {
        "data_type": "numeric",
        "index": "44",
        "is_ignore": "false",
        "is_row_identifier": "false",
        "is_target": "false",
        "name": "ATS6s",
        "number_of_missing_values": "0"
      },
      {
        "data_type": "numeric",
        "index": "45",
        "is_ignore": "false",
        "is_row_identifier": "false",
        "is_target": "false",
        "name": "ATS6v",
        "number_of_missing_values": "0"
      },
      {
        "data_type": "numeric",
        "index": "46",
        "is_ignore": "false",
        "is_row_identifier": "false",
        "is_target": "false",
        "name": "ATS7e",
        "number_of_missing_values": "0"
      },
      {
        "data_type": "numeric",
        "index": "47",
        "is_ignore": "false",
        "is_row_identifier": "false",
        "is_target": "false",
        "name": "ATS7i",
        "number_of_missing_values": "0"
      },
      {
        "data_type": "numeric",
        "index": "48",
        "is_ignore": "false",
        "is_row_identifier": "false",
        "is_target": "false",
        "name": "ATS7m",
        "number_of_missing_values": "0"
      },
      {
        "data_type": "numeric",
        "index": "49",
        "is_ignore": "false",
        "is_row_identifier": "false",
        "is_target": "false",
        "name": "ATS7p",
        "number_of_missing_values": "0"
      },
      {
        "data_type": "numeric",
        "index": "50",
        "is_ignore": "false",
        "is_row_identifier": "false",
        "is_target": "false",
        "name": "ATS7s",
        "number_of_missing_values": "0"
      },
      {
        "data_type": "numeric",
        "index": "51",
        "is_ignore": "false",
        "is_row_identifier": "false",
        "is_target": "false",
        "name": "ATS7v",
        "number_of_missing_values": "0"
      },
      {
        "data_type": "numeric",
        "index": "52",
        "is_ignore": "false",
        "is_row_identifier": "false",
        "is_target": "false",
        "name": "ATS8e",
        "number_of_missing_values": "0"
      },
      {
        "data_type": "numeric",
        "index": "53",
        "is_ignore": "false",
        "is_row_identifier": "false",
        "is_target": "false",
        "name": "ATS8i",
        "number_of_missing_values": "0"
      },
      {
        "data_type": "numeric",
        "index": "54",
        "is_ignore": "false",
        "is_row_identifier": "false",
        "is_target": "false",
        "name": "ATS8m",
        "number_of_missing_values": "0"
      },
      {
        "data_type": "numeric",
        "index": "55",
        "is_ignore": "false",
        "is_row_identifier": "false",
        "is_target": "false",
        "name": "ATS8p",
        "number_of_missing_values": "0"
      },
      {
        "data_type": "numeric",
        "index": "56",
        "is_ignore": "false",
        "is_row_identifier": "false",
        "is_target": "false",
        "name": "ATS8s",
        "number_of_missing_values": "0"
      },
      {
        "data_type": "numeric",
        "index": "57",
        "is_ignore": "false",
        "is_row_identifier": "false",
        "is_target": "false",
        "name": "ATS8v",
        "number_of_missing_values": "0"
      },
      {
        "data_type": "numeric",
        "index": "58",
        "is_ignore": "false",
        "is_row_identifier": "false",
        "is_target": "false",
        "name": "ATSC1e",
        "number_of_missing_values": "0"
      },
      {
        "data_type": "numeric",
        "index": "59",
        "is_ignore": "false",
        "is_row_identifier": "false",
        "is_target": "false",
        "name": "ATSC1i",
        "number_of_missing_values": "0"
      },
      {
        "data_type": "numeric",
        "index": "60",
        "is_ignore": "false",
        "is_row_identifier": "false",
        "is_target": "false",
        "name": "ATSC1m",
        "number_of_missing_values": "0"
      },
      {
        "data_type": "numeric",
        "index": "61",
        "is_ignore": "false",
        "is_row_identifier": "false",
        "is_target": "false",
        "name": "ATSC1p",
        "number_of_missing_values": "0"
      },
      {
        "data_type": "numeric",
        "index": "62",
        "is_ignore": "false",
        "is_row_identifier": "false",
        "is_target": "false",
        "name": "ATSC1s",
        "number_of_missing_values": "0"
      },
      {
        "data_type": "numeric",
        "index": "63",
        "is_ignore": "false",
        "is_row_identifier": "false",
        "is_target": "false",
        "name": "ATSC1v",
        "number_of_missing_values": "0"
      },
      {
        "data_type": "numeric",
        "index": "64",
        "is_ignore": "false",
        "is_row_identifier": "false",
        "is_target": "false",
        "name": "ATSC2e",
        "number_of_missing_values": "0"
      },
      {
        "data_type": "numeric",
        "index": "65",
        "is_ignore": "false",
        "is_row_identifier": "false",
        "is_target": "false",
        "name": "ATSC2i",
        "number_of_missing_values": "0"
      },
      {
        "data_type": "numeric",
        "index": "66",
        "is_ignore": "false",
        "is_row_identifier": "false",
        "is_target": "false",
        "name": "ATSC2m",
        "number_of_missing_values": "0"
      },
      {
        "data_type": "numeric",
        "index": "67",
        "is_ignore": "false",
        "is_row_identifier": "false",
        "is_target": "false",
        "name": "ATSC2p",
        "number_of_missing_values": "0"
      },
      {
        "data_type": "numeric",
        "index": "68",
        "is_ignore": "false",
        "is_row_identifier": "false",
        "is_target": "false",
        "name": "ATSC2s",
        "number_of_missing_values": "0"
      },
      {
        "data_type": "numeric",
        "index": "69",
        "is_ignore": "false",
        "is_row_identifier": "false",
        "is_target": "false",
        "name": "ATSC2v",
        "number_of_missing_values": "0"
      },
      {
        "data_type": "numeric",
        "index": "70",
        "is_ignore": "false",
        "is_row_identifier": "false",
        "is_target": "false",
        "name": "ATSC3e",
        "number_of_missing_values": "0"
      },
      {
        "data_type": "numeric",
        "index": "71",
        "is_ignore": "false",
        "is_row_identifier": "false",
        "is_target": "false",
        "name": "ATSC3i",
        "number_of_missing_values": "0"
      },
      {
        "data_type": "numeric",
        "index": "72",
        "is_ignore": "false",
        "is_row_identifier": "false",
        "is_target": "false",
        "name": "ATSC3m",
        "number_of_missing_values": "0"
      },
      {
        "data_type": "numeric",
        "index": "73",
        "is_ignore": "false",
        "is_row_identifier": "false",
        "is_target": "false",
        "name": "ATSC3p",
        "number_of_missing_values": "0"
      },
      {
        "data_type": "numeric",
        "index": "74",
        "is_ignore": "false",
        "is_row_identifier": "false",
        "is_target": "false",
        "name": "ATSC3s",
        "number_of_missing_values": "0"
      },
      {
        "data_type": "numeric",
        "index": "75",
        "is_ignore": "false",
        "is_row_identifier": "false",
        "is_target": "false",
        "name": "ATSC3v",
        "number_of_missing_values": "0"
      },
      {
        "data_type": "numeric",
        "index": "76",
        "is_ignore": "false",
        "is_row_identifier": "false",
        "is_target": "false",
        "name": "ATSC4e",
        "number_of_missing_values": "0"
      },
      {
        "data_type": "numeric",
        "index": "77",
        "is_ignore": "false",
        "is_row_identifier": "false",
        "is_target": "false",
        "name": "ATSC4i",
        "number_of_missing_values": "0"
      },
      {
        "data_type": "numeric",
        "index": "78",
        "is_ignore": "false",
        "is_row_identifier": "false",
        "is_target": "false",
        "name": "ATSC4m",
        "number_of_missing_values": "0"
      },
      {
        "data_type": "numeric",
        "index": "79",
        "is_ignore": "false",
        "is_row_identifier": "false",
        "is_target": "false",
        "name": "ATSC4p",
        "number_of_missing_values": "0"
      },
      {
        "data_type": "numeric",
        "index": "80",
        "is_ignore": "false",
        "is_row_identifier": "false",
        "is_target": "false",
        "name": "ATSC4s",
        "number_of_missing_values": "0"
      },
      {
        "data_type": "numeric",
        "index": "81",
        "is_ignore": "false",
        "is_row_identifier": "false",
        "is_target": "false",
        "name": "ATSC4v",
        "number_of_missing_values": "0"
      },
      {
        "data_type": "numeric",
        "index": "82",
        "is_ignore": "false",
        "is_row_identifier": "false",
        "is_target": "false",
        "name": "ATSC5e",
        "number_of_missing_values": "0"
      },
      {
        "data_type": "numeric",
        "index": "83",
        "is_ignore": "false",
        "is_row_identifier": "false",
        "is_target": "false",
        "name": "ATSC5i",
        "number_of_missing_values": "0"
      },
      {
        "data_type": "numeric",
        "index": "84",
        "is_ignore": "false",
        "is_row_identifier": "false",
        "is_target": "false",
        "name": "ATSC5m",
        "number_of_missing_values": "0"
      },
      {
        "data_type": "numeric",
        "index": "85",
        "is_ignore": "false",
        "is_row_identifier": "false",
        "is_target": "false",
        "name": "ATSC5p",
        "number_of_missing_values": "0"
      },
      {
        "data_type": "numeric",
        "index": "86",
        "is_ignore": "false",
        "is_row_identifier": "false",
        "is_target": "false",
        "name": "ATSC5v",
        "number_of_missing_values": "0"
      },
      {
        "data_type": "numeric",
        "index": "87",
        "is_ignore": "false",
        "is_row_identifier": "false",
        "is_target": "false",
        "name": "ATSC6e",
        "number_of_missing_values": "0"
      },
      {
        "data_type": "numeric",
        "index": "88",
        "is_ignore": "false",
        "is_row_identifier": "false",
        "is_target": "false",
        "name": "ATSC6i",
        "number_of_missing_values": "0"
      },
      {
        "data_type": "numeric",
        "index": "89",
        "is_ignore": "false",
        "is_row_identifier": "false",
        "is_target": "false",
        "name": "ATSC6m",
        "number_of_missing_values": "0"
      },
      {
        "data_type": "numeric",
        "index": "90",
        "is_ignore": "false",
        "is_row_identifier": "false",
        "is_target": "false",
        "name": "ATSC6p",
        "number_of_missing_values": "0"
      },
      {
        "data_type": "numeric",
        "index": "91",
        "is_ignore": "false",
        "is_row_identifier": "false",
        "is_target": "false",
        "name": "ATSC6s",
        "number_of_missing_values": "0"
      },
      {
        "data_type": "numeric",
        "index": "92",
        "is_ignore": "false",
        "is_row_identifier": "false",
        "is_target": "false",
        "name": "ATSC6v",
        "number_of_missing_values": "0"
      },
      {
        "data_type": "numeric",
        "index": "93",
        "is_ignore": "false",
        "is_row_identifier": "false",
        "is_target": "false",
        "name": "ATSC7e",
        "number_of_missing_values": "0"
      },
      {
        "data_type": "numeric",
        "index": "94",
        "is_ignore": "false",
        "is_row_identifier": "false",
        "is_target": "false",
        "name": "ATSC7i",
        "number_of_missing_values": "0"
      },
      {
        "data_type": "numeric",
        "index": "95",
        "is_ignore": "false",
        "is_row_identifier": "false",
        "is_target": "false",
        "name": "ATSC7m",
        "number_of_missing_values": "0"
      },
      {
        "data_type": "numeric",
        "index": "96",
        "is_ignore": "false",
        "is_row_identifier": "false",
        "is_target": "false",
        "name": "ATSC7p",
        "number_of_missing_values": "0"
      },
      {
        "data_type": "numeric",
        "index": "97",
        "is_ignore": "false",
        "is_row_identifier": "false",
        "is_target": "false",
        "name": "ATSC7s",
        "number_of_missing_values": "0"
      },
      {
        "data_type": "numeric",
        "index": "98",
        "is_ignore": "false",
        "is_row_identifier": "false",
        "is_target": "false",
        "name": "ATSC7v",
        "number_of_missing_values": "0"
      },
      {
        "data_type": "numeric",
        "index": "99",
        "is_ignore": "false",
        "is_row_identifier": "false",
        "is_target": "false",
        "name": "ATSC8e",
        "number_of_missing_values": "0"
      },
      {
        "data_type": "numeric",
        "index": "100",
        "is_ignore": "false",
        "is_row_identifier": "false",
        "is_target": "false",
        "name": "ATSC8i",
        "number_of_missing_values": "0"
      },
      {
        "data_type": "numeric",
        "index": "101",
        "is_ignore": "false",
        "is_row_identifier": "false",
        "is_target": "false",
        "name": "ATSC8m",
        "number_of_missing_values": "0"
      },
      {
        "data_type": "numeric",
        "index": "102",
        "is_ignore": "false",
        "is_row_identifier": "false",
        "is_target": "false",
        "name": "ATSC8p",
        "number_of_missing_values": "0"
      },
      {
        "data_type": "numeric",
        "index": "103",
        "is_ignore": "false",
        "is_row_identifier": "false",
        "is_target": "false",
        "name": "ATSC8s",
        "number_of_missing_values": "0"
      },
      {
        "data_type": "numeric",
        "index": "104",
        "is_ignore": "false",
        "is_row_identifier": "false",
        "is_target": "false",
        "name": "ATSC8v",
        "number_of_missing_values": "0"
      },
      {
        "data_type": "numeric",
        "index": "105",
        "is_ignore": "false",
        "is_row_identifier": "false",
        "is_target": "false",
        "name": "BAC",
        "number_of_missing_values": "0"
      },
      {
        "data_type": "numeric",
        "index": "106",
        "is_ignore": "false",
        "is_row_identifier": "false",
        "is_target": "false",
        "name": "BBI",
        "number_of_missing_values": "0"
      },
      {
        "data_type": "numeric",
        "index": "107",
        "is_ignore": "false",
        "is_row_identifier": "false",
        "is_target": "false",
        "name": "BIC0",
        "number_of_missing_values": "0"
      },
      {
        "data_type": "numeric",
        "index": "108",
        "is_ignore": "false",
        "is_row_identifier": "false",
        "is_target": "false",
        "name": "BIC1",
        "number_of_missing_values": "0"
      },
      {
        "data_type": "numeric",
        "index": "109",
        "is_ignore": "false",
        "is_row_identifier": "false",
        "is_target": "false",
        "name": "BIC2",
        "number_of_missing_values": "0"
      },
      {
        "data_type": "numeric",
        "index": "110",
        "is_ignore": "false",
        "is_row_identifier": "false",
        "is_target": "false",
        "name": "BIC3",
        "number_of_missing_values": "0"
      },
      {
        "data_type": "numeric",
        "index": "111",
        "is_ignore": "false",
        "is_row_identifier": "false",
        "is_target": "false",
        "name": "BIC4",
        "number_of_missing_values": "0"
      },
      {
        "data_type": "numeric",
        "index": "112",
        "is_ignore": "false",
        "is_row_identifier": "false",
        "is_target": "false",
        "name": "BIC5",
        "number_of_missing_values": "0"
      },
      {
        "data_type": "numeric",
        "index": "113",
        "is_ignore": "false",
        "is_row_identifier": "false",
        "is_target": "false",
        "name": "BID",
        "number_of_missing_values": "0"
      },
      {
        "data_type": "numeric",
        "index": "114",
        "is_ignore": "false",
        "is_row_identifier": "false",
        "is_target": "false",
        "name": "BLI",
        "number_of_missing_values": "0"
      },
      {
        "data_type": "numeric",
        "index": "115",
        "is_ignore": "false",
        "is_row_identifier": "false",
        "is_target": "false",
        "name": "BLTA96",
        "number_of_missing_values": "0"
      },
      {
        "data_type": "numeric",
        "index": "116",
        "is_ignore": "false",
        "is_row_identifier": "false",
        "is_target": "false",
        "name": "BLTD48",
        "number_of_missing_values": "0"
      },
      {
        "data_type": "numeric",
        "index": "117",
        "is_ignore": "false",
        "is_row_identifier": "false",
        "is_target": "false",
        "name": "BLTF96",
        "number_of_missing_values": "0"
      },
      {
        "data_type": "numeric",
        "index": "118",
        "is_ignore": "false",
        "is_row_identifier": "false",
        "is_target": "false",
        "name": "C.",
        "number_of_missing_values": "0"
      },
      {
        "data_type": "numeric",
        "index": "119",
        "is_ignore": "false",
        "is_row_identifier": "false",
        "is_target": "false",
        "name": "C.001",
        "number_of_missing_values": "0"
      },
      {
        "data_type": "numeric",
        "index": "120",
        "is_ignore": "false",
        "is_row_identifier": "false",
        "is_target": "false",
        "name": "C.002",
        "number_of_missing_values": "0"
      },
      {
        "data_type": "numeric",
        "index": "121",
        "is_ignore": "false",
        "is_row_identifier": "false",
        "is_target": "false",
        "name": "C.003",
        "number_of_missing_values": "0"
      },
      {
        "data_type": "numeric",
        "index": "122",
        "is_ignore": "false",
        "is_row_identifier": "false",
        "is_target": "false",
        "name": "C.005",
        "number_of_missing_values": "0"
      },
      {
        "data_type": "numeric",
        "index": "123",
        "is_ignore": "false",
        "is_row_identifier": "false",
        "is_target": "false",
        "name": "C.006",
        "number_of_missing_values": "0"
      },
      {
        "data_type": "numeric",
        "index": "124",
        "is_ignore": "false",
        "is_row_identifier": "false",
        "is_target": "false",
        "name": "C.008",
        "number_of_missing_values": "0"
      },
      {
        "data_type": "numeric",
        "index": "125",
        "is_ignore": "false",
        "is_row_identifier": "false",
        "is_target": "false",
        "name": "C.024",
        "number_of_missing_values": "0"
      },
      {
        "data_type": "numeric",
        "index": "126",
        "is_ignore": "false",
        "is_row_identifier": "false",
        "is_target": "false",
        "name": "C.025",
        "number_of_missing_values": "0"
      },
      {
        "data_type": "numeric",
        "index": "127",
        "is_ignore": "false",
        "is_row_identifier": "false",
        "is_target": "false",
        "name": "C.026",
        "number_of_missing_values": "0"
      },
      {
        "data_type": "numeric",
        "index": "128",
        "is_ignore": "false",
        "is_row_identifier": "false",
        "is_target": "false",
        "name": "C.027",
        "number_of_missing_values": "0"
      },
      {
        "data_type": "numeric",
        "index": "129",
        "is_ignore": "false",
        "is_row_identifier": "false",
        "is_target": "false",
        "name": "C.028",
        "number_of_missing_values": "0"
      },
      {
        "data_type": "numeric",
        "index": "130",
        "is_ignore": "false",
        "is_row_identifier": "false",
        "is_target": "false",
        "name": "C.029",
        "number_of_missing_values": "0"
      },
      {
        "data_type": "numeric",
        "index": "131",
        "is_ignore": "false",
        "is_row_identifier": "false",
        "is_target": "false",
        "name": "C.040",
        "number_of_missing_values": "0"
      },
      {
        "data_type": "numeric",
        "index": "132",
        "is_ignore": "false",
        "is_row_identifier": "false",
        "is_target": "false",
        "name": "CATS2D_00_DD",
        "number_of_missing_values": "0"
      },
      {
        "data_type": "numeric",
        "index": "133",
        "is_ignore": "false",
        "is_row_identifier": "false",
        "is_target": "false",
        "name": "CATS2D_00_DP",
        "number_of_missing_values": "0"
      },
      {
        "data_type": "numeric",
        "index": "134",
        "is_ignore": "false",
        "is_row_identifier": "false",
        "is_target": "false",
        "name": "CATS2D_00_PP",
        "number_of_missing_values": "0"
      },
      {
        "data_type": "numeric",
        "index": "135",
        "is_ignore": "false",
        "is_row_identifier": "false",
        "is_target": "false",
        "name": "CATS2D_01_AN",
        "number_of_missing_values": "0"
      },
      {
        "data_type": "numeric",
        "index": "136",
        "is_ignore": "false",
        "is_row_identifier": "false",
        "is_target": "false",
        "name": "CATS2D_01_DN",
        "number_of_missing_values": "0"
      },
      {
        "data_type": "numeric",
        "index": "137",
        "is_ignore": "false",
        "is_row_identifier": "false",
        "is_target": "false",
        "name": "CATS2D_01_LL",
        "number_of_missing_values": "0"
      },
      {
        "data_type": "numeric",
        "index": "138",
        "is_ignore": "false",
        "is_row_identifier": "false",
        "is_target": "false",
        "name": "CATS2D_02_AA",
        "number_of_missing_values": "0"
      },
      {
        "data_type": "numeric",
        "index": "139",
        "is_ignore": "false",
        "is_row_identifier": "false",
        "is_target": "false",
        "name": "CATS2D_02_AL",
        "number_of_missing_values": "0"
      },
      {
        "data_type": "numeric",
        "index": "140",
        "is_ignore": "false",
        "is_row_identifier": "false",
        "is_target": "false",
        "name": "CATS2D_02_AP",
        "number_of_missing_values": "0"
      },
      {
        "data_type": "numeric",
        "index": "141",
        "is_ignore": "false",
        "is_row_identifier": "false",
        "is_target": "false",
        "name": "CATS2D_02_DA",
        "number_of_missing_values": "0"
      },
      {
        "data_type": "numeric",
        "index": "142",
        "is_ignore": "false",
        "is_row_identifier": "false",
        "is_target": "false",
        "name": "CATS2D_02_DL",
        "number_of_missing_values": "0"
      },
      {
        "data_type": "numeric",
        "index": "143",
        "is_ignore": "false",
        "is_row_identifier": "false",
        "is_target": "false",
        "name": "CATS2D_02_DN",
        "number_of_missing_values": "0"
      },
      {
        "data_type": "numeric",
        "index": "144",
        "is_ignore": "false",
        "is_row_identifier": "false",
        "is_target": "false",
        "name": "CATS2D_02_LL",
        "number_of_missing_values": "0"
      },
      {
        "data_type": "numeric",
        "index": "145",
        "is_ignore": "false",
        "is_row_identifier": "false",
        "is_target": "false",
        "name": "CATS2D_03_AA",
        "number_of_missing_values": "0"
      },
      {
        "data_type": "numeric",
        "index": "146",
        "is_ignore": "false",
        "is_row_identifier": "false",
        "is_target": "false",
        "name": "CATS2D_03_AL",
        "number_of_missing_values": "0"
      },
      {
        "data_type": "numeric",
        "index": "147",
        "is_ignore": "false",
        "is_row_identifier": "false",
        "is_target": "false",
        "name": "CATS2D_03_DA",
        "number_of_missing_values": "0"
      },
      {
        "data_type": "numeric",
        "index": "148",
        "is_ignore": "false",
        "is_row_identifier": "false",
        "is_target": "false",
        "name": "CATS2D_03_DD",
        "number_of_missing_values": "0"
      },
      {
        "data_type": "numeric",
        "index": "149",
        "is_ignore": "false",
        "is_row_identifier": "false",
        "is_target": "false",
        "name": "CATS2D_03_DL",
        "number_of_missing_values": "0"
      },
      {
        "data_type": "numeric",
        "index": "150",
        "is_ignore": "false",
        "is_row_identifier": "false",
        "is_target": "false",
        "name": "CATS2D_03_DP",
        "number_of_missing_values": "0"
      },
      {
        "data_type": "numeric",
        "index": "151",
        "is_ignore": "false",
        "is_row_identifier": "false",
        "is_target": "false",
        "name": "CATS2D_03_LL",
        "number_of_missing_values": "0"
      },
      {
        "data_type": "numeric",
        "index": "152",
        "is_ignore": "false",
        "is_row_identifier": "false",
        "is_target": "false",
        "name": "CATS2D_04_AA",
        "number_of_missing_values": "0"
      },
      {
        "data_type": "numeric",
        "index": "153",
        "is_ignore": "false",
        "is_row_identifier": "false",
        "is_target": "false",
        "name": "CATS2D_04_AL",
        "number_of_missing_values": "0"
      },
      {
        "data_type": "numeric",
        "index": "154",
        "is_ignore": "false",
        "is_row_identifier": "false",
        "is_target": "false",
        "name": "CATS2D_04_AN",
        "number_of_missing_values": "0"
      },
      {
        "data_type": "numeric",
        "index": "155",
        "is_ignore": "false",
        "is_row_identifier": "false",
        "is_target": "false",
        "name": "CATS2D_04_DA",
        "number_of_missing_values": "0"
      },
      {
        "data_type": "numeric",
        "index": "156",
        "is_ignore": "false",
        "is_row_identifier": "false",
        "is_target": "false",
        "name": "CATS2D_04_DD",
        "number_of_missing_values": "0"
      },
      {
        "data_type": "numeric",
        "index": "157",
        "is_ignore": "false",
        "is_row_identifier": "false",
        "is_target": "false",
        "name": "CATS2D_04_DL",
        "number_of_missing_values": "0"
      },
      {
        "data_type": "numeric",
        "index": "158",
        "is_ignore": "false",
        "is_row_identifier": "false",
        "is_target": "false",
        "name": "CATS2D_05_AA",
        "number_of_missing_values": "0"
      },
      {
        "data_type": "numeric",
        "index": "159",
        "is_ignore": "false",
        "is_row_identifier": "false",
        "is_target": "false",
        "name": "CATS2D_05_AL",
        "number_of_missing_values": "0"
      },
      {
        "data_type": "numeric",
        "index": "160",
        "is_ignore": "false",
        "is_row_identifier": "false",
        "is_target": "false",
        "name": "CATS2D_05_AN",
        "number_of_missing_values": "0"
      },
      {
        "data_type": "numeric",
        "index": "161",
        "is_ignore": "false",
        "is_row_identifier": "false",
        "is_target": "false",
        "name": "CATS2D_05_AP",
        "number_of_missing_values": "0"
      },
      {
        "data_type": "numeric",
        "index": "162",
        "is_ignore": "false",
        "is_row_identifier": "false",
        "is_target": "false",
        "name": "CATS2D_05_DA",
        "number_of_missing_values": "0"
      },
      {
        "data_type": "numeric",
        "index": "163",
        "is_ignore": "false",
        "is_row_identifier": "false",
        "is_target": "false",
        "name": "CATS2D_05_DD",
        "number_of_missing_values": "0"
      },
      {
        "data_type": "numeric",
        "index": "164",
        "is_ignore": "false",
        "is_row_identifier": "false",
        "is_target": "false",
        "name": "CATS2D_05_DL",
        "number_of_missing_values": "0"
      },
      {
        "data_type": "numeric",
        "index": "165",
        "is_ignore": "false",
        "is_row_identifier": "false",
        "is_target": "false",
        "name": "CATS2D_06_AA",
        "number_of_missing_values": "0"
      },
      {
        "data_type": "numeric",
        "index": "166",
        "is_ignore": "false",
        "is_row_identifier": "false",
        "is_target": "false",
        "name": "CATS2D_06_AL",
        "number_of_missing_values": "0"
      },
      {
        "data_type": "numeric",
        "index": "167",
        "is_ignore": "false",
        "is_row_identifier": "false",
        "is_target": "false",
        "name": "CATS2D_06_AN",
        "number_of_missing_values": "0"
      },
      {
        "data_type": "numeric",
        "index": "168",
        "is_ignore": "false",
        "is_row_identifier": "false",
        "is_target": "false",
        "name": "CATS2D_06_AP",
        "number_of_missing_values": "0"
      },
      {
        "data_type": "numeric",
        "index": "169",
        "is_ignore": "false",
        "is_row_identifier": "false",
        "is_target": "false",
        "name": "CATS2D_06_DA",
        "number_of_missing_values": "0"
      },
      {
        "data_type": "numeric",
        "index": "170",
        "is_ignore": "false",
        "is_row_identifier": "false",
        "is_target": "false",
        "name": "CATS2D_06_DD",
        "number_of_missing_values": "0"
      },
      {
        "data_type": "numeric",
        "index": "171",
        "is_ignore": "false",
        "is_row_identifier": "false",
        "is_target": "false",
        "name": "CATS2D_06_DL",
        "number_of_missing_values": "0"
      },
      {
        "data_type": "numeric",
        "index": "172",
        "is_ignore": "false",
        "is_row_identifier": "false",
        "is_target": "false",
        "name": "CATS2D_07_AA",
        "number_of_missing_values": "0"
      },
      {
        "data_type": "numeric",
        "index": "173",
        "is_ignore": "false",
        "is_row_identifier": "false",
        "is_target": "false",
        "name": "CATS2D_07_AL",
        "number_of_missing_values": "0"
      },
      {
        "data_type": "numeric",
        "index": "174",
        "is_ignore": "false",
        "is_row_identifier": "false",
        "is_target": "false",
        "name": "CATS2D_07_AN",
        "number_of_missing_values": "0"
      },
      {
        "data_type": "numeric",
        "index": "175",
        "is_ignore": "false",
        "is_row_identifier": "false",
        "is_target": "false",
        "name": "CATS2D_07_AP",
        "number_of_missing_values": "0"
      },
      {
        "data_type": "numeric",
        "index": "176",
        "is_ignore": "false",
        "is_row_identifier": "false",
        "is_target": "false",
        "name": "CATS2D_07_DA",
        "number_of_missing_values": "0"
      },
      {
        "data_type": "numeric",
        "index": "177",
        "is_ignore": "false",
        "is_row_identifier": "false",
        "is_target": "false",
        "name": "CATS2D_07_DD",
        "number_of_missing_values": "0"
      },
      {
        "data_type": "numeric",
        "index": "178",
        "is_ignore": "false",
        "is_row_identifier": "false",
        "is_target": "false",
        "name": "CATS2D_07_LL",
        "number_of_missing_values": "0"
      },
      {
        "data_type": "numeric",
        "index": "179",
        "is_ignore": "false",
        "is_row_identifier": "false",
        "is_target": "false",
        "name": "CATS2D_07_NL",
        "number_of_missing_values": "0"
      },
      {
        "data_type": "numeric",
        "index": "180",
        "is_ignore": "false",
        "is_row_identifier": "false",
        "is_target": "false",
        "name": "CATS2D_08_AA",
        "number_of_missing_values": "0"
      },
      {
        "data_type": "numeric",
        "index": "181",
        "is_ignore": "false",
        "is_row_identifier": "false",
        "is_target": "false",
        "name": "CATS2D_08_AL",
        "number_of_missing_values": "0"
      },
      {
        "data_type": "numeric",
        "index": "182",
        "is_ignore": "false",
        "is_row_identifier": "false",
        "is_target": "false",
        "name": "CATS2D_08_AN",
        "number_of_missing_values": "0"
      },
      {
        "data_type": "numeric",
        "index": "183",
        "is_ignore": "false",
        "is_row_identifier": "false",
        "is_target": "false",
        "name": "CATS2D_08_AP",
        "number_of_missing_values": "0"
      },
      {
        "data_type": "numeric",
        "index": "184",
        "is_ignore": "false",
        "is_row_identifier": "false",
        "is_target": "false",
        "name": "CATS2D_08_DA",
        "number_of_missing_values": "0"
      },
      {
        "data_type": "numeric",
        "index": "185",
        "is_ignore": "false",
        "is_row_identifier": "false",
        "is_target": "false",
        "name": "CATS2D_08_DL",
        "number_of_missing_values": "0"
      },
      {
        "data_type": "numeric",
        "index": "186",
        "is_ignore": "false",
        "is_row_identifier": "false",
        "is_target": "false",
        "name": "CATS2D_08_LL",
        "number_of_missing_values": "0"
      },
      {
        "data_type": "numeric",
        "index": "187",
        "is_ignore": "false",
        "is_row_identifier": "false",
        "is_target": "false",
        "name": "CATS2D_08_NL",
        "number_of_missing_values": "0"
      },
      {
        "data_type": "numeric",
        "index": "188",
        "is_ignore": "false",
        "is_row_identifier": "false",
        "is_target": "false",
        "name": "CATS2D_08_PL",
        "number_of_missing_values": "0"
      },
      {
        "data_type": "numeric",
        "index": "189",
        "is_ignore": "false",
        "is_row_identifier": "false",
        "is_target": "false",
        "name": "CATS2D_09_AA",
        "number_of_missing_values": "0"
      },
      {
        "data_type": "numeric",
        "index": "190",
        "is_ignore": "false",
        "is_row_identifier": "false",
        "is_target": "false",
        "name": "CATS2D_09_AL",
        "number_of_missing_values": "0"
      },
      {
        "data_type": "numeric",
        "index": "191",
        "is_ignore": "false",
        "is_row_identifier": "false",
        "is_target": "false",
        "name": "CATS2D_09_AP",
        "number_of_missing_values": "0"
      },
      {
        "data_type": "numeric",
        "index": "192",
        "is_ignore": "false",
        "is_row_identifier": "false",
        "is_target": "false",
        "name": "CATS2D_09_DA",
        "number_of_missing_values": "0"
      },
      {
        "data_type": "numeric",
        "index": "193",
        "is_ignore": "false",
        "is_row_identifier": "false",
        "is_target": "false",
        "name": "CATS2D_09_DL",
        "number_of_missing_values": "0"
      },
      {
        "data_type": "numeric",
        "index": "194",
        "is_ignore": "false",
        "is_row_identifier": "false",
        "is_target": "false",
        "name": "CATS2D_09_LL",
        "number_of_missing_values": "0"
      },
      {
        "data_type": "numeric",
        "index": "195",
        "is_ignore": "false",
        "is_row_identifier": "false",
        "is_target": "false",
        "name": "CATS2D_09_NL",
        "number_of_missing_values": "0"
      },
      {
        "data_type": "numeric",
        "index": "196",
        "is_ignore": "false",
        "is_row_identifier": "false",
        "is_target": "false",
        "name": "CATS2D_09_PL",
        "number_of_missing_values": "0"
      },
      {
        "data_type": "numeric",
        "index": "197",
        "is_ignore": "false",
        "is_row_identifier": "false",
        "is_target": "false",
        "name": "CENT",
        "number_of_missing_values": "0"
      },
      {
        "data_type": "numeric",
        "index": "198",
        "is_ignore": "false",
        "is_row_identifier": "false",
        "is_target": "false",
        "name": "Chi0_AEA.bo.",
        "number_of_missing_values": "0"
      },
      {
        "data_type": "numeric",
        "index": "199",
        "is_ignore": "false",
        "is_row_identifier": "false",
        "is_target": "false",
        "name": "Chi0_AEA.dm.",
        "number_of_missing_values": "0"
      },
      {
        "data_type": "numeric",
        "index": "200",
        "is_ignore": "false",
        "is_row_identifier": "false",
        "is_target": "false",
        "name": "Chi0_AEA.ed.",
        "number_of_missing_values": "0"
      },
      {
        "data_type": "numeric",
        "index": "201",
        "is_ignore": "false",
        "is_row_identifier": "false",
        "is_target": "false",
        "name": "Chi0_AEA.ri.",
        "number_of_missing_values": "0"
      },
      {
        "data_type": "numeric",
        "index": "202",
        "is_ignore": "false",
        "is_row_identifier": "false",
        "is_target": "false",
        "name": "Chi0_EA",
        "number_of_missing_values": "0"
      },
      {
        "data_type": "numeric",
        "index": "203",
        "is_ignore": "false",
        "is_row_identifier": "false",
        "is_target": "false",
        "name": "Chi0_EA.bo.",
        "number_of_missing_values": "0"
      },
      {
        "data_type": "numeric",
        "index": "204",
        "is_ignore": "false",
        "is_row_identifier": "false",
        "is_target": "false",
        "name": "Chi0_EA.dm.",
        "number_of_missing_values": "0"
      },
      {
        "data_type": "numeric",
        "index": "205",
        "is_ignore": "false",
        "is_row_identifier": "false",
        "is_target": "false",
        "name": "Chi0_EA.ed.",
        "number_of_missing_values": "0"
      },
      {
        "data_type": "numeric",
        "index": "206",
        "is_ignore": "false",
        "is_row_identifier": "false",
        "is_target": "false",
        "name": "Chi0_EA.ri.",
        "number_of_missing_values": "0"
      },
      {
        "data_type": "numeric",
        "index": "207",
        "is_ignore": "false",
        "is_row_identifier": "false",
        "is_target": "false",
        "name": "Chi1_AEA.bo.",
        "number_of_missing_values": "0"
      },
      {
        "data_type": "numeric",
        "index": "208",
        "is_ignore": "false",
        "is_row_identifier": "false",
        "is_target": "false",
        "name": "Chi1_AEA.dm.",
        "number_of_missing_values": "0"
      },
      {
        "data_type": "numeric",
        "index": "209",
        "is_ignore": "false",
        "is_row_identifier": "false",
        "is_target": "false",
        "name": "Chi1_AEA.ed.",
        "number_of_missing_values": "0"
      },
      {
        "data_type": "numeric",
        "index": "210",
        "is_ignore": "false",
        "is_row_identifier": "false",
        "is_target": "false",
        "name": "Chi1_AEA.ri.",
        "number_of_missing_values": "0"
      },
      {
        "data_type": "numeric",
        "index": "211",
        "is_ignore": "false",
        "is_row_identifier": "false",
        "is_target": "false",
        "name": "Chi1_EA",
        "number_of_missing_values": "0"
      },
      {
        "data_type": "numeric",
        "index": "212",
        "is_ignore": "false",
        "is_row_identifier": "false",
        "is_target": "false",
        "name": "Chi1_EA.bo.",
        "number_of_missing_values": "0"
      },
      {
        "data_type": "numeric",
        "index": "213",
        "is_ignore": "false",
        "is_row_identifier": "false",
        "is_target": "false",
        "name": "Chi1_EA.dm.",
        "number_of_missing_values": "0"
      },
      {
        "data_type": "numeric",
        "index": "214",
        "is_ignore": "false",
        "is_row_identifier": "false",
        "is_target": "false",
        "name": "Chi1_EA.ed.",
        "number_of_missing_values": "0"
      },
      {
        "data_type": "numeric",
        "index": "215",
        "is_ignore": "false",
        "is_row_identifier": "false",
        "is_target": "false",
        "name": "Chi1_EA.ri.",
        "number_of_missing_values": "0"
      },
      {
        "data_type": "numeric",
        "index": "216",
        "is_ignore": "false",
        "is_row_identifier": "false",
        "is_target": "false",
        "name": "CIC0",
        "number_of_missing_values": "0"
      },
      {
        "data_type": "numeric",
        "index": "217",
        "is_ignore": "false",
        "is_row_identifier": "false",
        "is_target": "false",
        "name": "CIC1",
        "number_of_missing_values": "0"
      },
      {
        "data_type": "numeric",
        "index": "218",
        "is_ignore": "false",
        "is_row_identifier": "false",
        "is_target": "false",
        "name": "CIC2",
        "number_of_missing_values": "0"
      },
      {
        "data_type": "numeric",
        "index": "219",
        "is_ignore": "false",
        "is_row_identifier": "false",
        "is_target": "false",
        "name": "CIC3",
        "number_of_missing_values": "0"
      },
      {
        "data_type": "numeric",
        "index": "220",
        "is_ignore": "false",
        "is_row_identifier": "false",
        "is_target": "false",
        "name": "CIC4",
        "number_of_missing_values": "0"
      },
      {
        "data_type": "numeric",
        "index": "221",
        "is_ignore": "false",
        "is_row_identifier": "false",
        "is_target": "false",
        "name": "CIC5",
        "number_of_missing_values": "0"
      },
      {
        "data_type": "numeric",
        "index": "222",
        "is_ignore": "false",
        "is_row_identifier": "false",
        "is_target": "false",
        "name": "CID",
        "number_of_missing_values": "0"
      },
      {
        "data_type": "numeric",
        "index": "223",
        "is_ignore": "false",
        "is_row_identifier": "false",
        "is_target": "false",
        "name": "CMC.80",
        "number_of_missing_values": "0"
      },
      {
        "data_type": "numeric",
        "index": "224",
        "is_ignore": "false",
        "is_row_identifier": "false",
        "is_target": "false",
        "name": "cRo5",
        "number_of_missing_values": "0"
      },
      {
        "data_type": "numeric",
        "index": "225",
        "is_ignore": "false",
        "is_row_identifier": "false",
        "is_target": "false",
        "name": "CSI",
        "number_of_missing_values": "0"
      },
      {
        "data_type": "numeric",
        "index": "226",
        "is_ignore": "false",
        "is_row_identifier": "false",
        "is_target": "false",
        "name": "DBI",
        "number_of_missing_values": "0"
      },
      {
        "data_type": "numeric",
        "index": "227",
        "is_ignore": "false",
        "is_row_identifier": "false",
        "is_target": "false",
        "name": "D.Dtr05",
        "number_of_missing_values": "0"
      },
      {
        "data_type": "numeric",
        "index": "228",
        "is_ignore": "false",
        "is_row_identifier": "false",
        "is_target": "false",
        "name": "D.Dtr06",
        "number_of_missing_values": "0"
      },
      {
        "data_type": "numeric",
        "index": "229",
        "is_ignore": "false",
        "is_row_identifier": "false",
        "is_target": "false",
        "name": "D.Dtr10",
        "number_of_missing_values": "0"
      },
      {
        "data_type": "numeric",
        "index": "230",
        "is_ignore": "false",
        "is_row_identifier": "false",
        "is_target": "false",
        "name": "DECC",
        "number_of_missing_values": "0"
      },
      {
        "data_type": "numeric",
        "index": "231",
        "is_ignore": "false",
        "is_row_identifier": "false",
        "is_target": "false",
        "name": "DELS",
        "number_of_missing_values": "0"
      },
      {
        "data_type": "numeric",
        "index": "232",
        "is_ignore": "false",
        "is_row_identifier": "false",
        "is_target": "false",
        "name": "DLS_01",
        "number_of_missing_values": "0"
      },
      {
        "data_type": "numeric",
        "index": "233",
        "is_ignore": "false",
        "is_row_identifier": "false",
        "is_target": "false",
        "name": "DLS_02",
        "number_of_missing_values": "0"
      },
      {
        "data_type": "numeric",
        "index": "234",
        "is_ignore": "false",
        "is_row_identifier": "false",
        "is_target": "false",
        "name": "DLS_03",
        "number_of_missing_values": "0"
      },
      {
        "data_type": "numeric",
        "index": "235",
        "is_ignore": "false",
        "is_row_identifier": "false",
        "is_target": "false",
        "name": "DLS_04",
        "number_of_missing_values": "0"
      },
      {
        "data_type": "numeric",
        "index": "236",
        "is_ignore": "false",
        "is_row_identifier": "false",
        "is_target": "false",
        "name": "DLS_05",
        "number_of_missing_values": "0"
      },
      {
        "data_type": "numeric",
        "index": "237",
        "is_ignore": "false",
        "is_row_identifier": "false",
        "is_target": "false",
        "name": "DLS_06",
        "number_of_missing_values": "0"
      },
      {
        "data_type": "numeric",
        "index": "238",
        "is_ignore": "false",
        "is_row_identifier": "false",
        "is_target": "false",
        "name": "DLS_07",
        "number_of_missing_values": "0"
      },
      {
        "data_type": "numeric",
        "index": "239",
        "is_ignore": "false",
        "is_row_identifier": "false",
        "is_target": "false",
        "name": "DLS_cons",
        "number_of_missing_values": "0"
      },
      {
        "data_type": "numeric",
        "index": "240",
        "is_ignore": "false",
        "is_row_identifier": "false",
        "is_target": "false",
        "name": "Dz",
        "number_of_missing_values": "0"
      },
      {
        "data_type": "numeric",
        "index": "241",
        "is_ignore": "false",
        "is_row_identifier": "false",
        "is_target": "false",
        "name": "ECC",
        "number_of_missing_values": "0"
      },
      {
        "data_type": "numeric",
        "index": "242",
        "is_ignore": "false",
        "is_row_identifier": "false",
        "is_target": "false",
        "name": "Eig01_AEA.bo.",
        "number_of_missing_values": "0"
      },
      {
        "data_type": "numeric",
        "index": "243",
        "is_ignore": "false",
        "is_row_identifier": "false",
        "is_target": "false",
        "name": "Eig01_AEA.dm.",
        "number_of_missing_values": "0"
      },
      {
        "data_type": "numeric",
        "index": "244",
        "is_ignore": "false",
        "is_row_identifier": "false",
        "is_target": "false",
        "name": "Eig01_AEA.ed.",
        "number_of_missing_values": "0"
      },
      {
        "data_type": "numeric",
        "index": "245",
        "is_ignore": "false",
        "is_row_identifier": "false",
        "is_target": "false",
        "name": "Eig01_AEA.ri.",
        "number_of_missing_values": "0"
      },
      {
        "data_type": "numeric",
        "index": "246",
        "is_ignore": "false",
        "is_row_identifier": "false",
        "is_target": "false",
        "name": "Eig01_EA",
        "number_of_missing_values": "0"
      },
      {
        "data_type": "numeric",
        "index": "247",
        "is_ignore": "false",
        "is_row_identifier": "false",
        "is_target": "false",
        "name": "Eig01_EA.bo.",
        "number_of_missing_values": "0"
      },
      {
        "data_type": "numeric",
        "index": "248",
        "is_ignore": "false",
        "is_row_identifier": "false",
        "is_target": "false",
        "name": "Eig01_EA.dm.",
        "number_of_missing_values": "0"
      },
      {
        "data_type": "numeric",
        "index": "249",
        "is_ignore": "false",
        "is_row_identifier": "false",
        "is_target": "false",
        "name": "Eig01_EA.ed.",
        "number_of_missing_values": "0"
      },
      {
        "data_type": "numeric",
        "index": "250",
        "is_ignore": "false",
        "is_row_identifier": "false",
        "is_target": "false",
        "name": "Eig01_EA.ri.",
        "number_of_missing_values": "0"
      },
      {
        "data_type": "numeric",
        "index": "251",
        "is_ignore": "false",
        "is_row_identifier": "false",
        "is_target": "false",
        "name": "Eig02_AEA.bo.",
        "number_of_missing_values": "0"
      },
      {
        "data_type": "numeric",
        "index": "252",
        "is_ignore": "false",
        "is_row_identifier": "false",
        "is_target": "false",
        "name": "Eig02_AEA.dm.",
        "number_of_missing_values": "0"
      },
      {
        "data_type": "numeric",
        "index": "253",
        "is_ignore": "false",
        "is_row_identifier": "false",
        "is_target": "false",
        "name": "Eig02_AEA.ed.",
        "number_of_missing_values": "0"
      },
      {
        "data_type": "numeric",
        "index": "254",
        "is_ignore": "false",
        "is_row_identifier": "false",
        "is_target": "false",
        "name": "Eig02_AEA.ri.",
        "number_of_missing_values": "0"
      },
      {
        "data_type": "numeric",
        "index": "255",
        "is_ignore": "false",
        "is_row_identifier": "false",
        "is_target": "false",
        "name": "Eig02_EA",
        "number_of_missing_values": "0"
      },
      {
        "data_type": "numeric",
        "index": "256",
        "is_ignore": "false",
        "is_row_identifier": "false",
        "is_target": "false",
        "name": "Eig02_EA.bo.",
        "number_of_missing_values": "0"
      },
      {
        "data_type": "numeric",
        "index": "257",
        "is_ignore": "false",
        "is_row_identifier": "false",
        "is_target": "false",
        "name": "Eig02_EA.dm.",
        "number_of_missing_values": "0"
      },
      {
        "data_type": "numeric",
        "index": "258",
        "is_ignore": "false",
        "is_row_identifier": "false",
        "is_target": "false",
        "name": "Eig02_EA.ed.",
        "number_of_missing_values": "0"
      },
      {
        "data_type": "numeric",
        "index": "259",
        "is_ignore": "false",
        "is_row_identifier": "false",
        "is_target": "false",
        "name": "Eig02_EA.ri.",
        "number_of_missing_values": "0"
      },
      {
        "data_type": "numeric",
        "index": "260",
        "is_ignore": "false",
        "is_row_identifier": "false",
        "is_target": "false",
        "name": "Eig03_AEA.bo.",
        "number_of_missing_values": "0"
      },
      {
        "data_type": "numeric",
        "index": "261",
        "is_ignore": "false",
        "is_row_identifier": "false",
        "is_target": "false",
        "name": "Eig03_AEA.dm.",
        "number_of_missing_values": "0"
      },
      {
        "data_type": "numeric",
        "index": "262",
        "is_ignore": "false",
        "is_row_identifier": "false",
        "is_target": "false",
        "name": "Eig03_AEA.ed.",
        "number_of_missing_values": "0"
      },
      {
        "data_type": "numeric",
        "index": "263",
        "is_ignore": "false",
        "is_row_identifier": "false",
        "is_target": "false",
        "name": "Eig03_AEA.ri.",
        "number_of_missing_values": "0"
      },
      {
        "data_type": "numeric",
        "index": "264",
        "is_ignore": "false",
        "is_row_identifier": "false",
        "is_target": "false",
        "name": "Eig03_EA",
        "number_of_missing_values": "0"
      },
      {
        "data_type": "numeric",
        "index": "265",
        "is_ignore": "false",
        "is_row_identifier": "false",
        "is_target": "false",
        "name": "Eig03_EA.bo.",
        "number_of_missing_values": "0"
      },
      {
        "data_type": "numeric",
        "index": "266",
        "is_ignore": "false",
        "is_row_identifier": "false",
        "is_target": "false",
        "name": "Eig03_EA.dm.",
        "number_of_missing_values": "0"
      },
      {
        "data_type": "numeric",
        "index": "267",
        "is_ignore": "false",
        "is_row_identifier": "false",
        "is_target": "false",
        "name": "Eig03_EA.ed.",
        "number_of_missing_values": "0"
      },
      {
        "data_type": "numeric",
        "index": "268",
        "is_ignore": "false",
        "is_row_identifier": "false",
        "is_target": "false",
        "name": "Eig03_EA.ri.",
        "number_of_missing_values": "0"
      },
      {
        "data_type": "numeric",
        "index": "269",
        "is_ignore": "false",
        "is_row_identifier": "false",
        "is_target": "false",
        "name": "Eig04_AEA.bo.",
        "number_of_missing_values": "0"
      },
      {
        "data_type": "numeric",
        "index": "270",
        "is_ignore": "false",
        "is_row_identifier": "false",
        "is_target": "false",
        "name": "Eig04_AEA.dm.",
        "number_of_missing_values": "0"
      },
      {
        "data_type": "numeric",
        "index": "271",
        "is_ignore": "false",
        "is_row_identifier": "false",
        "is_target": "false",
        "name": "Eig04_AEA.ed.",
        "number_of_missing_values": "0"
      },
      {
        "data_type": "numeric",
        "index": "272",
        "is_ignore": "false",
        "is_row_identifier": "false",
        "is_target": "false",
        "name": "Eig04_AEA.ri.",
        "number_of_missing_values": "0"
      },
      {
        "data_type": "numeric",
        "index": "273",
        "is_ignore": "false",
        "is_row_identifier": "false",
        "is_target": "false",
        "name": "Eig04_EA",
        "number_of_missing_values": "0"
      },
      {
        "data_type": "numeric",
        "index": "274",
        "is_ignore": "false",
        "is_row_identifier": "false",
        "is_target": "false",
        "name": "Eig04_EA.bo.",
        "number_of_missing_values": "0"
      },
      {
        "data_type": "numeric",
        "index": "275",
        "is_ignore": "false",
        "is_row_identifier": "false",
        "is_target": "false",
        "name": "Eig04_EA.ed.",
        "number_of_missing_values": "0"
      },
      {
        "data_type": "numeric",
        "index": "276",
        "is_ignore": "false",
        "is_row_identifier": "false",
        "is_target": "false",
        "name": "Eig04_EA.ri.",
        "number_of_missing_values": "0"
      },
      {
        "data_type": "numeric",
        "index": "277",
        "is_ignore": "false",
        "is_row_identifier": "false",
        "is_target": "false",
        "name": "Eig05_AEA.bo.",
        "number_of_missing_values": "0"
      },
      {
        "data_type": "numeric",
        "index": "278",
        "is_ignore": "false",
        "is_row_identifier": "false",
        "is_target": "false",
        "name": "Eig05_AEA.dm.",
        "number_of_missing_values": "0"
      },
      {
        "data_type": "numeric",
        "index": "279",
        "is_ignore": "false",
        "is_row_identifier": "false",
        "is_target": "false",
        "name": "Eig05_AEA.ed.",
        "number_of_missing_values": "0"
      },
      {
        "data_type": "numeric",
        "index": "280",
        "is_ignore": "false",
        "is_row_identifier": "false",
        "is_target": "false",
        "name": "Eig05_AEA.ri.",
        "number_of_missing_values": "0"
      },
      {
        "data_type": "numeric",
        "index": "281",
        "is_ignore": "false",
        "is_row_identifier": "false",
        "is_target": "false",
        "name": "Eig05_EA",
        "number_of_missing_values": "0"
      },
      {
        "data_type": "numeric",
        "index": "282",
        "is_ignore": "false",
        "is_row_identifier": "false",
        "is_target": "false",
        "name": "Eig05_EA.bo.",
        "number_of_missing_values": "0"
      },
      {
        "data_type": "numeric",
        "index": "283",
        "is_ignore": "false",
        "is_row_identifier": "false",
        "is_target": "false",
        "name": "Eig05_EA.dm.",
        "number_of_missing_values": "0"
      },
      {
        "data_type": "numeric",
        "index": "284",
        "is_ignore": "false",
        "is_row_identifier": "false",
        "is_target": "false",
        "name": "Eig05_EA.ed.",
        "number_of_missing_values": "0"
      },
      {
        "data_type": "numeric",
        "index": "285",
        "is_ignore": "false",
        "is_row_identifier": "false",
        "is_target": "false",
        "name": "Eig05_EA.ri.",
        "number_of_missing_values": "0"
      },
      {
        "data_type": "numeric",
        "index": "286",
        "is_ignore": "false",
        "is_row_identifier": "false",
        "is_target": "false",
        "name": "Eig06_AEA.bo.",
        "number_of_missing_values": "0"
      },
      {
        "data_type": "numeric",
        "index": "287",
        "is_ignore": "false",
        "is_row_identifier": "false",
        "is_target": "false",
        "name": "Eig06_AEA.dm.",
        "number_of_missing_values": "0"
      },
      {
        "data_type": "numeric",
        "index": "288",
        "is_ignore": "false",
        "is_row_identifier": "false",
        "is_target": "false",
        "name": "Eig06_AEA.ed.",
        "number_of_missing_values": "0"
      },
      {
        "data_type": "numeric",
        "index": "289",
        "is_ignore": "false",
        "is_row_identifier": "false",
        "is_target": "false",
        "name": "Eig06_AEA.ri.",
        "number_of_missing_values": "0"
      },
      {
        "data_type": "numeric",
        "index": "290",
        "is_ignore": "false",
        "is_row_identifier": "false",
        "is_target": "false",
        "name": "Eig06_EA",
        "number_of_missing_values": "0"
      },
      {
        "data_type": "numeric",
        "index": "291",
        "is_ignore": "false",
        "is_row_identifier": "false",
        "is_target": "false",
        "name": "Eig06_EA.bo.",
        "number_of_missing_values": "0"
      },
      {
        "data_type": "numeric",
        "index": "292",
        "is_ignore": "false",
        "is_row_identifier": "false",
        "is_target": "false",
        "name": "Eig06_EA.dm.",
        "number_of_missing_values": "0"
      },
      {
        "data_type": "numeric",
        "index": "293",
        "is_ignore": "false",
        "is_row_identifier": "false",
        "is_target": "false",
        "name": "Eig06_EA.ed.",
        "number_of_missing_values": "0"
      },
      {
        "data_type": "numeric",
        "index": "294",
        "is_ignore": "false",
        "is_row_identifier": "false",
        "is_target": "false",
        "name": "Eig06_EA.ri.",
        "number_of_missing_values": "0"
      },
      {
        "data_type": "numeric",
        "index": "295",
        "is_ignore": "false",
        "is_row_identifier": "false",
        "is_target": "false",
        "name": "Eig07_AEA.bo.",
        "number_of_missing_values": "0"
      },
      {
        "data_type": "numeric",
        "index": "296",
        "is_ignore": "false",
        "is_row_identifier": "false",
        "is_target": "false",
        "name": "Eig07_AEA.dm.",
        "number_of_missing_values": "0"
      },
      {
        "data_type": "numeric",
        "index": "297",
        "is_ignore": "false",
        "is_row_identifier": "false",
        "is_target": "false",
        "name": "Eig07_AEA.ed.",
        "number_of_missing_values": "0"
      },
      {
        "data_type": "numeric",
        "index": "298",
        "is_ignore": "false",
        "is_row_identifier": "false",
        "is_target": "false",
        "name": "Eig07_AEA.ri.",
        "number_of_missing_values": "0"
      },
      {
        "data_type": "numeric",
        "index": "299",
        "is_ignore": "false",
        "is_row_identifier": "false",
        "is_target": "false",
        "name": "Eig07_EA",
        "number_of_missing_values": "0"
      },
      {
        "data_type": "numeric",
        "index": "300",
        "is_ignore": "false",
        "is_row_identifier": "false",
        "is_target": "false",
        "name": "Eig07_EA.bo.",
        "number_of_missing_values": "0"
      },
      {
        "data_type": "numeric",
        "index": "301",
        "is_ignore": "false",
        "is_row_identifier": "false",
        "is_target": "false",
        "name": "Eig07_EA.dm.",
        "number_of_missing_values": "0"
      },
      {
        "data_type": "numeric",
        "index": "302",
        "is_ignore": "false",
        "is_row_identifier": "false",
        "is_target": "false",
        "name": "Eig07_EA.ed.",
        "number_of_missing_values": "0"
      },
      {
        "data_type": "numeric",
        "index": "303",
        "is_ignore": "false",
        "is_row_identifier": "false",
        "is_target": "false",
        "name": "Eig07_EA.ri.",
        "number_of_missing_values": "0"
      },
      {
        "data_type": "numeric",
        "index": "304",
        "is_ignore": "false",
        "is_row_identifier": "false",
        "is_target": "false",
        "name": "Eig08_AEA.bo.",
        "number_of_missing_values": "0"
      },
      {
        "data_type": "numeric",
        "index": "305",
        "is_ignore": "false",
        "is_row_identifier": "false",
        "is_target": "false",
        "name": "Eig08_AEA.dm.",
        "number_of_missing_values": "0"
      },
      {
        "data_type": "numeric",
        "index": "306",
        "is_ignore": "false",
        "is_row_identifier": "false",
        "is_target": "false",
        "name": "Eig08_AEA.ed.",
        "number_of_missing_values": "0"
      },
      {
        "data_type": "numeric",
        "index": "307",
        "is_ignore": "false",
        "is_row_identifier": "false",
        "is_target": "false",
        "name": "Eig08_AEA.ri.",
        "number_of_missing_values": "0"
      },
      {
        "data_type": "numeric",
        "index": "308",
        "is_ignore": "false",
        "is_row_identifier": "false",
        "is_target": "false",
        "name": "Eig08_EA",
        "number_of_missing_values": "0"
      },
      {
        "data_type": "numeric",
        "index": "309",
        "is_ignore": "false",
        "is_row_identifier": "false",
        "is_target": "false",
        "name": "Eig08_EA.bo.",
        "number_of_missing_values": "0"
      },
      {
        "data_type": "numeric",
        "index": "310",
        "is_ignore": "false",
        "is_row_identifier": "false",
        "is_target": "false",
        "name": "Eig08_EA.dm.",
        "number_of_missing_values": "0"
      },
      {
        "data_type": "numeric",
        "index": "311",
        "is_ignore": "false",
        "is_row_identifier": "false",
        "is_target": "false",
        "name": "Eig08_EA.ed.",
        "number_of_missing_values": "0"
      },
      {
        "data_type": "numeric",
        "index": "312",
        "is_ignore": "false",
        "is_row_identifier": "false",
        "is_target": "false",
        "name": "Eig08_EA.ri.",
        "number_of_missing_values": "0"
      },
      {
        "data_type": "numeric",
        "index": "313",
        "is_ignore": "false",
        "is_row_identifier": "false",
        "is_target": "false",
        "name": "Eig09_AEA.bo.",
        "number_of_missing_values": "0"
      },
      {
        "data_type": "numeric",
        "index": "314",
        "is_ignore": "false",
        "is_row_identifier": "false",
        "is_target": "false",
        "name": "Eig09_AEA.dm.",
        "number_of_missing_values": "0"
      },
      {
        "data_type": "numeric",
        "index": "315",
        "is_ignore": "false",
        "is_row_identifier": "false",
        "is_target": "false",
        "name": "Eig09_AEA.ed.",
        "number_of_missing_values": "0"
      },
      {
        "data_type": "numeric",
        "index": "316",
        "is_ignore": "false",
        "is_row_identifier": "false",
        "is_target": "false",
        "name": "Eig09_AEA.ri.",
        "number_of_missing_values": "0"
      },
      {
        "data_type": "numeric",
        "index": "317",
        "is_ignore": "false",
        "is_row_identifier": "false",
        "is_target": "false",
        "name": "Eig09_EA",
        "number_of_missing_values": "0"
      },
      {
        "data_type": "numeric",
        "index": "318",
        "is_ignore": "false",
        "is_row_identifier": "false",
        "is_target": "false",
        "name": "Eig09_EA.bo.",
        "number_of_missing_values": "0"
      },
      {
        "data_type": "numeric",
        "index": "319",
        "is_ignore": "false",
        "is_row_identifier": "false",
        "is_target": "false",
        "name": "Eig09_EA.dm.",
        "number_of_missing_values": "0"
      },
      {
        "data_type": "numeric",
        "index": "320",
        "is_ignore": "false",
        "is_row_identifier": "false",
        "is_target": "false",
        "name": "Eig09_EA.ed.",
        "number_of_missing_values": "0"
      },
      {
        "data_type": "numeric",
        "index": "321",
        "is_ignore": "false",
        "is_row_identifier": "false",
        "is_target": "false",
        "name": "Eig09_EA.ri.",
        "number_of_missing_values": "0"
      },
      {
        "data_type": "numeric",
        "index": "322",
        "is_ignore": "false",
        "is_row_identifier": "false",
        "is_target": "false",
        "name": "Eig10_AEA.bo.",
        "number_of_missing_values": "0"
      },
      {
        "data_type": "numeric",
        "index": "323",
        "is_ignore": "false",
        "is_row_identifier": "false",
        "is_target": "false",
        "name": "Eig10_AEA.dm.",
        "number_of_missing_values": "0"
      },
      {
        "data_type": "numeric",
        "index": "324",
        "is_ignore": "false",
        "is_row_identifier": "false",
        "is_target": "false",
        "name": "Eig10_AEA.ed.",
        "number_of_missing_values": "0"
      },
      {
        "data_type": "numeric",
        "index": "325",
        "is_ignore": "false",
        "is_row_identifier": "false",
        "is_target": "false",
        "name": "Eig10_AEA.ri.",
        "number_of_missing_values": "0"
      },
      {
        "data_type": "numeric",
        "index": "326",
        "is_ignore": "false",
        "is_row_identifier": "false",
        "is_target": "false",
        "name": "Eig10_EA",
        "number_of_missing_values": "0"
      },
      {
        "data_type": "numeric",
        "index": "327",
        "is_ignore": "false",
        "is_row_identifier": "false",
        "is_target": "false",
        "name": "Eig10_EA.bo.",
        "number_of_missing_values": "0"
      },
      {
        "data_type": "numeric",
        "index": "328",
        "is_ignore": "false",
        "is_row_identifier": "false",
        "is_target": "false",
        "name": "Eig10_EA.ed.",
        "number_of_missing_values": "0"
      },
      {
        "data_type": "numeric",
        "index": "329",
        "is_ignore": "false",
        "is_row_identifier": "false",
        "is_target": "false",
        "name": "Eig10_EA.ri.",
        "number_of_missing_values": "0"
      },
      {
        "data_type": "numeric",
        "index": "330",
        "is_ignore": "false",
        "is_row_identifier": "false",
        "is_target": "false",
        "name": "Eig11_AEA.bo.",
        "number_of_missing_values": "0"
      },
      {
        "data_type": "numeric",
        "index": "331",
        "is_ignore": "false",
        "is_row_identifier": "false",
        "is_target": "false",
        "name": "Eig11_AEA.dm.",
        "number_of_missing_values": "0"
      },
      {
        "data_type": "numeric",
        "index": "332",
        "is_ignore": "false",
        "is_row_identifier": "false",
        "is_target": "false",
        "name": "Eig11_AEA.ed.",
        "number_of_missing_values": "0"
      },
      {
        "data_type": "numeric",
        "index": "333",
        "is_ignore": "false",
        "is_row_identifier": "false",
        "is_target": "false",
        "name": "Eig11_AEA.ri.",
        "number_of_missing_values": "0"
      },
      {
        "data_type": "numeric",
        "index": "334",
        "is_ignore": "false",
        "is_row_identifier": "false",
        "is_target": "false",
        "name": "Eig11_EA",
        "number_of_missing_values": "0"
      },
      {
        "data_type": "numeric",
        "index": "335",
        "is_ignore": "false",
        "is_row_identifier": "false",
        "is_target": "false",
        "name": "Eig11_EA.bo.",
        "number_of_missing_values": "0"
      },
      {
        "data_type": "numeric",
        "index": "336",
        "is_ignore": "false",
        "is_row_identifier": "false",
        "is_target": "false",
        "name": "Eig11_EA.ed.",
        "number_of_missing_values": "0"
      },
      {
        "data_type": "numeric",
        "index": "337",
        "is_ignore": "false",
        "is_row_identifier": "false",
        "is_target": "false",
        "name": "Eig11_EA.ri.",
        "number_of_missing_values": "0"
      },
      {
        "data_type": "numeric",
        "index": "338",
        "is_ignore": "false",
        "is_row_identifier": "false",
        "is_target": "false",
        "name": "Eig12_AEA.bo.",
        "number_of_missing_values": "0"
      },
      {
        "data_type": "numeric",
        "index": "339",
        "is_ignore": "false",
        "is_row_identifier": "false",
        "is_target": "false",
        "name": "Eig12_AEA.dm.",
        "number_of_missing_values": "0"
      },
      {
        "data_type": "numeric",
        "index": "340",
        "is_ignore": "false",
        "is_row_identifier": "false",
        "is_target": "false",
        "name": "Eig12_AEA.ed.",
        "number_of_missing_values": "0"
      },
      {
        "data_type": "numeric",
        "index": "341",
        "is_ignore": "false",
        "is_row_identifier": "false",
        "is_target": "false",
        "name": "Eig12_AEA.ri.",
        "number_of_missing_values": "0"
      },
      {
        "data_type": "numeric",
        "index": "342",
        "is_ignore": "false",
        "is_row_identifier": "false",
        "is_target": "false",
        "name": "Eig12_EA",
        "number_of_missing_values": "0"
      },
      {
        "data_type": "numeric",
        "index": "343",
        "is_ignore": "false",
        "is_row_identifier": "false",
        "is_target": "false",
        "name": "Eig12_EA.bo.",
        "number_of_missing_values": "0"
      },
      {
        "data_type": "numeric",
        "index": "344",
        "is_ignore": "false",
        "is_row_identifier": "false",
        "is_target": "false",
        "name": "Eig12_EA.ed.",
        "number_of_missing_values": "0"
      },
      {
        "data_type": "numeric",
        "index": "345",
        "is_ignore": "false",
        "is_row_identifier": "false",
        "is_target": "false",
        "name": "Eig12_EA.ri.",
        "number_of_missing_values": "0"
      },
      {
        "data_type": "numeric",
        "index": "346",
        "is_ignore": "false",
        "is_row_identifier": "false",
        "is_target": "false",
        "name": "Eig13_AEA.bo.",
        "number_of_missing_values": "0"
      },
      {
        "data_type": "numeric",
        "index": "347",
        "is_ignore": "false",
        "is_row_identifier": "false",
        "is_target": "false",
        "name": "Eig13_AEA.dm.",
        "number_of_missing_values": "0"
      },
      {
        "data_type": "numeric",
        "index": "348",
        "is_ignore": "false",
        "is_row_identifier": "false",
        "is_target": "false",
        "name": "Eig13_AEA.ed.",
        "number_of_missing_values": "0"
      },
      {
        "data_type": "numeric",
        "index": "349",
        "is_ignore": "false",
        "is_row_identifier": "false",
        "is_target": "false",
        "name": "Eig13_AEA.ri.",
        "number_of_missing_values": "0"
      },
      {
        "data_type": "numeric",
        "index": "350",
        "is_ignore": "false",
        "is_row_identifier": "false",
        "is_target": "false",
        "name": "Eig13_EA",
        "number_of_missing_values": "0"
      },
      {
        "data_type": "numeric",
        "index": "351",
        "is_ignore": "false",
        "is_row_identifier": "false",
        "is_target": "false",
        "name": "Eig13_EA.bo.",
        "number_of_missing_values": "0"
      },
      {
        "data_type": "numeric",
        "index": "352",
        "is_ignore": "false",
        "is_row_identifier": "false",
        "is_target": "false",
        "name": "Eig13_EA.ed.",
        "number_of_missing_values": "0"
      },
      {
        "data_type": "numeric",
        "index": "353",
        "is_ignore": "false",
        "is_row_identifier": "false",
        "is_target": "false",
        "name": "Eig13_EA.ri.",
        "number_of_missing_values": "0"
      },
      {
        "data_type": "numeric",
        "index": "354",
        "is_ignore": "false",
        "is_row_identifier": "false",
        "is_target": "false",
        "name": "Eig14_AEA.bo.",
        "number_of_missing_values": "0"
      },
      {
        "data_type": "numeric",
        "index": "355",
        "is_ignore": "false",
        "is_row_identifier": "false",
        "is_target": "false",
        "name": "Eig14_AEA.dm.",
        "number_of_missing_values": "0"
      },
      {
        "data_type": "numeric",
        "index": "356",
        "is_ignore": "false",
        "is_row_identifier": "false",
        "is_target": "false",
        "name": "Eig14_AEA.ed.",
        "number_of_missing_values": "0"
      },
      {
        "data_type": "numeric",
        "index": "357",
        "is_ignore": "false",
        "is_row_identifier": "false",
        "is_target": "false",
        "name": "Eig14_AEA.ri.",
        "number_of_missing_values": "0"
      },
      {
        "data_type": "numeric",
        "index": "358",
        "is_ignore": "false",
        "is_row_identifier": "false",
        "is_target": "false",
        "name": "Eig14_EA",
        "number_of_missing_values": "0"
      },
      {
        "data_type": "numeric",
        "index": "359",
        "is_ignore": "false",
        "is_row_identifier": "false",
        "is_target": "false",
        "name": "Eig14_EA.bo.",
        "number_of_missing_values": "0"
      },
      {
        "data_type": "numeric",
        "index": "360",
        "is_ignore": "false",
        "is_row_identifier": "false",
        "is_target": "false",
        "name": "Eig14_EA.ed.",
        "number_of_missing_values": "0"
      },
      {
        "data_type": "numeric",
        "index": "361",
        "is_ignore": "false",
        "is_row_identifier": "false",
        "is_target": "false",
        "name": "Eig14_EA.ri.",
        "number_of_missing_values": "0"
      },
      {
        "data_type": "numeric",
        "index": "362",
        "is_ignore": "false",
        "is_row_identifier": "false",
        "is_target": "false",
        "name": "Eig15_AEA.bo.",
        "number_of_missing_values": "0"
      },
      {
        "data_type": "numeric",
        "index": "363",
        "is_ignore": "false",
        "is_row_identifier": "false",
        "is_target": "false",
        "name": "Eig15_AEA.dm.",
        "number_of_missing_values": "0"
      },
      {
        "data_type": "numeric",
        "index": "364",
        "is_ignore": "false",
        "is_row_identifier": "false",
        "is_target": "false",
        "name": "Eig15_AEA.ed.",
        "number_of_missing_values": "0"
      },
      {
        "data_type": "numeric",
        "index": "365",
        "is_ignore": "false",
        "is_row_identifier": "false",
        "is_target": "false",
        "name": "Eig15_AEA.ri.",
        "number_of_missing_values": "0"
      },
      {
        "data_type": "numeric",
        "index": "366",
        "is_ignore": "false",
        "is_row_identifier": "false",
        "is_target": "false",
        "name": "Eig15_EA",
        "number_of_missing_values": "0"
      },
      {
        "data_type": "numeric",
        "index": "367",
        "is_ignore": "false",
        "is_row_identifier": "false",
        "is_target": "false",
        "name": "Eig15_EA.bo.",
        "number_of_missing_values": "0"
      },
      {
        "data_type": "numeric",
        "index": "368",
        "is_ignore": "false",
        "is_row_identifier": "false",
        "is_target": "false",
        "name": "Eig15_EA.ed.",
        "number_of_missing_values": "0"
      },
      {
        "data_type": "numeric",
        "index": "369",
        "is_ignore": "false",
        "is_row_identifier": "false",
        "is_target": "false",
        "name": "Eig15_EA.ri.",
        "number_of_missing_values": "0"
      },
      {
        "data_type": "numeric",
        "index": "370",
        "is_ignore": "false",
        "is_row_identifier": "false",
        "is_target": "false",
        "name": "Eta_alpha",
        "number_of_missing_values": "0"
      },
      {
        "data_type": "numeric",
        "index": "371",
        "is_ignore": "false",
        "is_row_identifier": "false",
        "is_target": "false",
        "name": "Eta_alpha_A",
        "number_of_missing_values": "0"
      },
      {
        "data_type": "numeric",
        "index": "372",
        "is_ignore": "false",
        "is_row_identifier": "false",
        "is_target": "false",
        "name": "Eta_B",
        "number_of_missing_values": "0"
      },
      {
        "data_type": "numeric",
        "index": "373",
        "is_ignore": "false",
        "is_row_identifier": "false",
        "is_target": "false",
        "name": "Eta_B_A",
        "number_of_missing_values": "0"
      },
      {
        "data_type": "numeric",
        "index": "374",
        "is_ignore": "false",
        "is_row_identifier": "false",
        "is_target": "false",
        "name": "Eta_beta",
        "number_of_missing_values": "0"
      },
      {
        "data_type": "numeric",
        "index": "375",
        "is_ignore": "false",
        "is_row_identifier": "false",
        "is_target": "false",
        "name": "Eta_beta_A",
        "number_of_missing_values": "0"
      },
      {
        "data_type": "numeric",
        "index": "376",
        "is_ignore": "false",
        "is_row_identifier": "false",
        "is_target": "false",
        "name": "Eta_betaP",
        "number_of_missing_values": "0"
      },
      {
        "data_type": "numeric",
        "index": "377",
        "is_ignore": "false",
        "is_row_identifier": "false",
        "is_target": "false",
        "name": "Eta_betaP_A",
        "number_of_missing_values": "0"
      },
      {
        "data_type": "numeric",
        "index": "378",
        "is_ignore": "false",
        "is_row_identifier": "false",
        "is_target": "false",
        "name": "Eta_betaS",
        "number_of_missing_values": "0"
      },
      {
        "data_type": "numeric",
        "index": "379",
        "is_ignore": "false",
        "is_row_identifier": "false",
        "is_target": "false",
        "name": "Eta_betaS_A",
        "number_of_missing_values": "0"
      },
      {
        "data_type": "numeric",
        "index": "380",
        "is_ignore": "false",
        "is_row_identifier": "false",
        "is_target": "false",
        "name": "Eta_C",
        "number_of_missing_values": "0"
      },
      {
        "data_type": "numeric",
        "index": "381",
        "is_ignore": "false",
        "is_row_identifier": "false",
        "is_target": "false",
        "name": "Eta_C_A",
        "number_of_missing_values": "0"
      },
      {
        "data_type": "numeric",
        "index": "382",
        "is_ignore": "false",
        "is_row_identifier": "false",
        "is_target": "false",
        "name": "Eta_epsi",
        "number_of_missing_values": "0"
      },
      {
        "data_type": "numeric",
        "index": "383",
        "is_ignore": "false",
        "is_row_identifier": "false",
        "is_target": "false",
        "name": "Eta_epsi_A",
        "number_of_missing_values": "0"
      },
      {
        "data_type": "numeric",
        "index": "384",
        "is_ignore": "false",
        "is_row_identifier": "false",
        "is_target": "false",
        "name": "Eta_F",
        "number_of_missing_values": "0"
      },
      {
        "data_type": "numeric",
        "index": "385",
        "is_ignore": "false",
        "is_row_identifier": "false",
        "is_target": "false",
        "name": "Eta_F_A",
        "number_of_missing_values": "0"
      },
      {
        "data_type": "numeric",
        "index": "386",
        "is_ignore": "false",
        "is_row_identifier": "false",
        "is_target": "false",
        "name": "Eta_FL",
        "number_of_missing_values": "0"
      },
      {
        "data_type": "numeric",
        "index": "387",
        "is_ignore": "false",
        "is_row_identifier": "false",
        "is_target": "false",
        "name": "Eta_FL_A",
        "number_of_missing_values": "0"
      },
      {
        "data_type": "numeric",
        "index": "388",
        "is_ignore": "false",
        "is_row_identifier": "false",
        "is_target": "true",
        "name": "pXC50",
        "number_of_missing_values": "0"
      }
    ]
  }
}