"molecule_id","AMW","C.","H.","Me","Mi","Mp","Mv","MW","N.","nAB","nAT","nB","nBM","nBO","nBR","nBT","nC","nCL","nCsp","nCsp2","nCsp3","nDB","nF","nH","nHet","nHM","nI","nN","nO","nP","nS","nSK","nTB","nX","O.","RBF","RBN","SCBO","Se","Si","Sp","Sv","X.","pXC50"
{1 9.885,2 27.3,3 36.4,4 1.079,5 1.158,6 0.631,7 0.643,8 326.2,9 6.1,11 33,13 4,14 22,16 34,17 9,20 4,21 5,22 4,23 1,24 12,25 12,26 1,28 2,29 8,30 1,32 21,34 1,35 24.2,36 0.118,37 4,38 26,39 35.611,40 38.226,41 20.835,42 21.229,43 3,44 6.244}
{0 CHEMBL1823493,1 9.454,2 31.6,3 36.8,4 1.058,5 1.142,6 0.655,7 0.654,8 359.26,9 7.9,11 38,13 6,14 25,16 39,17 12,19 1,20 6,21 5,22 5,24 14,25 12,26 1,28 3,29 8,30 1,32 24,33 1,35 21.1,36 0.128,37 5,38 32,39 40.2,40 43.385,41 24.903,42 24.867,44 4.301}
{0 CHEMBL1823494,1 9.356,2 34.9,3 37.2,4 1.055,5 1.141,6 0.659,7 0.658,8 402.3,9 4.7,10 6,11 43,13 10,14 29,16 45,17 15,20 10,21 5,22 4,23 1,24 16,25 12,26 1,28 2,29 8,30 1,32 27,34 1,35 18.6,36 0.111,37 5,38 36,39 45.378,40 49.057,41 28.358,42 28.283,43 2.3,44 4.301}
{0 CHEMBL1823495,1 8.816,2 34,3 40.4,4 1.044,5 1.135,6 0.652,7 0.641,8 414.34,9 4.3,10 6,11 47,13 10,14 30,16 49,17 16,20 10,21 6,22 4,24 19,25 12,26 1,28 2,29 9,30 1,32 28,35 19.1,36 0.122,37 6,38 37,39 49.076,40 53.342,41 30.636,42 30.141,44 4.301}
{0 CHEMBL1823496,1 7.27,2 32.3,3 50.8,4 1.014,5 1.139,6 0.623,7 0.586,8 472.53,9 3.1,11 65,13 5,14 33,16 66,17 21,19 2,20 4,21 15,22 4,24 33,25 11,26 1,28 2,29 8,30 1,32 32,33 1,35 12.3,36 0.182,37 12,38 39,39 65.934,40 74.039,41 40.512,42 38.114,44 4.301}
{0 CHEMBL1823497,1 7.402,2 31.8,3 50,4 1.019,5 1.14,6 0.621,7 0.588,8 488.53,9 3,11 66,13 5,14 34,16 67,17 21,19 2,20 4,21 15,22 4,24 33,25 12,26 1,28 2,29 9,30 1,32 33,33 1,35 13.6,36 0.179,37 12,38 40,39 67.262,40 75.248,41 40.966,42 38.828,44 4.301}
{0 CHEMBL1823498,1 7.738,2 31.7,3 47.6,4 1.025,5 1.142,6 0.626,7 0.6,8 487.5,9 4.8,11 63,13 6,14 34,16 64,17 20,19 2,20 5,21 13,22 5,24 30,25 13,26 1,28 3,29 9,30 1,32 33,33 1,35 14.3,36 0.172,37 11,38 41,39 64.596,40 71.916,41 39.449,42 37.796,44 4.301}
{0 CHEMBL1823499,1 7.867,2 31.3,3 46.9,4 1.03,5 1.143,6 0.623,7 0.602,8 503.5,9 4.7,11 64,13 6,14 35,16 65,17 20,19 2,20 5,21 13,22 5,24 30,25 14,26 1,28 3,29 10,30 1,32 34,33 1,35 15.6,36 0.169,37 11,38 42,39 65.923,40 73.125,41 39.903,42 38.511,44 4.301}
{0 CHEMBL1823500,1 7.738,2 31.7,3 47.6,4 1.025,5 1.142,6 0.626,7 0.6,8 487.5,9 4.8,11 63,13 6,14 34,16 64,17 20,19 2,20 5,21 13,22 5,24 30,25 13,26 1,28 3,29 9,30 1,32 33,33 1,35 14.3,36 0.172,37 11,38 41,39 64.596,40 71.916,41 39.449,42 37.796,44 4.301}
{0 CHEMBL1823501,1 8.06,2 31.6,3 45.6,4 1.032,5 1.142,6 0.63,7 0.61,8 459.44,9 5.3,11 57,13 6,14 32,16 58,17 18,19 2,20 5,21 11,22 5,24 26,25 13,26 1,28 3,29 9,30 1,32 31,33 1,35 15.8,36 0.155,37 9,38 39,39 58.829,40 65.086,41 35.926,42 34.743,44 4.301}
{0 CHEMBL1823502,1 8.458,2 31.4,3 43.1,4 1.04,5 1.142,6 0.635,7 0.621,8 431.38,9 5.9,11 51,13 6,14 30,16 52,17 16,19 2,20 5,21 9,22 5,24 22,25 13,26 1,28 3,29 9,30 1,32 29,33 1,35 17.6,36 0.135,37 7,38 37,39 53.062,40 58.255,41 32.403,42 31.689,44 4.301}
{0 CHEMBL1823503,1 8.717,2 36.4,3 40,4 1.037,5 1.132,6 0.662,7 0.649,8 479.42,9 5.5,10 6,11 55,13 12,14 35,16 57,17 20,19 2,20 11,21 7,22 5,24 22,25 13,26 1,28 3,29 9,30 1,32 33,33 1,35 16.4,36 0.123,37 7,38 45,39 57.062,40 62.255,41 36.403,42 35.689,44 4.301}
{0 CHEMBL1823504,1 8.181,2 29.7,3 46.9,4 1.031,5 1.141,6 0.634,7 0.605,8 523.56,9 4.7,11 64,13 7,14 35,16 65,17 19,19 2,20 4,21 13,22 6,24 30,25 15,26 2,28 3,29 10,30 1,31 1,32 34,33 1,35 15.6,36 0.185,37 12,38 43,39 66,40 73.045,41 40.551,42 38.698,44 4.301}
{0 CHEMBL1823505,1 7.879,2 30.6,3 46.8,4 1.029,5 1.145,6 0.624,7 0.601,8 488.49,9 6.5,11 62,13 6,14 34,16 63,17 19,19 2,20 5,21 12,22 5,24 29,25 14,26 1,28 4,29 9,30 1,32 33,33 1,35 14.5,36 0.159,37 10,38 41,39 63.814,40 70.999,41 38.693,42 37.291,44 4.301}
