"molecule_id","nAT","nBT","pXC50"
{1 63,2 63,3 4.538}
{0 CHEMBL108721,1 44,2 48,3 5.301}
{0 CHEMBL1095726,1 76,2 77,3 5.009}
{0 CHEMBL1097720,1 79,2 80,3 4.975}
{0 CHEMBL1161222,1 50,2 51,3 4.509}
{0 CHEMBL138152,1 29,2 30,3 4}
{0 CHEMBL140524,1 56,2 58,3 4.796}
{0 CHEMBL140954,1 56,2 58,3 5.201}
{0 CHEMBL1650889,1 68,2 73,3 6.475}
{0 CHEMBL1650891,1 67,2 72,3 6.423}
{0 CHEMBL1650892,1 67,2 72,3 6.389}
{0 CHEMBL1650893,1 67,2 72,3 6.313}
{0 CHEMBL1650918,1 67,2 72,3 5.24}
{0 CHEMBL1667953,1 95,2 100,3 4.301}
{0 CHEMBL1667954,1 99,2 104,3 4.301}
{0 CHEMBL1667955,1 95,2 100,3 4.301}
{0 CHEMBL1667956,1 98,2 103,3 4.301}
{0 CHEMBL1667957,1 104,2 110,3 4.752}
{0 CHEMBL1667958,1 105,2 111,3 4.59}
{0 CHEMBL1667959,1 104,2 110,3 4.733}
{0 CHEMBL1667960,1 105,2 111,3 4.275}
{0 CHEMBL1667961,1 48,2 50,3 4.301}
{0 CHEMBL1667962,1 45,2 47,3 4.301}
{0 CHEMBL168,1 81,2 85,3 4.504}
{0 CHEMBL169,1 81,2 85,3 4.589}
{0 CHEMBL1756,1 65,2 68,3 4.394}
{0 CHEMBL179166,1 8,2 7,3 4.729}
{0 CHEMBL1795950,1 111,2 116,3 4.394}
{0 CHEMBL1800273,1 34,2 35,3 4.854}
{0 CHEMBL1801440,1 55,2 58,3 5.523}
{0 CHEMBL1822606,1 99,2 104,3 4.162}
{0 CHEMBL1822607,1 102,2 107,3 4.279}
{0 CHEMBL1823755,1 58,2 61,3 4.808}
{0 CHEMBL1823759,1 59,2 62,3 5.007}
{0 CHEMBL1823760,1 59,2 62,3 4.577}
{0 CHEMBL1823761,1 59,2 62,3 4.733}
{0 CHEMBL1823762,1 59,2 62,3 5.614}
{0 CHEMBL1823763,1 59,2 62,3 4.879}
{0 CHEMBL1823956,1 59,2 62,3 4.787}
{0 CHEMBL1823957,1 59,2 62,3 4.96}
{0 CHEMBL1823958,1 59,2 62,3 4.885}
{0 CHEMBL1823959,1 59,2 62,3 4.903}
{0 CHEMBL1823960,1 59,2 62,3 4.97}
{0 CHEMBL1823961,1 63,2 66,3 4.784}
{0 CHEMBL185726,1 48,2 50,3 4.721}
{0 CHEMBL201515,1 82,2 86,3 4.398}
{0 CHEMBL211369,1 98,2 102,3 4.908}
{0 CHEMBL2208249,1 42,2 46,3 4}
{0 CHEMBL2208259,1 42,2 46,3 4}
{0 CHEMBL228397,1 53,2 56,3 4.531}
{0 CHEMBL228563,1 53,2 56,3 4.432}
{0 CHEMBL230006,1 80,2 84,3 4.184}
{0 CHEMBL2311593,1 43,2 46,3 5.244}
{0 CHEMBL2316894,1 48,2 51,3 5.276}
{0 CHEMBL2316895,1 49,2 52,3 5.149}
{0 CHEMBL2316896,1 56,2 60,3 5.432}
{0 CHEMBL2316897,1 47,2 50,3 5.292}
{0 CHEMBL2316898,1 45,2 48,3 4.939}
{0 CHEMBL2316899,1 78,2 84,3 4}
{0 CHEMBL2316900,1 35,2 37,3 4}
{0 CHEMBL2316901,1 31,2 33,3 4.301}
{0 CHEMBL2316902,1 44,2 47,3 5.638}
{0 CHEMBL2316903,1 41,2 44,3 5.31}
{0 CHEMBL2316904,1 41,2 44,3 5.377}
{0 CHEMBL2316905,1 41,2 44,3 5.469}
{0 CHEMBL2316906,1 41,2 44,3 5.638}
{0 CHEMBL2316907,1 45,2 48,3 5.604}
{0 CHEMBL2316908,1 52,2 56,3 6.119}
{0 CHEMBL2316909,1 45,2 48,3 4.469}
{0 CHEMBL2316910,1 41,2 44,3 5.585}
{0 CHEMBL232049,1 61,2 64,3 4.675}
{0 CHEMBL236216,1 47,2 49,3 4.42}
{0 CHEMBL236636,1 50,2 52,3 4.921}
{0 CHEMBL237915,1 50,2 52,3 4.886}
{0 CHEMBL238137,1 50,2 52,3 5.046}
{0 CHEMBL238138,1 53,2 55,3 5.398}
{0 CHEMBL262382,1 145,2 146,3 6.959}
{0 CHEMBL265579,1 140,2 141,3 4.222}
{0 CHEMBL269042,1 143,2 145,3 6.276}
{0 CHEMBL273780,1 140,2 141,3 4.155}
{0 CHEMBL274087,1 141,2 143,3 4.301}
{0 CHEMBL301982,1 71,2 75,3 4.556}
{0 CHEMBL324232,1 57,2 62,3 5.046}
{0 CHEMBL336908,1 22,2 22,3 4.097}
{0 CHEMBL337604,1 56,2 58,3 4.824}
{0 CHEMBL341806,1 26,2 27,3 4.553}
{0 CHEMBL342478,1 26,2 27,3 4.796}
{0 CHEMBL342612,1 19,2 19,3 4.222}
{0 CHEMBL344437,1 52,2 53,3 4.215}
{0 CHEMBL371014,1 137,2 137,3 5.842}
{0 CHEMBL374829,1 29,2 30,3 4.301}
{0 CHEMBL386749,1 138,2 139,3 6}
{0 CHEMBL386750,1 143,2 144,3 6.046}
{0 CHEMBL386769,1 141,2 142,3 5.967}
{0 CHEMBL391533,1 82,2 86,3 4.61}
{0 CHEMBL393866,1 47,2 49,3 4.602}
{0 CHEMBL408337,1 148,2 149,3 6.678}
{0 CHEMBL412186,1 141,2 142,3 4.097}
{0 CHEMBL413215,1 143,2 144,3 6.708}
{0 CHEMBL413492,1 139,2 140,3 4.071}
{0 CHEMBL439086,1 141,2 142,3 4.125}
{0 CHEMBL445194,1 66,2 70,3 5.222}
{0 CHEMBL449613,1 101,2 106,3 4.898}
{0 CHEMBL450560,1 40,2 42,3 4.108}
{0 CHEMBL453868,1 62,2 66,3 5.222}
{0 CHEMBL455694,1 48,2 50,3 4.824}
{0 CHEMBL461734,1 52,2 54,3 5}
{0 CHEMBL472400,1 87,2 91,3 4.563}
{0 CHEMBL472401,1 93,2 97,3 5.284}
{0 CHEMBL497509,1 35,2 37,3 4.14}
{0 CHEMBL497510,1 49,2 52,3 4.712}
{0 CHEMBL498473,1 53,2 56,3 4.366}
{0 CHEMBL498474,1 53,2 56,3 4.13}
{0 CHEMBL499061,1 50,2 53,3 4.742}
{0 CHEMBL499329,1 46,2 48,3 4.558}
{0 CHEMBL499413,1 129,2 135,3 6.051}
{0 CHEMBL500677,1 53,2 56,3 4.134}
{0 CHEMBL502006,1 50,2 53,3 4.799}
{0 CHEMBL502013,1 50,2 53,3 4.738}
{0 CHEMBL502257,1 35,2 37,3 4.167}
{0 CHEMBL502539,1 50,2 53,3 5.149}
{0 CHEMBL502540,1 50,2 53,3 4.372}
{0 CHEMBL502815,1 50,2 53,3 4.745}
{0 CHEMBL507502,1 116,2 122,3 6.149}
{0 CHEMBL508831,1 97,2 102,3 5.393}
{0 CHEMBL509443,1 113,2 118,3 5.389}
{0 CHEMBL525078,1 50,2 53,3 4.216}
{0 CHEMBL525812,1 49,2 52,3 4.388}
{0 CHEMBL526177,1 53,2 56,3 4.489}
{0 CHEMBL526369,1 50,2 53,3 4.967}
{0 CHEMBL526644,1 35,2 37,3 4.812}
{0 CHEMBL526866,1 46,2 48,3 4.804}
{0 CHEMBL527109,1 53,2 56,3 4.487}
{0 CHEMBL541940,1 88,2 94,3 4.398}
{0 CHEMBL562059,1 82,2 87,3 4.398}
{0 CHEMBL572899,1 91,2 97,3 4.398}
{0 CHEMBL573989,1 30,2 31,3 4.027}
{0 CHEMBL574391,1 81,2 86,3 4.398}
{0 CHEMBL574813,1 41,2 43,3 5.448}
{0 CHEMBL576164,1 82,2 87,3 4.398}
{0 CHEMBL578429,1 82,2 87,3 4.398}
{0 CHEMBL579363,1 41,2 43,3 4.071}
{0 CHEMBL582862,1 80,2 85,3 4.398}
{0 CHEMBL590043,1 69,2 74,3 4.804}
