{
  "data_features": {
    "feature": [
      {
        "data_type": "nominal",
        "index": "0",
        "is_ignore": "false",
        "is_row_identifier": "true",
        "is_target": "false",
        "name": "molecule_id",
        "nominal_value": [
          "CHEMBL103479",
          "CHEMBL105261",
          "CHEMBL1083787",
          "CHEMBL114112",
          "CHEMBL1162955",
          "CHEMBL1163015",
          "CHEMBL116448",
          "CHEMBL117287",
          "CHEMBL120055",
          "CHEMBL1204203",
          "CHEMBL121766",
          "CHEMBL121776",
          "CHEMBL121913",
          "CHEMBL122818",
          "CHEMBL122914",
          "CHEMBL122973",
          "CHEMBL123377",
          "CHEMBL1242923",
          "CHEMBL1242950",
          "CHEMBL124485",
          "CHEMBL125005",
          "CHEMBL1255606",
          "CHEMBL125670",
          "CHEMBL125716",
          "CHEMBL1257991",
          "CHEMBL1258108",
          "CHEMBL1258109",
          "CHEMBL1258222",
          "CHEMBL1258223",
          "CHEMBL1258338",
          "CHEMBL1258339",
          "CHEMBL1258450",
          "CHEMBL1258451",
          "CHEMBL1258452",
          "CHEMBL1258559",
          "CHEMBL1258560",
          "CHEMBL1258561",
          "CHEMBL1258671",
          "CHEMBL1258672",
          "CHEMBL1258786",
          "CHEMBL125926",
          "CHEMBL126098",
          "CHEMBL12624",
          "CHEMBL1275709",
          "CHEMBL1275791",
          "CHEMBL127876",
          "CHEMBL1323615",
          "CHEMBL133455",
          "CHEMBL133868",
          "CHEMBL145033",
          "CHEMBL154274",
          "CHEMBL15585",
          "CHEMBL156206",
          "CHEMBL157910",
          "CHEMBL15928",
          "CHEMBL160581",
          "CHEMBL1632154",
          "CHEMBL1632155",
          "CHEMBL1632156",
          "CHEMBL1632157",
          "CHEMBL1632158",
          "CHEMBL1632159",
          "CHEMBL1632160",
          "CHEMBL1632161",
          "CHEMBL1632162",
          "CHEMBL1632163",
          "CHEMBL1632164",
          "CHEMBL1632165",
          "CHEMBL1632166",
          "CHEMBL1632167",
          "CHEMBL1632168",
          "CHEMBL1632169",
          "CHEMBL1632170",
          "CHEMBL1632171",
          "CHEMBL1632172",
          "CHEMBL1632173",
          "CHEMBL1632174",
          "CHEMBL1632175",
          "CHEMBL1632176",
          "CHEMBL1729",
          "CHEMBL1748",
          "CHEMBL178285",
          "CHEMBL1784916",
          "CHEMBL1785074",
          "CHEMBL178669",
          "CHEMBL179799",
          "CHEMBL179833",
          "CHEMBL180201",
          "CHEMBL180632",
          "CHEMBL180680",
          "CHEMBL180697",
          "CHEMBL180830",
          "CHEMBL180835",
          "CHEMBL181126",
          "CHEMBL181202",
          "CHEMBL181415",
          "CHEMBL181928",
          "CHEMBL182590",
          "CHEMBL182999",
          "CHEMBL189580",
          "CHEMBL196633",
          "CHEMBL197745",
          "CHEMBL197751",
          "CHEMBL197752",
          "CHEMBL197965",
          "CHEMBL198052",
          "CHEMBL198226",
          "CHEMBL198271",
          "CHEMBL198371",
          "CHEMBL198372",
          "CHEMBL198504",
          "CHEMBL198668",
          "CHEMBL198719",
          "CHEMBL198921",
          "CHEMBL199150",
          "CHEMBL2059577",
          "CHEMBL2059578",
          "CHEMBL2059579",
          "CHEMBL2059580",
          "CHEMBL2059581",
          "CHEMBL2059582",
          "CHEMBL2059583",
          "CHEMBL2059584",
          "CHEMBL2059585",
          "CHEMBL2059586",
          "CHEMBL2059587",
          "CHEMBL2059588",
          "CHEMBL2059589",
          "CHEMBL2059590",
          "CHEMBL2087324",
          "CHEMBL2087325",
          "CHEMBL2087326",
          "CHEMBL2087327",
          "CHEMBL2087328",
          "CHEMBL2087329",
          "CHEMBL2087330",
          "CHEMBL2087331",
          "CHEMBL2087332",
          "CHEMBL2087333",
          "CHEMBL2087334",
          "CHEMBL2087335",
          "CHEMBL2087336",
          "CHEMBL2087337",
          "CHEMBL209821",
          "CHEMBL210288",
          "CHEMBL2112621",
          "CHEMBL2113157",
          "CHEMBL2113158",
          "CHEMBL2113159",
          "CHEMBL2113160",
          "CHEMBL2113283",
          "CHEMBL2113284",
          "CHEMBL2113285",
          "CHEMBL2113286",
          "CHEMBL2113287",
          "CHEMBL2113288",
          "CHEMBL2113289",
          "CHEMBL2113290",
          "CHEMBL2113291",
          "CHEMBL2152922",
          "CHEMBL2177130",
          "CHEMBL2179217",
          "CHEMBL2179222",
          "CHEMBL2179580",
          "CHEMBL2179581",
          "CHEMBL2179582",
          "CHEMBL2179583",
          "CHEMBL2179584",
          "CHEMBL2179585",
          "CHEMBL2179586",
          "CHEMBL2179587",
          "CHEMBL2179588",
          "CHEMBL2179589",
          "CHEMBL2179590",
          "CHEMBL2179670",
          "CHEMBL2179671",
          "CHEMBL2179672",
          "CHEMBL2179673",
          "CHEMBL2179674",
          "CHEMBL2179675",
          "CHEMBL2179676",
          "CHEMBL2179677",
          "CHEMBL2179678",
          "CHEMBL2179679",
          "CHEMBL2179680",
          "CHEMBL2179696",
          "CHEMBL2179697",
          "CHEMBL2179698",
          "CHEMBL2179699",
          "CHEMBL2179700",
          "CHEMBL2179701",
          "CHEMBL2179702",
          "CHEMBL2179703",
          "CHEMBL2179704",
          "CHEMBL2179705",
          "CHEMBL2179706",
          "CHEMBL2179707",
          "CHEMBL2181166",
          "CHEMBL2181168",
          "CHEMBL2181169",
          "CHEMBL2181170",
          "CHEMBL2181171",
          "CHEMBL2181172",
          "CHEMBL2181185",
          "CHEMBL2181187",
          "CHEMBL2181188",
          "CHEMBL2181189",
          "CHEMBL255898",
          "CHEMBL282199",
          "CHEMBL282971",
          "CHEMBL286136",
          "CHEMBL287045",
          "CHEMBL292759",
          "CHEMBL29410",
          "CHEMBL29433",
          "CHEMBL294649",
          "CHEMBL29846",
          "CHEMBL298612",
          "CHEMBL301039",
          "CHEMBL309655",
          "CHEMBL310451",
          "CHEMBL312940",
          "CHEMBL314210",
          "CHEMBL314489",
          "CHEMBL315526",
          "CHEMBL315590",
          "CHEMBL323356",
          "CHEMBL325494",
          "CHEMBL327999",
          "CHEMBL328918",
          "CHEMBL329383",
          "CHEMBL330848",
          "CHEMBL331264",
          "CHEMBL331396",
          "CHEMBL332553",
          "CHEMBL333028",
          "CHEMBL333784",
          "CHEMBL334325",
          "CHEMBL334923",
          "CHEMBL338136",
          "CHEMBL33884",
          "CHEMBL339936",
          "CHEMBL339980",
          "CHEMBL34291",
          "CHEMBL356359",
          "CHEMBL360245",
          "CHEMBL360449",
          "CHEMBL360531",
          "CHEMBL361118",
          "CHEMBL362582",
          "CHEMBL367354",
          "CHEMBL370181",
          "CHEMBL370182",
          "CHEMBL370227",
          "CHEMBL370646",
          "CHEMBL370796",
          "CHEMBL371300",
          "CHEMBL371707",
          "CHEMBL371718",
          "CHEMBL372479",
          "CHEMBL382543",
          "CHEMBL39",
          "CHEMBL390075",
          "CHEMBL390202",
          "CHEMBL390205",
          "CHEMBL399203",
          "CHEMBL408379",
          "CHEMBL414628",
          "CHEMBL420166",
          "CHEMBL420969",
          "CHEMBL421256",
          "CHEMBL424790",
          "CHEMBL425190",
          "CHEMBL431298",
          "CHEMBL433149",
          "CHEMBL442869",
          "CHEMBL452353",
          "CHEMBL470195",
          "CHEMBL472219",
          "CHEMBL481425",
          "CHEMBL488325",
          "CHEMBL490050",
          "CHEMBL490852",
          "CHEMBL493677",
          "CHEMBL497963",
          "CHEMBL511609",
          "CHEMBL518682",
          "CHEMBL522708",
          "CHEMBL538635",
          "CHEMBL538706",
          "CHEMBL538956",
          "CHEMBL539212",
          "CHEMBL539651",
          "CHEMBL539652",
          "CHEMBL539713",
          "CHEMBL540980",
          "CHEMBL540981",
          "CHEMBL541223",
          "CHEMBL541968",
          "CHEMBL541969",
          "CHEMBL542139",
          "CHEMBL549449",
          "CHEMBL549650",
          "CHEMBL549998",
          "CHEMBL550064",
          "CHEMBL550122",
          "CHEMBL550302",
          "CHEMBL550459",
          "CHEMBL550530",
          "CHEMBL551013",
          "CHEMBL551535",
          "CHEMBL551614",
          "CHEMBL551678",
          "CHEMBL551743",
          "CHEMBL551820",
          "CHEMBL551940",
          "CHEMBL551941",
          "CHEMBL552075",
          "CHEMBL552218",
          "CHEMBL552420",
          "CHEMBL552484",
          "CHEMBL552693",
          "CHEMBL552796",
          "CHEMBL553404",
          "CHEMBL553405",
          "CHEMBL553658",
          "CHEMBL553685",
          "CHEMBL553688",
          "CHEMBL555210",
          "CHEMBL555222",
          "CHEMBL555223",
          "CHEMBL555447",
          "CHEMBL555693",
          "CHEMBL556235",
          "CHEMBL556279",
          "CHEMBL556326",
          "CHEMBL556438",
          "CHEMBL556595",
          "CHEMBL557053",
          "CHEMBL557867",
          "CHEMBL558163",
          "CHEMBL558259",
          "CHEMBL558261",
          "CHEMBL558719",
          "CHEMBL558757",
          "CHEMBL558855",
          "CHEMBL558924",
          "CHEMBL559050",
          "CHEMBL559317",
          "CHEMBL559322",
          "CHEMBL559548",
          "CHEMBL559746",
          "CHEMBL560597",
          "CHEMBL560876",
          "CHEMBL560940",
          "CHEMBL561278",
          "CHEMBL561398",
          "CHEMBL562400",
          "CHEMBL562477",
          "CHEMBL562636",
          "CHEMBL562902",
          "CHEMBL563261",
          "CHEMBL563276",
          "CHEMBL563445",
          "CHEMBL563799",
          "CHEMBL565146",
          "CHEMBL56564",
          "CHEMBL569357",
          "CHEMBL569585",
          "CHEMBL570074",
          "CHEMBL570487",
          "CHEMBL570710",
          "CHEMBL570780",
          "CHEMBL571799",
          "CHEMBL572038",
          "CHEMBL572248",
          "CHEMBL572249",
          "CHEMBL583681",
          "CHEMBL584743",
          "CHEMBL585567",
          "CHEMBL585925",
          "CHEMBL59834",
          "CHEMBL61130",
          "CHEMBL62023",
          "CHEMBL68131",
          "CHEMBL74656",
          "CHEMBL76370",
          "CHEMBL79637",
          "CHEMBL80015",
          "CHEMBL8165",
          "CHEMBL82360",
          "CHEMBL82636",
          "CHEMBL82833",
          "CHEMBL83646",
          "CHEMBL83841",
          "CHEMBL83899",
          "CHEMBL83954",
          "CHEMBL84198",
          "CHEMBL84398",
          "CHEMBL85125",
          "CHEMBL85251",
          "CHEMBL86",
          "CHEMBL86624",
          "CHEMBL86777",
          "CHEMBL86985",
          "CHEMBL87063",
          "CHEMBL88355",
          "CHEMBL89225",
          "CHEMBL90559",
          "CHEMBL95104",
          "CHEMBL97019",
          "CHEMBL99591"
        ],
        "number_of_missing_values": "0"
      },
      {
        "data_type": "numeric",
        "index": "1",
        "is_ignore": "false",
        "is_row_identifier": "false",
        "is_target": "false",
        "name": "CATS2D_02_AL",
        "number_of_missing_values": "0"
      },
      {
        "data_type": "numeric",
        "index": "2",
        "is_ignore": "false",
        "is_row_identifier": "false",
        "is_target": "false",
        "name": "MATS1s",
        "number_of_missing_values": "0"
      },
      {
        "data_type": "numeric",
        "index": "3",
        "is_ignore": "false",
        "is_row_identifier": "false",
        "is_target": "false",
        "name": "SssCH2",
        "number_of_missing_values": "0"
      },
      {
        "data_type": "numeric",
        "index": "4",
        "is_ignore": "false",
        "is_row_identifier": "false",
        "is_target": "false",
        "name": "H.052",
        "number_of_missing_values": "0"
      },
      {
        "data_type": "numeric",
        "index": "5",
        "is_ignore": "false",
        "is_row_identifier": "false",
        "is_target": "false",
        "name": "CATS2D_09_AA",
        "number_of_missing_values": "0"
      },
      {
        "data_type": "numeric",
        "index": "6",
        "is_ignore": "false",
        "is_row_identifier": "false",
        "is_target": "false",
        "name": "Chi1_EA.dm.",
        "number_of_missing_values": "0"
      },
      {
        "data_type": "numeric",
        "index": "7",
        "is_ignore": "false",
        "is_row_identifier": "false",
        "is_target": "false",
        "name": "BIC1",
        "number_of_missing_values": "0"
      },
      {
        "data_type": "numeric",
        "index": "8",
        "is_ignore": "false",
        "is_row_identifier": "false",
        "is_target": "false",
        "name": "JGT",
        "number_of_missing_values": "0"
      },
      {
        "data_type": "numeric",
        "index": "9",
        "is_ignore": "false",
        "is_row_identifier": "false",
        "is_target": "false",
        "name": "CIC1",
        "number_of_missing_values": "0"
      },
      {
        "data_type": "numeric",
        "index": "10",
        "is_ignore": "false",
        "is_row_identifier": "false",
        "is_target": "false",
        "name": "Eig01_AEA.ri.",
        "number_of_missing_values": "0"
      },
      {
        "data_type": "numeric",
        "index": "11",
        "is_ignore": "false",
        "is_row_identifier": "false",
        "is_target": "false",
        "name": "SpMax_AEA.ri.",
        "number_of_missing_values": "0"
      },
      {
        "data_type": "numeric",
        "index": "12",
        "is_ignore": "false",
        "is_row_identifier": "false",
        "is_target": "false",
        "name": "SIC1",
        "number_of_missing_values": "0"
      },
      {
        "data_type": "numeric",
        "index": "13",
        "is_ignore": "false",
        "is_row_identifier": "false",
        "is_target": "false",
        "name": "MATS1v",
        "number_of_missing_values": "0"
      },
      {
        "data_type": "numeric",
        "index": "14",
        "is_ignore": "false",
        "is_row_identifier": "false",
        "is_target": "false",
        "name": "Eig08_EA.ed.",
        "number_of_missing_values": "0"
      },
      {
        "data_type": "numeric",
        "index": "15",
        "is_ignore": "false",
        "is_row_identifier": "false",
        "is_target": "false",
        "name": "SM03_AEA.ri.",
        "number_of_missing_values": "0"
      },
      {
        "data_type": "numeric",
        "index": "16",
        "is_ignore": "false",
        "is_row_identifier": "false",
        "is_target": "false",
        "name": "JGI4",
        "number_of_missing_values": "0"
      },
      {
        "data_type": "numeric",
        "index": "17",
        "is_ignore": "false",
        "is_row_identifier": "false",
        "is_target": "false",
        "name": "Eig08_EA.ri.",
        "number_of_missing_values": "0"
      },
      {
        "data_type": "numeric",
        "index": "18",
        "is_ignore": "false",
        "is_row_identifier": "false",
        "is_target": "false",
        "name": "GATS2m",
        "number_of_missing_values": "0"
      },
      {
        "data_type": "numeric",
        "index": "19",
        "is_ignore": "false",
        "is_row_identifier": "false",
        "is_target": "false",
        "name": "SpMin6_Bh.s.",
        "number_of_missing_values": "0"
      },
      {
        "data_type": "numeric",
        "index": "20",
        "is_ignore": "false",
        "is_row_identifier": "false",
        "is_target": "false",
        "name": "Eig08_AEA.ri.",
        "number_of_missing_values": "0"
      },
      {
        "data_type": "numeric",
        "index": "21",
        "is_ignore": "false",
        "is_row_identifier": "false",
        "is_target": "false",
        "name": "GATS3m",
        "number_of_missing_values": "0"
      },
      {
        "data_type": "numeric",
        "index": "22",
        "is_ignore": "false",
        "is_row_identifier": "false",
        "is_target": "false",
        "name": "CATS2D_04_AA",
        "number_of_missing_values": "0"
      },
      {
        "data_type": "numeric",
        "index": "23",
        "is_ignore": "false",
        "is_row_identifier": "false",
        "is_target": "false",
        "name": "Eig08_AEA.ed.",
        "number_of_missing_values": "0"
      },
      {
        "data_type": "numeric",
        "index": "24",
        "is_ignore": "false",
        "is_row_identifier": "false",
        "is_target": "false",
        "name": "SpMin2_Bh.p.",
        "number_of_missing_values": "0"
      },
      {
        "data_type": "numeric",
        "index": "25",
        "is_ignore": "false",
        "is_row_identifier": "false",
        "is_target": "false",
        "name": "GGI9",
        "number_of_missing_values": "0"
      },
      {
        "data_type": "numeric",
        "index": "26",
        "is_ignore": "false",
        "is_row_identifier": "false",
        "is_target": "false",
        "name": "Eta_alpha_A",
        "number_of_missing_values": "0"
      },
      {
        "data_type": "numeric",
        "index": "27",
        "is_ignore": "false",
        "is_row_identifier": "false",
        "is_target": "false",
        "name": "SpMin2_Bh.v.",
        "number_of_missing_values": "0"
      },
      {
        "data_type": "numeric",
        "index": "28",
        "is_ignore": "false",
        "is_row_identifier": "false",
        "is_target": "false",
        "name": "Eig05_AEA.dm.",
        "number_of_missing_values": "0"
      },
      {
        "data_type": "numeric",
        "index": "29",
        "is_ignore": "false",
        "is_row_identifier": "false",
        "is_target": "false",
        "name": "SM09_EA.ed.",
        "number_of_missing_values": "0"
      },
      {
        "data_type": "numeric",
        "index": "30",
        "is_ignore": "false",
        "is_row_identifier": "false",
        "is_target": "false",
        "name": "SM10_EA.ed.",
        "number_of_missing_values": "0"
      },
      {
        "data_type": "numeric",
        "index": "31",
        "is_ignore": "false",
        "is_row_identifier": "false",
        "is_target": "false",
        "name": "SM11_EA.ed.",
        "number_of_missing_values": "0"
      },
      {
        "data_type": "numeric",
        "index": "32",
        "is_ignore": "false",
        "is_row_identifier": "false",
        "is_target": "false",
        "name": "GATS1v",
        "number_of_missing_values": "0"
      },
      {
        "data_type": "numeric",
        "index": "33",
        "is_ignore": "false",
        "is_row_identifier": "false",
        "is_target": "false",
        "name": "CATS2D_03_AL",
        "number_of_missing_values": "0"
      },
      {
        "data_type": "numeric",
        "index": "34",
        "is_ignore": "false",
        "is_row_identifier": "false",
        "is_target": "false",
        "name": "Ram",
        "number_of_missing_values": "0"
      },
      {
        "data_type": "numeric",
        "index": "35",
        "is_ignore": "false",
        "is_row_identifier": "false",
        "is_target": "false",
        "name": "SssO",
        "number_of_missing_values": "0"
      },
      {
        "data_type": "numeric",
        "index": "36",
        "is_ignore": "false",
        "is_row_identifier": "false",
        "is_target": "false",
        "name": "ATSC4v",
        "number_of_missing_values": "0"
      },
      {
        "data_type": "numeric",
        "index": "37",
        "is_ignore": "false",
        "is_row_identifier": "false",
        "is_target": "false",
        "name": "P_VSA_MR_2",
        "number_of_missing_values": "0"
      },
      {
        "data_type": "numeric",
        "index": "38",
        "is_ignore": "false",
        "is_row_identifier": "false",
        "is_target": "false",
        "name": "NdssC",
        "number_of_missing_values": "0"
      },
      {
        "data_type": "numeric",
        "index": "39",
        "is_ignore": "false",
        "is_row_identifier": "false",
        "is_target": "false",
        "name": "SpDiam_AEA.bo.",
        "number_of_missing_values": "0"
      },
      {
        "data_type": "numeric",
        "index": "40",
        "is_ignore": "false",
        "is_row_identifier": "false",
        "is_target": "false",
        "name": "Eig06_EA.ri.",
        "number_of_missing_values": "0"
      },
      {
        "data_type": "numeric",
        "index": "41",
        "is_ignore": "false",
        "is_row_identifier": "false",
        "is_target": "false",
        "name": "nCconj",
        "number_of_missing_values": "0"
      },
      {
        "data_type": "numeric",
        "index": "42",
        "is_ignore": "false",
        "is_row_identifier": "false",
        "is_target": "false",
        "name": "SpDiam_EA.ed.",
        "number_of_missing_values": "0"
      },
      {
        "data_type": "numeric",
        "index": "43",
        "is_ignore": "false",
        "is_row_identifier": "false",
        "is_target": "false",
        "name": "Eig13_AEA.ed.",
        "number_of_missing_values": "0"
      },
      {
        "data_type": "numeric",
        "index": "44",
        "is_ignore": "false",
        "is_row_identifier": "false",
        "is_target": "false",
        "name": "SpMAD_AEA.ed.",
        "number_of_missing_values": "0"
      },
      {
        "data_type": "numeric",
        "index": "45",
        "is_ignore": "false",
        "is_row_identifier": "false",
        "is_target": "false",
        "name": "SsssCH",
        "number_of_missing_values": "0"
      },
      {
        "data_type": "numeric",
        "index": "46",
        "is_ignore": "false",
        "is_row_identifier": "false",
        "is_target": "false",
        "name": "Eig08_AEA.dm.",
        "number_of_missing_values": "0"
      },
      {
        "data_type": "numeric",
        "index": "47",
        "is_ignore": "false",
        "is_row_identifier": "false",
        "is_target": "false",
        "name": "nCrt",
        "number_of_missing_values": "0"
      },
      {
        "data_type": "numeric",
        "index": "48",
        "is_ignore": "false",
        "is_row_identifier": "false",
        "is_target": "false",
        "name": "SpMin7_Bh.e.",
        "number_of_missing_values": "0"
      },
      {
        "data_type": "numeric",
        "index": "49",
        "is_ignore": "false",
        "is_row_identifier": "false",
        "is_target": "false",
        "name": "nRCONHR",
        "number_of_missing_values": "0"
      },
      {
        "data_type": "numeric",
        "index": "50",
        "is_ignore": "false",
        "is_row_identifier": "false",
        "is_target": "false",
        "name": "nCt",
        "number_of_missing_values": "0"
      },
      {
        "data_type": "numeric",
        "index": "51",
        "is_ignore": "false",
        "is_row_identifier": "false",
        "is_target": "false",
        "name": "Eig01_EA.ed.",
        "number_of_missing_values": "0"
      },
      {
        "data_type": "numeric",
        "index": "52",
        "is_ignore": "false",
        "is_row_identifier": "false",
        "is_target": "false",
        "name": "SM10_AEA.dm.",
        "number_of_missing_values": "0"
      },
      {
        "data_type": "numeric",
        "index": "53",
        "is_ignore": "false",
        "is_row_identifier": "false",
        "is_target": "false",
        "name": "SpMax_EA.ed.",
        "number_of_missing_values": "0"
      },
      {
        "data_type": "numeric",
        "index": "54",
        "is_ignore": "false",
        "is_row_identifier": "false",
        "is_target": "false",
        "name": "Eta_sh_p",
        "number_of_missing_values": "0"
      },
      {
        "data_type": "numeric",
        "index": "55",
        "is_ignore": "false",
        "is_row_identifier": "false",
        "is_target": "false",
        "name": "SM08_EA.ed.",
        "number_of_missing_values": "0"
      },
      {
        "data_type": "numeric",
        "index": "56",
        "is_ignore": "false",
        "is_row_identifier": "false",
        "is_target": "false",
        "name": "Eig01_EA",
        "number_of_missing_values": "0"
      },
      {
        "data_type": "numeric",
        "index": "57",
        "is_ignore": "false",
        "is_row_identifier": "false",
        "is_target": "false",
        "name": "SM09_AEA.bo.",
        "number_of_missing_values": "0"
      },
      {
        "data_type": "numeric",
        "index": "58",
        "is_ignore": "false",
        "is_row_identifier": "false",
        "is_target": "false",
        "name": "SpDiam_EA",
        "number_of_missing_values": "0"
      },
      {
        "data_type": "numeric",
        "index": "59",
        "is_ignore": "false",
        "is_row_identifier": "false",
        "is_target": "false",
        "name": "SpMax_EA",
        "number_of_missing_values": "0"
      },
      {
        "data_type": "numeric",
        "index": "60",
        "is_ignore": "false",
        "is_row_identifier": "false",
        "is_target": "false",
        "name": "SpMin7_Bh.i.",
        "number_of_missing_values": "0"
      },
      {
        "data_type": "numeric",
        "index": "61",
        "is_ignore": "false",
        "is_row_identifier": "false",
        "is_target": "false",
        "name": "SpMin4_Bh.p.",
        "number_of_missing_values": "0"
      },
      {
        "data_type": "numeric",
        "index": "62",
        "is_ignore": "false",
        "is_row_identifier": "false",
        "is_target": "false",
        "name": "X0A",
        "number_of_missing_values": "0"
      },
      {
        "data_type": "numeric",
        "index": "63",
        "is_ignore": "false",
        "is_row_identifier": "false",
        "is_target": "false",
        "name": "GGI3",
        "number_of_missing_values": "0"
      },
      {
        "data_type": "numeric",
        "index": "64",
        "is_ignore": "false",
        "is_row_identifier": "false",
        "is_target": "false",
        "name": "Eig07_AEA.ed.",
        "number_of_missing_values": "0"
      },
      {
        "data_type": "numeric",
        "index": "65",
        "is_ignore": "false",
        "is_row_identifier": "false",
        "is_target": "false",
        "name": "N.072",
        "number_of_missing_values": "0"
      },
      {
        "data_type": "numeric",
        "index": "66",
        "is_ignore": "false",
        "is_row_identifier": "false",
        "is_target": "false",
        "name": "Eig04_EA.ed.",
        "number_of_missing_values": "0"
      },
      {
        "data_type": "numeric",
        "index": "67",
        "is_ignore": "false",
        "is_row_identifier": "false",
        "is_target": "false",
        "name": "SM13_AEA.dm.",
        "number_of_missing_values": "0"
      },
      {
        "data_type": "numeric",
        "index": "68",
        "is_ignore": "false",
        "is_row_identifier": "false",
        "is_target": "true",
        "name": "pXC50",
        "number_of_missing_values": "0"
      }
    ]
  }
}