{
  "data_set_description": {
    "collection_date": "November 2013",
    "creator": "Dr Jeremy Besnard, Dr Ivan Olier, Dr Noureddin Sadawi, Dr Larisa Soldatova, Dr Crina Grosan, Prof Ross King, Dr Richard Bickerton, Prof Andrew Hopkins and Dr Willem van Hoorn",
    "default_target_attribute": "pXC50",
    "description": "This dataset contains QSAR data (from ChEMBL version 17) showing activity values (unit is pseudo-pCI50) of several compounds on drug target ChEMBL_ID: CHEMBL4727 (TID: 20006), and it has 14 rows and 43 features (not including molecule IDs and class feature: molecule_id and pXC50). The features represent Basic Molecular Descriptors which were generated from SMILES strings.  Missing value imputation was applied to this dataset (By choosing the Median).",
    "description_version": "1",
    "file_id": "3663228",
    "format": "ARFF",
    "id": "39103",
    "licence": "Public",
    "md5_checksum": "2e3782509fc4e6418296b3bb2213f193",
    "minio_url": "https://data.openml.org/datasets/0003/39103/dataset_39103.pq",
    "name": "QSAR-DATASET-FOR-DRUG-TARGET-CHEMBL4727",
    "original_data_url": "https://www.ebi.ac.uk/chembl/target/inspect/CHEMBL4727",
    "parquet_url": "https://data.openml.org/datasets/0003/39103/dataset_39103.pq",
    "processing_date": "2018-10-04 06:11:36",
    "row_id_attribute": "molecule_id",
    "status": "deactivated",
    "tag": [
      "MetaQSAR",
      "study_13"
    ],
    "upload_date": "2016-07-16T06:41:30",
    "url": "https://api.openml.org/data/v1/download/3663228/QSAR-DATASET-FOR-DRUG-TARGET-CHEMBL4727.arff",
    "version": "12",
    "visibility": "public"
  }
}