{
  "data_features": {
    "feature": [
      {
        "data_type": "nominal",
        "index": "0",
        "is_ignore": "false",
        "is_row_identifier": "true",
        "is_target": "false",
        "name": "molecule_id",
        "nominal_value": [
          "CHEMBL10592",
          "CHEMBL1159759",
          "CHEMBL1159760",
          "CHEMBL1159761",
          "CHEMBL1159762",
          "CHEMBL1159763",
          "CHEMBL1159764",
          "CHEMBL1159765",
          "CHEMBL1159767",
          "CHEMBL1159769",
          "CHEMBL1159770",
          "CHEMBL1159772",
          "CHEMBL1159773",
          "CHEMBL1160181",
          "CHEMBL1160188",
          "CHEMBL1160189",
          "CHEMBL1160192",
          "CHEMBL1160200",
          "CHEMBL117348",
          "CHEMBL122959",
          "CHEMBL1229651",
          "CHEMBL1229661",
          "CHEMBL1229792",
          "CHEMBL1231545",
          "CHEMBL1231557",
          "CHEMBL124256",
          "CHEMBL124631",
          "CHEMBL12787",
          "CHEMBL129330",
          "CHEMBL132426",
          "CHEMBL132934",
          "CHEMBL133279",
          "CHEMBL134170",
          "CHEMBL134617",
          "CHEMBL138500",
          "CHEMBL140323",
          "CHEMBL141118",
          "CHEMBL141869",
          "CHEMBL142176",
          "CHEMBL154935",
          "CHEMBL158034",
          "CHEMBL166915",
          "CHEMBL170846",
          "CHEMBL171480",
          "CHEMBL171757",
          "CHEMBL176072",
          "CHEMBL179448",
          "CHEMBL1814075",
          "CHEMBL1814076",
          "CHEMBL1814077",
          "CHEMBL1814078",
          "CHEMBL1814079",
          "CHEMBL1814080",
          "CHEMBL1814081",
          "CHEMBL1814082",
          "CHEMBL1814083",
          "CHEMBL1814084",
          "CHEMBL1814085",
          "CHEMBL1814086",
          "CHEMBL1814087",
          "CHEMBL1814088",
          "CHEMBL1814089",
          "CHEMBL1814090",
          "CHEMBL1814091",
          "CHEMBL1814092",
          "CHEMBL1814093",
          "CHEMBL1814094",
          "CHEMBL1814095",
          "CHEMBL1814096",
          "CHEMBL192632",
          "CHEMBL193275",
          "CHEMBL2051758",
          "CHEMBL2051976",
          "CHEMBL21294",
          "CHEMBL214872",
          "CHEMBL215133",
          "CHEMBL216560",
          "CHEMBL216675",
          "CHEMBL217000",
          "CHEMBL217227",
          "CHEMBL217760",
          "CHEMBL217765",
          "CHEMBL219544",
          "CHEMBL223279",
          "CHEMBL225071",
          "CHEMBL225072",
          "CHEMBL22632",
          "CHEMBL22793",
          "CHEMBL25889",
          "CHEMBL264245",
          "CHEMBL265510",
          "CHEMBL267890",
          "CHEMBL278466",
          "CHEMBL279395",
          "CHEMBL280145",
          "CHEMBL282570",
          "CHEMBL28799",
          "CHEMBL28820",
          "CHEMBL29053",
          "CHEMBL296816",
          "CHEMBL299273",
          "CHEMBL302068",
          "CHEMBL303171",
          "CHEMBL306149",
          "CHEMBL325414",
          "CHEMBL331208",
          "CHEMBL336487",
          "CHEMBL34259",
          "CHEMBL350097",
          "CHEMBL350921",
          "CHEMBL360335",
          "CHEMBL360758",
          "CHEMBL362606",
          "CHEMBL365307",
          "CHEMBL36623",
          "CHEMBL36639",
          "CHEMBL374172",
          "CHEMBL385296",
          "CHEMBL385891",
          "CHEMBL386282",
          "CHEMBL386442",
          "CHEMBL386685",
          "CHEMBL387007",
          "CHEMBL389051",
          "CHEMBL400364",
          "CHEMBL400485",
          "CHEMBL411871",
          "CHEMBL415447",
          "CHEMBL416879",
          "CHEMBL416922",
          "CHEMBL418764",
          "CHEMBL418875",
          "CHEMBL422395",
          "CHEMBL425692",
          "CHEMBL431359",
          "CHEMBL435778",
          "CHEMBL439973",
          "CHEMBL458184",
          "CHEMBL463667",
          "CHEMBL463668",
          "CHEMBL464503",
          "CHEMBL465890",
          "CHEMBL465891",
          "CHEMBL48230",
          "CHEMBL48619",
          "CHEMBL49651",
          "CHEMBL510652",
          "CHEMBL514589",
          "CHEMBL517182",
          "CHEMBL518076",
          "CHEMBL54833",
          "CHEMBL55167",
          "CHEMBL55437",
          "CHEMBL56005",
          "CHEMBL57269",
          "CHEMBL57310",
          "CHEMBL59261",
          "CHEMBL607417",
          "CHEMBL607418",
          "CHEMBL609693",
          "CHEMBL63857",
          "CHEMBL66389",
          "CHEMBL66864",
          "CHEMBL67116",
          "CHEMBL69016",
          "CHEMBL74139",
          "CHEMBL75888",
          "CHEMBL8016",
          "CHEMBL89641"
        ],
        "number_of_missing_values": "0"
      },
      {
        "data_type": "numeric",
        "index": "1",
        "is_ignore": "false",
        "is_row_identifier": "false",
        "is_target": "false",
        "name": "RBF",
        "number_of_missing_values": "0"
      },
      {
        "data_type": "numeric",
        "index": "2",
        "is_ignore": "false",
        "is_row_identifier": "false",
        "is_target": "false",
        "name": "RBN",
        "number_of_missing_values": "0"
      },
      {
        "data_type": "numeric",
        "index": "3",
        "is_ignore": "false",
        "is_row_identifier": "false",
        "is_target": "false",
        "name": "nP",
        "number_of_missing_values": "0"
      },
      {
        "data_type": "numeric",
        "index": "4",
        "is_ignore": "false",
        "is_row_identifier": "false",
        "is_target": "false",
        "name": "Sv",
        "number_of_missing_values": "0"
      },
      {
        "data_type": "numeric",
        "index": "5",
        "is_ignore": "false",
        "is_row_identifier": "false",
        "is_target": "false",
        "name": "Sp",
        "number_of_missing_values": "0"
      },
      {
        "data_type": "numeric",
        "index": "6",
        "is_ignore": "false",
        "is_row_identifier": "false",
        "is_target": "false",
        "name": "nC",
        "number_of_missing_values": "0"
      },
      {
        "data_type": "numeric",
        "index": "7",
        "is_ignore": "false",
        "is_row_identifier": "false",
        "is_target": "false",
        "name": "nHet",
        "number_of_missing_values": "0"
      },
      {
        "data_type": "numeric",
        "index": "8",
        "is_ignore": "false",
        "is_row_identifier": "false",
        "is_target": "false",
        "name": "SCBO",
        "number_of_missing_values": "0"
      },
      {
        "data_type": "numeric",
        "index": "9",
        "is_ignore": "false",
        "is_row_identifier": "false",
        "is_target": "false",
        "name": "nSK",
        "number_of_missing_values": "0"
      },
      {
        "data_type": "numeric",
        "index": "10",
        "is_ignore": "false",
        "is_row_identifier": "false",
        "is_target": "false",
        "name": "Si",
        "number_of_missing_values": "0"
      },
      {
        "data_type": "numeric",
        "index": "11",
        "is_ignore": "false",
        "is_row_identifier": "false",
        "is_target": "false",
        "name": "N.",
        "number_of_missing_values": "0"
      },
      {
        "data_type": "numeric",
        "index": "12",
        "is_ignore": "false",
        "is_row_identifier": "false",
        "is_target": "true",
        "name": "pXC50",
        "number_of_missing_values": "0"
      }
    ]
  }
}