"molecule_id","AMW","C.","H.","Me","Mi","Mp","Mv","MW","N.","nAB","nAT","nB","nBM","nBO","nBR","nBT","nC","nCL","nCsp","nCsp2","nCsp3","nDB","nF","nH","nHet","nHM","nI","nN","nO","nP","nS","nSK","nTB","nX","O.","RBF","RBN","SCBO","Se","Si","Sp","Sv","X.","pXC50"
{1 7.691,2 42.4,3 43.9,4 1.017,5 1.121,6 0.656,7 0.638,8 507.58,9 1.5,10 18,11 66,13 19,14 41,16 70,17 28,20 19,21 9,22 1,24 29,25 9,28 1,29 8,32 37,35 12.1,36 0.1,37 7,38 51,39 67.091,40 73.986,41 43.301,42 42.115,44 7.699}
{0 CHEMBL2169895,1 7.899,2 43.8,3 42.2,4 1.019,5 1.118,6 0.665,7 0.65,8 505.56,9 1.6,10 18,11 64,13 20,14 41,16 68,17 28,20 20,21 8,22 2,24 27,25 9,28 1,29 8,32 37,35 12.5,36 0.103,37 7,38 52,39 65.207,40 71.571,41 42.54,42 41.588,44 6.347}
{0 CHEMBL2170553,1 7.755,2 43.3,3 43.3,4 1.016,5 1.119,6 0.661,7 0.644,8 519.59,9 1.5,10 18,11 67,13 20,14 42,16 71,17 29,20 20,21 9,22 2,24 29,25 9,28 1,29 8,32 38,35 11.9,36 0.099,37 7,38 53,39 68.091,40 74.986,41 44.301,42 43.115,44 5.699}
{0 CHEMBL2170554,1 7.623,2 42.9,3 44.3,4 1.014,5 1.12,6 0.658,7 0.638,8 533.62,9 1.4,10 18,11 70,13 20,14 43,16 74,17 30,20 20,21 10,22 2,24 31,25 9,28 1,29 8,32 39,35 11.4,36 0.095,37 7,38 54,39 70.974,40 78.402,41 46.063,42 44.642,44 5.301}
{0 CHEMBL2170555,1 7.763,2 44.6,3 43.1,4 1.015,5 1.115,6 0.666,7 0.648,8 504.57,10 18,11 65,13 20,14 41,16 69,17 29,20 20,21 9,22 2,24 28,25 8,29 8,32 37,35 12.3,36 0.101,37 7,38 52,39 65.989,40 72.488,41 43.296,42 42.094,44 7.523}
{0 CHEMBL2170556,1 7.992,2 45.9,3 41,4 1.016,5 1.114,6 0.677,7 0.661,8 487.54,9 1.6,10 18,11 61,13 20,14 40,16 65,17 28,19 1,20 19,21 8,22 1,24 25,25 8,28 1,29 7,32 36,33 1,35 11.5,36 0.092,37 6,38 52,39 61.996,40 67.947,41 41.324,42 40.347,44 7.824}
{0 CHEMBL2170557,1 8.283,2 45,3 41.7,4 1.018,5 1.113,6 0.682,7 0.661,8 496.97,10 18,11 60,13 19,14 39,16 64,17 27,18 1,20 19,21 8,22 1,24 25,25 8,26 1,29 7,32 35,34 1,35 11.7,36 0.094,37 6,38 49,39 61.102,40 66.807,41 40.938,42 39.679,43 1.7,44 7.155}
{0 CHEMBL2170558,1 7.564,2 44.4,3 44.4,4 1.011,5 1.116,6 0.664,7 0.641,8 476.56,10 18,11 63,13 19,14 39,16 67,17 28,20 19,21 9,22 1,24 28,25 7,29 7,32 35,35 11.1,36 0.09,37 6,38 49,39 63.662,40 70.279,41 41.841,42 40.379,44 7}
{0 CHEMBL2170559,1 7.992,2 45.9,3 41,4 1.016,5 1.114,6 0.677,7 0.661,8 487.54,9 1.6,10 18,11 61,13 20,14 40,16 65,17 28,19 1,20 19,21 8,22 1,24 25,25 8,28 1,29 7,32 36,33 1,35 11.5,36 0.092,37 6,38 52,39 61.996,40 67.947,41 41.324,42 40.347,44 7.77}
{0 CHEMBL2170560,1 7.503,2 39.3,3 46.1,4 1.019,5 1.127,6 0.637,7 0.619,8 667.77,9 1.1,10 18,11 89,13 19,14 53,16 94,17 35,20 19,21 16,22 1,24 41,25 13,28 1,29 12,32 48,35 13.5,36 0.106,37 10,38 63,39 90.701,40 100.315,41 56.688,42 55.135,44 7.721}
{0 CHEMBL2170561,1 7.503,2 40.7,3 45.7,4 1.016,5 1.124,6 0.645,7 0.625,8 607.71,9 1.2,10 18,11 81,13 19,14 49,16 86,17 33,20 19,21 14,22 1,24 37,25 11,28 1,29 10,32 44,35 12.3,36 0.093,37 8,38 59,39 82.28,40 91.066,41 52.256,42 50.652,44 7.638}
{0 CHEMBL2170562,1 7.701,2 44.6,3 43.1,4 1.01,5 1.118,6 0.671,7 0.649,8 500.59,9 3.1,10 18,11 65,13 20,14 41,16 69,17 29,19 1,20 19,21 9,22 1,24 28,25 8,28 2,29 6,32 37,33 1,35 9.2,36 0.072,37 5,38 53,39 65.654,40 72.651,41 43.637,42 42.18,44 7.456}
{0 CHEMBL2170563,1 7.969,2 43.8,3 43.8,4 1.012,5 1.117,6 0.676,7 0.649,8 510.02,9 1.6,10 18,11 64,13 19,14 40,16 68,17 28,18 1,20 19,21 9,22 1,24 28,25 8,26 1,28 1,29 6,32 36,34 1,35 9.4,36 0.074,37 5,38 50,39 64.76,40 71.512,41 43.25,42 41.513,43 1.6,44 7.824}
{0 CHEMBL2170703,1 7.701,2 44.6,3 43.1,4 1.01,5 1.118,6 0.671,7 0.649,8 500.59,9 3.1,10 18,11 65,13 20,14 41,16 69,17 29,19 1,20 19,21 9,22 1,24 28,25 8,28 2,29 6,32 37,33 1,35 9.2,36 0.072,37 5,38 53,39 65.654,40 72.651,41 43.637,42 42.18,44 7.398}
{0 CHEMBL2170704,1 7.611,2 41,3 44.9,4 1.018,5 1.124,6 0.647,7 0.63,8 593.68,9 1.3,10 18,11 78,13 19,14 48,16 83,17 32,20 19,21 13,22 1,24 35,25 11,28 1,29 10,32 43,35 12.8,36 0.108,37 9,38 58,39 79.396,40 87.651,41 50.494,42 49.125,44 5.456}
{0 CHEMBL2170705,1 7.503,2 40.7,3 45.7,4 1.016,5 1.124,6 0.645,7 0.625,8 607.71,9 1.2,10 18,11 81,13 19,14 49,16 86,17 33,20 19,21 14,22 1,24 37,25 11,28 1,29 10,32 44,35 12.3,36 0.105,37 9,38 59,39 82.28,40 91.066,41 52.256,42 50.652,44 5.301}
{0 CHEMBL2170706,1 7.709,2 45,3 43.3,4 1.013,5 1.114,6 0.668,7 0.648,8 462.53,10 18,11 60,13 19,14 38,16 64,17 27,20 19,21 8,22 1,24 26,25 7,29 7,32 34,35 11.7,36 0.094,37 6,38 48,39 60.778,40 66.863,41 40.08,42 38.852,44 5.5}
{0 CHEMBL2170707,1 7.564,2 44.4,3 44.4,4 1.011,5 1.116,6 0.664,7 0.641,8 476.56,10 18,11 63,13 19,14 39,16 67,17 28,20 19,21 9,22 1,24 28,25 7,29 7,32 35,35 11.1,36 0.09,37 6,38 49,39 63.662,40 70.279,41 41.841,42 40.379,44 5.301}
{0 CHEMBL2170708,1 7.702,2 43.5,3 43.5,4 1.014,5 1.119,6 0.663,7 0.643,8 477.55,9 1.6,10 18,11 62,13 19,14 39,16 66,17 27,20 19,21 8,22 1,24 27,25 8,28 1,29 7,32 35,35 11.3,36 0.091,37 6,38 49,39 62.88,40 69.362,41 41.085,42 39.873,44 5.699}
{0 CHEMBL2170709,1 7.563,2 43.1,3 44.6,4 1.012,5 1.12,6 0.659,7 0.637,8 491.58,9 1.5,10 18,11 65,13 19,14 40,16 69,17 28,20 19,21 9,22 1,24 29,25 8,28 1,29 7,32 36,35 10.8,36 0.101,37 7,38 50,39 65.763,40 72.777,41 42.847,42 41.4,44 6.155}
{0 CHEMBL2170710,1 7.435,2 42.6,3 45.6,4 1.01,5 1.12,6 0.656,7 0.631,8 505.61,9 1.5,10 18,11 68,13 19,14 41,16 72,17 29,20 19,21 10,22 1,24 31,25 8,28 1,29 7,32 37,35 10.3,36 0.097,37 7,38 51,39 68.647,40 76.192,41 44.608,42 42.927,44 5.5}
{0 CHEMBL2170711,1 8.171,2 41.2,3 42.6,4 1.022,5 1.119,6 0.668,7 0.647,8 555.65,9 1.5,10 18,11 68,13 21,14 43,16 72,17 28,20 19,21 9,22 3,24 29,25 11,26 1,28 1,29 9,31 1,32 39,35 13.2,36 0.111,37 8,38 55,39 69.494,40 76.116,41 45.403,42 44.017,44 5.301}
{0 CHEMBL2170712,1 8.04,2 44.4,3 41.3,4 1.023,5 1.116,6 0.666,7 0.655,8 506.54,10 18,11 63,13 20,14 41,16 67,17 28,20 20,21 8,22 2,24 26,25 9,29 9,32 37,35 14.3,36 0.104,37 7,38 52,39 64.433,40 70.282,41 41.989,42 41.282,44 5.301}
{0 CHEMBL2170713,1 7.887,2 43.9,3 42.4,4 1.02,5 1.117,6 0.663,7 0.649,8 520.57,10 18,11 66,13 20,14 42,16 70,17 29,20 20,21 9,22 2,24 28,25 9,29 9,32 38,35 13.6,36 0.114,37 8,38 53,39 67.316,40 73.697,41 43.75,42 42.808,44 8.398}
{0 CHEMBL2170714,1 7.604,2 40.5,3 45.2,4 1.02,5 1.124,6 0.642,7 0.626,8 638.72,10 18,11 84,13 19,14 51,16 89,17 34,20 19,21 15,22 1,24 38,25 12,29 12,32 46,35 14.3,36 0.124,37 11,38 61,39 85.716,40 94.402,41 53.921,42 52.587,44 8.301}
{0 CHEMBL2170715,1 7.604,2 40.5,3 45.2,4 1.02,5 1.124,6 0.642,7 0.626,8 638.72,10 18,11 84,13 19,14 51,16 89,17 34,20 19,21 15,22 1,24 38,25 12,29 12,32 46,35 14.3,36 0.124,37 11,38 61,39 85.716,40 94.402,41 53.921,42 52.587,44 5.456}
{0 CHEMBL2170716,1 7.604,2 40.5,3 45.2,4 1.02,5 1.124,6 0.642,7 0.626,8 638.72,10 18,11 84,13 19,14 51,16 89,17 34,20 19,21 15,22 1,24 38,25 12,29 12,32 46,35 14.3,36 0.124,37 11,38 61,39 85.716,40 94.402,41 53.921,42 52.587,44 6.561}
{0 CHEMBL2170717,1 7.604,2 40.5,3 45.2,4 1.02,5 1.124,6 0.642,7 0.626,8 638.72,10 18,11 84,13 19,14 51,16 89,17 34,20 19,21 15,22 1,24 38,25 12,29 12,32 46,35 14.3,36 0.124,37 11,38 61,39 85.716,40 94.402,41 53.921,42 52.587,44 5.699}
{0 CHEMBL2170718,1 7.712,2 40.7,3 44.4,4 1.023,5 1.123,6 0.644,7 0.63,8 624.69,10 18,11 81,13 19,14 50,16 86,17 33,20 19,21 14,22 1,24 36,25 12,29 12,32 45,35 14.8,36 0.116,37 10,38 60,39 82.832,40 90.986,41 52.159,42 51.06,44 7.222}
{0 CHEMBL2170719,1 7.712,2 40.7,3 44.4,4 1.023,5 1.123,6 0.644,7 0.63,8 624.69,10 18,11 81,13 19,14 50,16 86,17 33,20 19,21 14,22 1,24 36,25 12,29 12,32 45,35 14.8,36 0.116,37 10,38 60,39 82.832,40 90.986,41 52.159,42 51.06,44 6.62}
{0 CHEMBL2170720,1 7.712,2 40.7,3 44.4,4 1.023,5 1.123,6 0.644,7 0.63,8 624.69,10 18,11 81,13 19,14 50,16 86,17 33,20 19,21 14,22 1,24 36,25 12,29 12,32 45,35 14.8,36 0.116,37 10,38 60,39 82.832,40 90.986,41 52.159,42 51.06,44 5.602}
{0 CHEMBL2170721,1 7.712,2 40.7,3 44.4,4 1.023,5 1.123,6 0.644,7 0.63,8 624.69,10 18,11 81,13 19,14 50,16 86,17 33,20 19,21 14,22 1,24 36,25 12,29 12,32 45,35 14.8,36 0.116,37 10,38 60,39 82.832,40 90.986,41 52.159,42 51.06,44 5.5}
{0 CHEMBL2170722,1 7.723,2 41.6,3 44.2,4 1.021,5 1.122,6 0.649,7 0.634,8 594.66,10 18,11 77,13 19,14 48,16 82,17 32,20 19,21 13,22 1,24 34,25 11,29 11,32 43,35 14.3,36 0.11,37 9,38 58,39 78.622,40 86.362,41 49.943,42 48.818,44 7.398}
{0 CHEMBL2170723,1 7.502,2 41.8,3 45.6,4 1.015,5 1.121,6 0.649,7 0.628,8 592.69,10 18,11 79,13 19,14 48,16 84,17 33,20 19,21 14,22 1,24 36,25 10,29 10,32 43,35 12.7,36 0.107,37 9,38 58,39 80.178,40 88.568,41 51.25,42 49.63,44 5.699}
{0 CHEMBL2170724,1 7.845,2 44.3,3 42.6,4 1.018,5 1.116,6 0.664,7 0.649,8 478.53,10 18,11 61,13 19,14 39,16 65,17 27,20 19,21 8,22 1,24 26,25 8,29 8,32 35,35 13.1,36 0.092,37 6,38 49,39 62.105,40 68.073,41 40.534,42 39.567,44 6.699}
{0 CHEMBL2170725,1 7.712,2 40.7,3 44.4,4 1.023,5 1.123,6 0.644,7 0.63,8 624.69,10 18,11 81,13 19,14 50,16 86,17 33,20 19,21 14,22 1,24 36,25 12,29 12,32 45,35 14.8,36 0.116,37 10,38 60,39 82.832,40 90.986,41 52.159,42 51.06,44 7.854}
{0 CHEMBL394528,1 7.696,2 43.8,3 43.8,4 1.015,5 1.117,6 0.661,7 0.642,8 492.56,10 18,11 64,13 19,14 40,16 68,17 28,20 19,21 9,22 1,24 28,25 8,29 8,32 36,35 12.5,36 0.103,37 7,38 50,39 64.989,40 71.488,41 42.296,42 41.094,44 7.046}
{0 CHEMBL555196,1 7.703,2 40,3 44.7,4 1.024,5 1.125,6 0.64,7 0.627,8 654.72,10 18,11 85,13 19,14 52,16 90,17 34,20 19,21 15,22 1,24 38,25 13,29 13,32 47,35 15.3,36 0.122,37 11,38 62,39 87.043,40 95.611,41 54.375,42 53.302,44 8.155}
