{
  "data_features": {
    "feature": [
      {
        "data_type": "nominal",
        "index": "0",
        "is_ignore": "false",
        "is_row_identifier": "true",
        "is_target": "false",
        "name": "molecule_id",
        "nominal_value": [
          "CHEMBL104195",
          "CHEMBL104361",
          "CHEMBL104489",
          "CHEMBL104546",
          "CHEMBL105506",
          "CHEMBL105777",
          "CHEMBL106380",
          "CHEMBL106514",
          "CHEMBL106695",
          "CHEMBL106833",
          "CHEMBL106899",
          "CHEMBL106990",
          "CHEMBL107150",
          "CHEMBL107212",
          "CHEMBL107703",
          "CHEMBL107734",
          "CHEMBL110668",
          "CHEMBL121693",
          "CHEMBL121770",
          "CHEMBL122022",
          "CHEMBL122192",
          "CHEMBL122196",
          "CHEMBL122386",
          "CHEMBL123148",
          "CHEMBL123161",
          "CHEMBL123271",
          "CHEMBL123326",
          "CHEMBL123692",
          "CHEMBL123724",
          "CHEMBL123787",
          "CHEMBL123886",
          "CHEMBL124241",
          "CHEMBL124264",
          "CHEMBL124440",
          "CHEMBL124951",
          "CHEMBL125175",
          "CHEMBL125254",
          "CHEMBL125328",
          "CHEMBL125337",
          "CHEMBL125388",
          "CHEMBL125389",
          "CHEMBL125427",
          "CHEMBL125502",
          "CHEMBL125592",
          "CHEMBL125762",
          "CHEMBL125765",
          "CHEMBL125822",
          "CHEMBL125942",
          "CHEMBL126056",
          "CHEMBL126057",
          "CHEMBL126090",
          "CHEMBL126105",
          "CHEMBL126813",
          "CHEMBL127993",
          "CHEMBL130038",
          "CHEMBL130209",
          "CHEMBL130302",
          "CHEMBL130360",
          "CHEMBL130382",
          "CHEMBL130560",
          "CHEMBL130581",
          "CHEMBL130792",
          "CHEMBL130968",
          "CHEMBL131667",
          "CHEMBL132621",
          "CHEMBL132745",
          "CHEMBL132990",
          "CHEMBL133058",
          "CHEMBL133113",
          "CHEMBL133805",
          "CHEMBL134029",
          "CHEMBL134069",
          "CHEMBL2057738",
          "CHEMBL2057739",
          "CHEMBL2057740",
          "CHEMBL2057741",
          "CHEMBL2114282",
          "CHEMBL273643",
          "CHEMBL274056",
          "CHEMBL286494",
          "CHEMBL288568",
          "CHEMBL288995",
          "CHEMBL289482",
          "CHEMBL291181",
          "CHEMBL291487",
          "CHEMBL292239",
          "CHEMBL294159",
          "CHEMBL295553",
          "CHEMBL295624",
          "CHEMBL296136",
          "CHEMBL296298",
          "CHEMBL296462",
          "CHEMBL297109",
          "CHEMBL298103",
          "CHEMBL300670",
          "CHEMBL300982",
          "CHEMBL301264",
          "CHEMBL301693",
          "CHEMBL307145",
          "CHEMBL317835",
          "CHEMBL319577",
          "CHEMBL319696",
          "CHEMBL320923",
          "CHEMBL321110",
          "CHEMBL321113",
          "CHEMBL321114",
          "CHEMBL321185",
          "CHEMBL321652",
          "CHEMBL323497",
          "CHEMBL323991",
          "CHEMBL324197",
          "CHEMBL324408",
          "CHEMBL324641",
          "CHEMBL332779",
          "CHEMBL333179",
          "CHEMBL333452",
          "CHEMBL334941",
          "CHEMBL334954",
          "CHEMBL335405",
          "CHEMBL336428",
          "CHEMBL337845",
          "CHEMBL338715",
          "CHEMBL338978",
          "CHEMBL339100",
          "CHEMBL339332",
          "CHEMBL36648",
          "CHEMBL412821",
          "CHEMBL415019",
          "CHEMBL417717",
          "CHEMBL421615",
          "CHEMBL421625",
          "CHEMBL42406",
          "CHEMBL42460",
          "CHEMBL431819",
          "CHEMBL432858",
          "CHEMBL433067",
          "CHEMBL433846",
          "CHEMBL43612",
          "CHEMBL43732",
          "CHEMBL440508",
          "CHEMBL44061",
          "CHEMBL44375",
          "CHEMBL443801",
          "CHEMBL44811",
          "CHEMBL44843",
          "CHEMBL44880",
          "CHEMBL44921",
          "CHEMBL44943",
          "CHEMBL44994",
          "CHEMBL45104",
          "CHEMBL45142",
          "CHEMBL45329",
          "CHEMBL45410",
          "CHEMBL46432",
          "CHEMBL46448",
          "CHEMBL46469",
          "CHEMBL46487",
          "CHEMBL46543",
          "CHEMBL46826",
          "CHEMBL46886",
          "CHEMBL47024",
          "CHEMBL47042",
          "CHEMBL47046",
          "CHEMBL497001",
          "CHEMBL52",
          "CHEMBL53418",
          "CHEMBL541721",
          "CHEMBL54485",
          "CHEMBL54486",
          "CHEMBL54506",
          "CHEMBL54658",
          "CHEMBL55414",
          "CHEMBL56033",
          "CHEMBL56034",
          "CHEMBL56161",
          "CHEMBL56294",
          "CHEMBL56600",
          "CHEMBL57062",
          "CHEMBL92297",
          "CHEMBL93450",
          "CHEMBL93818",
          "CHEMBL94394",
          "CHEMBL94452",
          "CHEMBL94484",
          "CHEMBL94516",
          "CHEMBL94589",
          "CHEMBL94867",
          "CHEMBL96073",
          "CHEMBL96122",
          "CHEMBL96198",
          "CHEMBL96252",
          "CHEMBL96264",
          "CHEMBL96280",
          "CHEMBL96307",
          "CHEMBL96311",
          "CHEMBL96357",
          "CHEMBL96402",
          "CHEMBL96566",
          "CHEMBL96570",
          "CHEMBL96582",
          "CHEMBL96598",
          "CHEMBL96663",
          "CHEMBL96710",
          "CHEMBL96716",
          "CHEMBL96759",
          "CHEMBL96851",
          "CHEMBL96898",
          "CHEMBL96928",
          "CHEMBL96929",
          "CHEMBL96945"
        ],
        "number_of_missing_values": "0"
      },
      {
        "data_type": "numeric",
        "index": "1",
        "is_ignore": "false",
        "is_row_identifier": "false",
        "is_target": "false",
        "name": "CATS2D_08_DL",
        "number_of_missing_values": "0"
      },
      {
        "data_type": "numeric",
        "index": "2",
        "is_ignore": "false",
        "is_row_identifier": "false",
        "is_target": "false",
        "name": "GATS3v",
        "number_of_missing_values": "0"
      },
      {
        "data_type": "numeric",
        "index": "3",
        "is_ignore": "false",
        "is_row_identifier": "false",
        "is_target": "false",
        "name": "Eta_B",
        "number_of_missing_values": "0"
      },
      {
        "data_type": "numeric",
        "index": "4",
        "is_ignore": "false",
        "is_row_identifier": "false",
        "is_target": "false",
        "name": "SM11_EA.bo.",
        "number_of_missing_values": "0"
      },
      {
        "data_type": "numeric",
        "index": "5",
        "is_ignore": "false",
        "is_row_identifier": "false",
        "is_target": "false",
        "name": "SM12_EA.bo.",
        "number_of_missing_values": "0"
      },
      {
        "data_type": "numeric",
        "index": "6",
        "is_ignore": "false",
        "is_row_identifier": "false",
        "is_target": "false",
        "name": "SM15_EA.bo.",
        "number_of_missing_values": "0"
      },
      {
        "data_type": "numeric",
        "index": "7",
        "is_ignore": "false",
        "is_row_identifier": "false",
        "is_target": "false",
        "name": "ATS3s",
        "number_of_missing_values": "0"
      },
      {
        "data_type": "numeric",
        "index": "8",
        "is_ignore": "false",
        "is_row_identifier": "false",
        "is_target": "false",
        "name": "SM13_EA.bo.",
        "number_of_missing_values": "0"
      },
      {
        "data_type": "numeric",
        "index": "9",
        "is_ignore": "false",
        "is_row_identifier": "false",
        "is_target": "false",
        "name": "SM14_EA.bo.",
        "number_of_missing_values": "0"
      },
      {
        "data_type": "numeric",
        "index": "10",
        "is_ignore": "false",
        "is_row_identifier": "false",
        "is_target": "false",
        "name": "ATSC3s",
        "number_of_missing_values": "0"
      },
      {
        "data_type": "numeric",
        "index": "11",
        "is_ignore": "false",
        "is_row_identifier": "false",
        "is_target": "false",
        "name": "SM09_EA.bo.",
        "number_of_missing_values": "0"
      },
      {
        "data_type": "numeric",
        "index": "12",
        "is_ignore": "false",
        "is_row_identifier": "false",
        "is_target": "false",
        "name": "H.052",
        "number_of_missing_values": "0"
      },
      {
        "data_type": "numeric",
        "index": "13",
        "is_ignore": "false",
        "is_row_identifier": "false",
        "is_target": "false",
        "name": "nROH",
        "number_of_missing_values": "0"
      },
      {
        "data_type": "numeric",
        "index": "14",
        "is_ignore": "false",
        "is_row_identifier": "false",
        "is_target": "false",
        "name": "SpMax6_Bh.s.",
        "number_of_missing_values": "0"
      },
      {
        "data_type": "numeric",
        "index": "15",
        "is_ignore": "false",
        "is_row_identifier": "false",
        "is_target": "false",
        "name": "SM07_EA.bo.",
        "number_of_missing_values": "0"
      },
      {
        "data_type": "numeric",
        "index": "16",
        "is_ignore": "false",
        "is_row_identifier": "false",
        "is_target": "false",
        "name": "SpMax5_Bh.s.",
        "number_of_missing_values": "0"
      },
      {
        "data_type": "numeric",
        "index": "17",
        "is_ignore": "false",
        "is_row_identifier": "false",
        "is_target": "false",
        "name": "P_VSA_i_3",
        "number_of_missing_values": "0"
      },
      {
        "data_type": "numeric",
        "index": "18",
        "is_ignore": "false",
        "is_row_identifier": "false",
        "is_target": "false",
        "name": "GATS3p",
        "number_of_missing_values": "0"
      },
      {
        "data_type": "numeric",
        "index": "19",
        "is_ignore": "false",
        "is_row_identifier": "false",
        "is_target": "false",
        "name": "MATS4s",
        "number_of_missing_values": "0"
      },
      {
        "data_type": "numeric",
        "index": "20",
        "is_ignore": "false",
        "is_row_identifier": "false",
        "is_target": "false",
        "name": "C.034",
        "number_of_missing_values": "0"
      },
      {
        "data_type": "numeric",
        "index": "21",
        "is_ignore": "false",
        "is_row_identifier": "false",
        "is_target": "false",
        "name": "D.Dtr05",
        "number_of_missing_values": "0"
      },
      {
        "data_type": "numeric",
        "index": "22",
        "is_ignore": "false",
        "is_row_identifier": "false",
        "is_target": "false",
        "name": "nR05",
        "number_of_missing_values": "0"
      },
      {
        "data_type": "numeric",
        "index": "23",
        "is_ignore": "false",
        "is_row_identifier": "false",
        "is_target": "false",
        "name": "SRW05",
        "number_of_missing_values": "0"
      },
      {
        "data_type": "numeric",
        "index": "24",
        "is_ignore": "false",
        "is_row_identifier": "false",
        "is_target": "false",
        "name": "SRW07",
        "number_of_missing_values": "0"
      },
      {
        "data_type": "numeric",
        "index": "25",
        "is_ignore": "false",
        "is_row_identifier": "false",
        "is_target": "false",
        "name": "SRW09",
        "number_of_missing_values": "0"
      },
      {
        "data_type": "numeric",
        "index": "26",
        "is_ignore": "false",
        "is_row_identifier": "false",
        "is_target": "false",
        "name": "AAC",
        "number_of_missing_values": "0"
      },
      {
        "data_type": "numeric",
        "index": "27",
        "is_ignore": "false",
        "is_row_identifier": "false",
        "is_target": "false",
        "name": "AECC",
        "number_of_missing_values": "0"
      },
      {
        "data_type": "numeric",
        "index": "28",
        "is_ignore": "false",
        "is_row_identifier": "false",
        "is_target": "false",
        "name": "ALOGP",
        "number_of_missing_values": "0"
      },
      {
        "data_type": "numeric",
        "index": "29",
        "is_ignore": "false",
        "is_row_identifier": "false",
        "is_target": "false",
        "name": "ALOGP2",
        "number_of_missing_values": "0"
      },
      {
        "data_type": "numeric",
        "index": "30",
        "is_ignore": "false",
        "is_row_identifier": "false",
        "is_target": "false",
        "name": "AMR",
        "number_of_missing_values": "0"
      },
      {
        "data_type": "numeric",
        "index": "31",
        "is_ignore": "false",
        "is_row_identifier": "false",
        "is_target": "false",
        "name": "AMW",
        "number_of_missing_values": "0"
      },
      {
        "data_type": "numeric",
        "index": "32",
        "is_ignore": "false",
        "is_row_identifier": "false",
        "is_target": "false",
        "name": "ARR",
        "number_of_missing_values": "0"
      },
      {
        "data_type": "numeric",
        "index": "33",
        "is_ignore": "false",
        "is_row_identifier": "false",
        "is_target": "false",
        "name": "ATS1e",
        "number_of_missing_values": "0"
      },
      {
        "data_type": "numeric",
        "index": "34",
        "is_ignore": "false",
        "is_row_identifier": "false",
        "is_target": "false",
        "name": "ATS1i",
        "number_of_missing_values": "0"
      },
      {
        "data_type": "numeric",
        "index": "35",
        "is_ignore": "false",
        "is_row_identifier": "false",
        "is_target": "false",
        "name": "ATS1m",
        "number_of_missing_values": "0"
      },
      {
        "data_type": "numeric",
        "index": "36",
        "is_ignore": "false",
        "is_row_identifier": "false",
        "is_target": "false",
        "name": "ATS1p",
        "number_of_missing_values": "0"
      },
      {
        "data_type": "numeric",
        "index": "37",
        "is_ignore": "false",
        "is_row_identifier": "false",
        "is_target": "false",
        "name": "ATS1s",
        "number_of_missing_values": "0"
      },
      {
        "data_type": "numeric",
        "index": "38",
        "is_ignore": "false",
        "is_row_identifier": "false",
        "is_target": "false",
        "name": "ATS1v",
        "number_of_missing_values": "0"
      },
      {
        "data_type": "numeric",
        "index": "39",
        "is_ignore": "false",
        "is_row_identifier": "false",
        "is_target": "false",
        "name": "ATS2e",
        "number_of_missing_values": "0"
      },
      {
        "data_type": "numeric",
        "index": "40",
        "is_ignore": "false",
        "is_row_identifier": "false",
        "is_target": "false",
        "name": "ATS2i",
        "number_of_missing_values": "0"
      },
      {
        "data_type": "numeric",
        "index": "41",
        "is_ignore": "false",
        "is_row_identifier": "false",
        "is_target": "false",
        "name": "ATS2m",
        "number_of_missing_values": "0"
      },
      {
        "data_type": "numeric",
        "index": "42",
        "is_ignore": "false",
        "is_row_identifier": "false",
        "is_target": "false",
        "name": "ATS2p",
        "number_of_missing_values": "0"
      },
      {
        "data_type": "numeric",
        "index": "43",
        "is_ignore": "false",
        "is_row_identifier": "false",
        "is_target": "false",
        "name": "ATS2s",
        "number_of_missing_values": "0"
      },
      {
        "data_type": "numeric",
        "index": "44",
        "is_ignore": "false",
        "is_row_identifier": "false",
        "is_target": "false",
        "name": "ATS2v",
        "number_of_missing_values": "0"
      },
      {
        "data_type": "numeric",
        "index": "45",
        "is_ignore": "false",
        "is_row_identifier": "false",
        "is_target": "false",
        "name": "ATS3e",
        "number_of_missing_values": "0"
      },
      {
        "data_type": "numeric",
        "index": "46",
        "is_ignore": "false",
        "is_row_identifier": "false",
        "is_target": "false",
        "name": "ATS3i",
        "number_of_missing_values": "0"
      },
      {
        "data_type": "numeric",
        "index": "47",
        "is_ignore": "false",
        "is_row_identifier": "false",
        "is_target": "false",
        "name": "ATS3m",
        "number_of_missing_values": "0"
      },
      {
        "data_type": "numeric",
        "index": "48",
        "is_ignore": "false",
        "is_row_identifier": "false",
        "is_target": "false",
        "name": "ATS3p",
        "number_of_missing_values": "0"
      },
      {
        "data_type": "numeric",
        "index": "49",
        "is_ignore": "false",
        "is_row_identifier": "false",
        "is_target": "false",
        "name": "ATS3v",
        "number_of_missing_values": "0"
      },
      {
        "data_type": "numeric",
        "index": "50",
        "is_ignore": "false",
        "is_row_identifier": "false",
        "is_target": "false",
        "name": "ATS4e",
        "number_of_missing_values": "0"
      },
      {
        "data_type": "numeric",
        "index": "51",
        "is_ignore": "false",
        "is_row_identifier": "false",
        "is_target": "false",
        "name": "ATS4i",
        "number_of_missing_values": "0"
      },
      {
        "data_type": "numeric",
        "index": "52",
        "is_ignore": "false",
        "is_row_identifier": "false",
        "is_target": "false",
        "name": "ATS4m",
        "number_of_missing_values": "0"
      },
      {
        "data_type": "numeric",
        "index": "53",
        "is_ignore": "false",
        "is_row_identifier": "false",
        "is_target": "false",
        "name": "ATS4p",
        "number_of_missing_values": "0"
      },
      {
        "data_type": "numeric",
        "index": "54",
        "is_ignore": "false",
        "is_row_identifier": "false",
        "is_target": "false",
        "name": "ATS4s",
        "number_of_missing_values": "0"
      },
      {
        "data_type": "numeric",
        "index": "55",
        "is_ignore": "false",
        "is_row_identifier": "false",
        "is_target": "false",
        "name": "ATS4v",
        "number_of_missing_values": "0"
      },
      {
        "data_type": "numeric",
        "index": "56",
        "is_ignore": "false",
        "is_row_identifier": "false",
        "is_target": "false",
        "name": "ATS5e",
        "number_of_missing_values": "0"
      },
      {
        "data_type": "numeric",
        "index": "57",
        "is_ignore": "false",
        "is_row_identifier": "false",
        "is_target": "false",
        "name": "ATS5i",
        "number_of_missing_values": "0"
      },
      {
        "data_type": "numeric",
        "index": "58",
        "is_ignore": "false",
        "is_row_identifier": "false",
        "is_target": "false",
        "name": "ATS5m",
        "number_of_missing_values": "0"
      },
      {
        "data_type": "numeric",
        "index": "59",
        "is_ignore": "false",
        "is_row_identifier": "false",
        "is_target": "false",
        "name": "ATS5p",
        "number_of_missing_values": "0"
      },
      {
        "data_type": "numeric",
        "index": "60",
        "is_ignore": "false",
        "is_row_identifier": "false",
        "is_target": "false",
        "name": "ATS5s",
        "number_of_missing_values": "0"
      },
      {
        "data_type": "numeric",
        "index": "61",
        "is_ignore": "false",
        "is_row_identifier": "false",
        "is_target": "false",
        "name": "ATS5v",
        "number_of_missing_values": "0"
      },
      {
        "data_type": "numeric",
        "index": "62",
        "is_ignore": "false",
        "is_row_identifier": "false",
        "is_target": "false",
        "name": "ATS6e",
        "number_of_missing_values": "0"
      },
      {
        "data_type": "numeric",
        "index": "63",
        "is_ignore": "false",
        "is_row_identifier": "false",
        "is_target": "true",
        "name": "pXC50",
        "number_of_missing_values": "0"
      }
    ]
  }
}