"molecule_id","Eig02_EA.ed.","SM11_AEA.dm.","MATS4e","HNar","Eig02_AEA.ed.","ATS7e","ATS7i","ATSC7m","MATS2v","X0A","Eta_sh_y","ATSC5m","IC2","SpMax4_Bh.s.","PW5","Eta_sh_p","P_VSA_s_6","Chi1_EA.dm.","IC3","PCD","TIC2","ATSC6m","ATSC6v","GNar","P_VSA_p_2","TPSA.NO.","TPSA.Tot.","ATSC5v","P_VSA_LogP_5","P_VSA_m_2","ATS6s","ATSC7v","SpMax3_Bh.i.","SpMin3_Bh.m.","MATS2p","MATS1p","P_VSA_MR_5","ATSC1v","ATSC3m","ATSC6p","GGI4","GGI5","IAC","RBF","RBN","TIC0","TIC1","ATS1i","ATS4p","ATS4v","ATS5e","ATS5i","ATS5p","ATS5v","ATS6e","ATS6i","ATS6p","SpMax7_Bh.e.","SpMax7_Bh.i.","SpMin6_Bh.m.","SpMin6_Bh.v.","SpMAD_AEA.ed.","ATSC4v","ATSC3v","O.","pXC50"
{1 10.879,2 10.879,3 0.045,4 1.958,5 6.702,6 5.213,7 5.426,8 41.436,9 0.094,10 0.703,11 0.286,12 46.823,13 4.582,14 4.647,15 0.103,16 0.126,17 63.808,18 47.755,19 5.139,20 4.045,21 348.22,22 40.251,23 18.535,24 2.088,25 104.73,26 80.65,27 80.65,28 21.162,29 40.074,30 245.668,31 6.186,32 21.166,33 3.869,34 1.992,35 0.09,36 -0.067,37 101.402,38 9.626,39 41.95,40 12.847,41 2.225,42 1.507,43 112.148,44 0.1,45 8,46 112.148,47 266.431,48 4.543,49 4.494,50 4.385,51 5.289,52 5.537,53 4.402,54 4.322,55 5.161,56 5.377,57 4.38,58 3.427,59 3.478,60 1.645,61 1.662,62 1.525,63 24.524,64 20.619,65 3.9,66 4.523}
{0 CHEMBL1085511,1 9.91,2 9.91,3 -0.051,4 1.965,5 6.44,6 4.861,7 5.098,8 28.603,9 0.109,10 0.701,11 0.355,12 41.694,13 4.726,14 4.742,15 0.098,16 0.128,17 102.491,18 32.293,19 5.068,20 4.368,21 330.785,22 35.589,23 15.874,24 2.1,25 127.914,26 101.02,27 101.02,28 19.405,29 57.091,30 253.797,31 6.032,32 15.758,33 3.923,34 1.964,35 0.132,36 -0.068,37 75.103,38 8.385,39 37.181,40 10.589,41 2.081,42 1.188,43 106.327,44 0.095,45 7,46 106.327,47 258.637,48 4.48,49 4.431,50 4.331,51 5.188,52 5.445,53 4.323,54 4.232,55 5.03,56 5.275,57 4.196,58 3.278,59 3.327,60 1.548,61 1.536,62 1.555,63 22.031,64 18.905,65 2.9,66 5}
{0 CHEMBL1087397,1 11.508,2 11.508,3 -0.079,4 1.924,5 6.879,6 4.862,7 5.084,8 27.153,9 0.083,10 0.707,11 0.328,12 29.978,13 4.517,14 7.429,15 0.099,16 0.124,17 103.474,18 24.539,19 5.26,20 5.56,21 280.035,22 31.823,23 14.847,24 2.075,25 80.892,26 62.53,27 62.53,28 13.989,29 89.134,30 254.738,31 6.419,32 14.415,33 3.94,34 1.997,35 0.135,36 -0.029,37 51.974,38 6.312,39 24.219,40 11.594,41 2.023,42 1.501,43 101.875,44 0.091,45 6,46 101.875,47 219.696,48 4.354,49 4.333,50 4.292,51 5.019,52 5.218,53 4.286,54 4.253,55 5.003,56 5.219,57 4.237,58 3.308,59 3.361,60 1.484,61 1.499,62 1.559,63 17.014,64 14.044,65 1.6,66 5.699}
{0 CHEMBL1088240,1 9.396,2 9.396,3 0.103,4 1.895,5 6.254,6 5.06,7 5.273,8 42.979,9 0.196,10 0.713,11 0.33,12 47.142,13 4.83,14 4.677,15 0.107,16 0.189,17 148.142,18 39.826,19 5.188,20 3.934,21 313.97,22 35.938,23 17.697,24 2.04,25 94.104,26 73.65,27 73.65,28 21.417,29 120.456,30 231.926,31 6.089,32 17.298,33 3.91,34 1.897,35 0.245,36 -0.1,37 79.573,38 7.421,39 36.014,40 13.274,41 2.596,42 1.278,43 106.581,44 0.118,45 8,46 106.581,47 245.954,48 4.378,49 4.445,50 4.321,51 5.165,52 5.419,53 4.387,54 4.269,55 5.029,56 5.235,57 4.359,58 3.243,59 3.318,60 1.563,61 1.528,62 1.548,63 21.31,64 16.681,65 3.1,66 5}
{0 CHEMBL1090143,1 11.033,2 11.033,3 -0.173,4 1.99,5 6.736,6 4.59,7 4.768,8 16.849,9 -0.051,10 0.697,11 0.31,12 20.164,13 4.537,14 7.429,15 0.102,16 0.074,17 120.382,18 14.846,19 5.273,20 5.349,21 222.312,22 20.93,23 8.76,24 2.12,25 93.512,26 67.77,27 96.01,28 9.287,29 92.423,30 234.288,31 6.3,32 8.313,33 3.9,34 1.94,35 0.065,36 0.033,37 55.557,38 3.884,39 15.668,40 8.944,41 1.752,42 1.379,43 87.666,44 0.075,45 4,46 87.666,47 167.499,48 4.119,49 4.146,50 4.105,51 4.714,52 4.874,53 4.091,54 4.061,55 4.711,56 4.884,57 4.038,58 3.193,59 3.246,60 1.315,61 1.394,62 1.541,63 9.822,64 9.258,65 2,66 5}
{0 CHEMBL1094408,1 9.611,2 9.611,3 0.013,4 1.96,5 6.301,6 4.942,7 5.197,8 32.874,9 0.206,10 0.7,11 0.403,12 39.856,13 4.865,14 4.838,15 0.114,16 0.145,17 119.276,18 51.034,19 5.205,20 3.479,21 296.755,22 36.132,23 15.978,24 2.112,25 145.312,26 114.43,27 114.43,28 17.957,29 68.725,30 219.813,31 6.081,32 13.642,33 3.83,34 1.894,35 0.211,36 -0.109,37 85.761,38 6.938,39 31.603,40 10.359,41 2.383,42 1.261,43 97.127,44 0.077,45 5,46 97.127,47 232.027,48 4.367,49 4.336,50 4.256,51 5.146,52 5.405,53 4.267,54 4.18,55 5.047,56 5.299,57 4.147,58 3.28,59 3.352,60 1.575,61 1.544,62 1.591,63 18.327,64 15.364,65 3.3,66 5}
{0 CHEMBL1171948,1 9.299,2 9.299,3 0.024,4 1.952,5 6.261,6 4.634,7 4.863,8 22.468,9 -0.003,10 0.702,11 0.393,12 20.265,13 4.588,14 4.907,15 0.117,16 0.118,17 166.318,18 33.852,19 4.897,20 3.304,21 201.85,22 20.848,23 8.924,24 2.097,25 186.106,26 141.81,27 141.81,28 7.935,29 43.476,30 228.126,31 5.97,32 9.351,33 3.766,34 1.721,35 -0.042,36 0.075,37 109.216,38 4.001,39 19.929,40 6.759,41 1.784,42 1.08,43 74.018,44 0.106,45 5,46 74.018,47 173.976,48 4.053,49 3.911,50 3.898,51 4.651,52 4.853,53 3.876,54 3.875,55 4.656,56 4.856,57 3.844,58 2.988,59 3.067,60 1.229,61 1.344,62 1.557,63 9.227,64 9.03,65 4.5,66 5.562}
{0 CHEMBL1171949,1 9.299,2 9.299,3 0.026,4 2.093,5 6.261,6 4.936,7 5.165,8 30.546,9 -0.031,10 0.683,11 0.347,12 31.567,13 4.729,14 4.771,15 0.113,16 0.052,17 108.276,18 35.435,19 5.004,20 3.214,21 260.1,22 28.775,23 13.43,24 2.186,25 146.074,26 110.75,27 110.75,28 13.239,29 43.476,30 217.815,31 5.966,32 15.297,33 3.896,34 1.989,35 -0.051,36 0.027,37 103.611,38 6.408,39 31.941,40 9.252,41 1.775,42 0.976,43 84.119,44 0.085,45 5,46 84.119,47 209.497,48 4.262,49 4.159,50 4.085,51 4.93,52 5.178,53 4.116,54 4.064,55 4.885,56 5.096,57 4.155,58 3.111,59 3.206,60 1.513,61 1.512,62 1.526,63 15.599,64 15.899,65 1.8,66 6.427}
{0 CHEMBL1171950,1 9.299,2 9.299,3 -0.019,4 2,5 6.261,6 4.756,7 5.007,8 26.234,9 -0.008,10 0.696,11 0.348,12 24.68,13 4.702,14 4.903,15 0.118,16 0.09,17 141.173,18 30.435,19 4.986,20 3.238,21 225.714,22 24.575,23 11.034,24 2.12,25 160.961,26 124.74,27 124.74,28 10.317,29 43.476,30 228.061,31 5.883,32 12.421,33 3.779,34 1.903,35 -0.04,36 0.061,37 113.857,38 5.172,39 25.038,40 7.591,41 1.784,42 0.889,43 75.477,44 0.118,45 6,46 75.477,47 186.13,48 4.13,49 3.975,50 3.935,51 4.737,52 4.961,53 3.958,54 3.919,55 4.74,56 4.955,57 3.957,58 2.999,59 3.08,60 1.438,61 1.486,62 1.543,63 11.121,64 11.907,65 2.1,66 7.444}
{0 CHEMBL1172241,1 9.426,2 9.426,3 -0.062,4 1.937,5 6.293,6 5.3,7 5.539,8 45.411,9 0.101,10 0.706,11 0.353,12 43.424,13 5.382,14 4.998,15 0.105,16 0.133,17 150.207,18 51.314,19 5.692,20 4.227,21 409.068,22 42.143,23 19.438,24 2.075,25 191.129,26 143.95,27 143.95,28 19.049,29 61.651,30 295.699,31 6.359,32 21.588,33 3.949,34 1.999,35 0.093,36 -0.04,37 127.364,38 8.856,39 39.033,40 13.281,41 2.517,42 1.455,43 117.582,44 0.125,45 10,46 117.582,47 298.536,48 4.561,49 4.469,50 4.4,51 5.254,52 5.49,53 4.445,54 4.391,55 5.245,56 5.46,57 4.471,58 3.397,59 3.473,60 1.652,61 1.713,62 1.547,63 20.81,64 19.223,65 2.6,66 7.071}
{0 CHEMBL1222474,1 8.597,2 8.597,3 -0.138,4 2.039,5 6.032,6 4.782,7 4.988,8 27.047,9 -0.017,10 0.691,11 0.309,12 36.265,13 4.611,14 4.673,15 0.087,16 0.103,17 136.891,18 31.221,19 5.275,20 4.217,21 281.246,22 30.807,23 13.864,24 2.141,25 98.903,26 74.56,27 74.56,28 15.118,29 29.894,30 211.752,31 5.801,32 12.483,33 3.939,34 1.876,35 0.002,36 -0.027,37 48.659,38 6.68,39 40.176,40 10.133,41 1.579,42 0.869,43 99.842,44 0.123,45 8,46 99.842,47 226.723,48 4.341,49 4.216,50 4.114,51 4.944,52 5.193,53 4.128,54 4.029,55 4.823,56 5.054,57 4.098,58 3.194,59 3.241,60 1.569,61 1.593,62 1.515,63 16.296,64 16.668,65 1.6,66 4}
{0 CHEMBL1222565,1 8.605,2 8.605,3 -0.182,4 2.04,5 6.034,6 4.729,7 4.926,8 24.257,9 -0.055,10 0.691,11 0.324,12 32.735,13 4.814,14 4.674,15 0.089,16 0.106,17 136.891,18 33.721,19 5.444,20 4.217,21 279.234,22 27.3,23 12.24,24 2.145,25 113.79,26 83.35,27 83.35,28 13.484,29 26.769,30 222.427,31 5.81,32 11.598,33 3.94,34 1.892,35 -0.044,36 0.013,37 59.334,38 6.089,39 38.378,40 9.389,41 1.659,42 0.931,43 96.118,44 0.113,45 7,46 96.118,47 223.206,48 4.296,49 4.159,50 4.069,51 4.86,52 5.097,53 4.079,54 3.994,55 4.751,56 4.955,57 4.065,58 3.163,59 3.217,60 1.488,61 1.54,62 1.519,63 14.646,64 15.727,65 1.7,66 4}
{0 CHEMBL1222990,1 8.605,2 8.605,3 -0.185,4 2.148,5 6.034,6 4.665,7 4.89,8 23.8,9 -0.12,10 0.677,11 0.32,12 27.089,13 4.563,14 4.474,15 0.083,16 0.024,17 58.593,18 28.495,19 5.2,20 3.248,21 250.955,22 24.162,23 12.083,24 2.215,25 113.79,26 83.35,27 83.35,28 12.661,29 16.583,30 188.881,31 5.661,32 12.023,33 3.951,34 1.884,35 -0.146,36 0.004,37 64.403,38 6.78,39 31.618,40 8.263,41 1.161,42 0.834,43 82.146,44 0.119,45 7,46 82.146,47 197.304,48 4.256,49 4.008,50 3.925,51 4.768,52 5.016,53 3.961,54 3.88,55 4.685,56 4.908,57 3.945,58 3.068,59 3.143,60 1.513,61 1.54,62 1.504,63 13.629,64 15.271,65 1.8,66 4}
{0 CHEMBL1222992,1 8.605,2 8.605,3 -0.164,4 2.084,5 6.034,6 4.724,7 4.927,8 24.342,9 -0.075,10 0.686,11 0.307,12 32.657,13 4.802,14 4.674,15 0.089,16 0.066,17 97.742,18 33.455,19 5.479,20 4.191,21 278.544,22 25.545,23 12.448,24 2.168,25 113.79,26 83.35,27 83.35,28 13.62,29 23.269,30 228.403,31 5.77,32 11.875,33 3.941,34 1.893,35 -0.074,36 0.01,37 59.334,38 6.425,39 33.992,40 9.176,41 1.468,42 0.875,43 92.06,44 0.113,45 7,46 92.06,47 217.681,48 4.297,49 4.135,50 4.047,51 4.857,52 5.098,53 4.064,54 3.979,55 4.742,56 4.957,57 4.044,58 3.157,59 3.218,60 1.497,61 1.54,62 1.507,63 14.774,64 15.917,65 1.7,66 4}
{0 CHEMBL1223203,1 8.597,2 8.597,3 -0.134,4 2,5 6.032,6 4.651,7 4.882,8 23.998,9 0.022,10 0.697,11 0.325,12 27.472,13 4.486,14 4.472,15 0.082,16 0.101,17 58.593,18 22.46,19 4.912,20 3.252,21 242.235,22 23.536,23 12.155,24 2.115,25 98.903,26 74.56,27 74.56,28 12.524,29 19.707,30 185.718,31 5.607,32 11.591,33 3.908,34 1.888,35 0.023,36 -0.072,37 44.448,38 6.625,39 27.619,40 8.062,41 1.116,42 0.803,43 80.804,44 0.14,45 8,46 80.804,47 191.361,48 4.226,49 4.001,50 3.909,51 4.769,52 5.025,53 3.933,54 3.847,55 4.656,56 4.891,57 3.909,58 3.074,59 3.149,60 1.513,61 1.488,62 1.528,63 14.134,64 13.614,65 1.9,66 4}
{0 CHEMBL1230607,1 9.743,2 9.743,3 -0.007,4 1.763,5 6.445,6 5.02,7 5.308,8 35.575,9 0.145,10 0.733,11 0.353,12 38.386,13 4.468,14 4.352,15 0.092,16 0.26,17 66.953,18 41.61,19 4.714,20 1.111,21 254.7,22 32.271,23 16.176,24 1.961,25 107.875,26 81.33,27 81.33,28 15.893,29 28.058,30 132.883,31 5.818,32 16.224,33 3.802,34 1.886,35 0.113,36 -0.086,37 95.229,38 7.712,39 35.764,40 10.216,41 1.847,42 1.143,43 84.574,44 0.068,45 4,46 84.574,47 173.593,48 4.265,49 4.199,50 4.075,51 5.065,52 5.328,53 4.066,54 3.963,55 4.93,56 5.187,57 4.068,58 3.111,59 3.206,60 1.513,61 1.497,62 1.628,63 19.421,64 17.419,65 3.5,66 5}
{0 CHEMBL1258913,1 9.328,2 9.328,3 -0.004,4 2.108,5 6.214,6 5.138,7 5.34,8 44.262,9 -0.002,10 0.682,11 0.31,12 45.167,13 4.696,14 4.765,15 0.096,16 0.036,17 77.953,18 45.498,19 5.294,20 3.6,21 333.439,22 44.485,23 20.173,24 2.187,25 136.886,26 102.59,27 130.83,28 20.811,29 32.04,30 220.254,31 6.254,32 19.166,33 3.98,34 1.86,35 0.056,36 0.008,37 80.591,38 8.384,39 45.036,40 15.624,41 1.614,42 1.361,43 115.486,44 0.105,45 8,46 115.486,47 265.118,48 4.495,49 4.418,50 4.308,51 5.207,52 5.442,53 4.428,54 4.329,55 5.182,56 5.399,57 4.453,58 3.33,59 3.376,60 1.69,61 1.751,62 1.515,63 21.009,64 19.804,65 4.2,66 6.118}
{0 CHEMBL1270230,1 8.876,2 8.876,3 -0.025,4 1.938,5 6.091,6 4.163,7 4.396,8 14.007,9 -0.038,10 0.706,11 0.356,12 15.118,13 4.076,14 4.816,15 0.108,16 0.115,17 124.51,18 4.851,19 4.653,20 2.996,21 138.567,22 15.161,23 6.705,24 2.074,25 141.296,26 110.68,27 110.68,28 7.555,29 34.961,30 212.777,31 5.599,32 6.119,33 3.734,34 1.627,35 -0.045,36 0.146,37 63.386,38 2.958,39 13.169,40 5.075,41 1.403,42 0.82,43 54.655,44 0.083,45 3,46 54.655,47 109.713,48 3.784,49 3.615,50 3.58,51 4.332,52 4.544,53 3.613,54 3.556,55 4.292,56 4.511,57 3.489,58 2.839,59 2.892,60 1.211,61 1.243,62 1.557,63 6.542,64 6.465,65 2.9,66 5}
{0 CHEMBL1272116,1 9.11,2 9.11,3 0.11,4 1.918,5 6.162,6 4.612,7 4.855,8 23.902,9 0.124,10 0.708,11 0.355,12 44.795,13 4.877,14 4.395,15 0.097,16 0.182,17 106.168,18 50.16,19 4.99,20 3.234,21 292.639,22 42.265,23 15.06,24 2.065,25 107.942,26 85.86,27 85.86,28 19.883,29 67.716,30 216.944,31 5.868,32 11.11,33 3.857,34 1.897,35 0.114,36 -0.109,37 87.48,38 7.25,39 34.068,40 9.552,41 1.647,42 0.903,43 91.424,44 0.095,45 6,46 91.424,47 223.187,48 4.333,49 4.311,50 4.182,51 5.139,52 5.422,53 4.253,54 4.105,55 4.945,56 5.231,57 4.022,58 3.111,59 3.206,60 1.513,61 1.482,62 1.569,63 19.699,64 16.297,66 5}
{0 CHEMBL1272171,1 10.062,2 10.062,3 0.125,4 1.846,5 6.541,6 4.935,7 5.189,8 35.846,9 0.124,10 0.719,11 0.341,12 45.075,13 4.921,14 5.067,15 0.1,16 0.184,17 111.9,18 54.172,19 5.028,20 3.305,21 310.039,22 40.355,23 15.036,24 2.018,25 107.942,26 85.86,27 85.86,28 19.806,29 115.353,30 224.388,31 6.309,32 11.316,33 3.86,34 1.897,35 0.129,36 -0.116,37 97.996,38 7.25,39 33.65,40 10.479,41 2.422,42 1.403,43 102.89,44 0.091,45 6,46 102.89,47 240.587,48 4.391,49 4.334,50 4.256,51 5.23,52 5.507,53 4.277,54 4.191,55 5.099,56 5.371,57 4.085,58 3.175,59 3.253,60 1.513,61 1.603,62 1.573,63 19.675,64 16.264,66 5}
{0 CHEMBL1631888,1 7.173,2 7.173,3 -0.148,4 2.077,5 5.421,6 3.581,7 3.771,8 6.497,9 -0.075,10 0.687,11 0.287,12 8.221,13 3.755,14 4.4,15 0.095,16 0.046,17 49.56,18 4.239,19 4.444,20 4.092,21 108.881,22 5.499,23 3.028,24 2.154,25 66.223,26 54.7,27 54.7,28 4.475,29 27.322,30 189.511,31 4.611,32 3.458,33 3.496,34 1.555,35 -0.108,36 0.18,37 18.807,38 2.677,39 10.673,40 2.332,41 0.524,42 0.292,43 39.469,46 39.469,47 86.127,48 3.608,49 3.285,50 3.182,51 3.667,52 3.905,53 3.019,54 2.927,55 3.468,56 3.637,57 2.968,58 2.719,59 2.807,60 1.134,61 1.107,62 1.51,63 5.684,64 6.07,66 4.407}
{0 CHEMBL1631889,1 6.997,2 6.997,3 -0.134,4 2.17,5 5.357,6 3.521,7 3.712,8 6.104,9 -0.146,10 0.677,11 0.241,12 6.469,13 3.194,14 4.326,15 0.093,17 16.663,18 1.739,19 4.103,20 4.069,21 86.243,22 5.107,23 2.769,24 2.2,25 33.326,26 28.68,27 28.68,28 3.503,29 24.566,30 163.333,31 4.485,32 3.187,33 3.49,34 1.553,35 -0.168,36 0.086,37 18.807,38 2.572,39 10.018,40 2.155,41 0.333,42 0.236,43 34.559,46 34.559,47 69.323,48 3.517,49 3.186,50 3.091,51 3.511,52 3.722,53 2.938,54 2.855,55 3.4,56 3.569,57 2.915,58 2.522,59 2.581,60 1.081,61 1.049,62 1.484,63 4.743,64 5.962,66 4.301}
{0 CHEMBL1631890,1 7.924,2 7.924,3 0.194,4 2,5 5.665,6 3.584,7 3.749,8 4.998,9 -0.133,10 0.697,11 0.338,12 5.96,13 3.731,14 4.722,15 0.09,16 0.064,17 46.583,18 5.244,19 4.385,20 4.127,21 100.73,22 4.017,23 2.346,24 2.113,25 33.326,26 28.68,27 28.68,28 2.786,29 42.808,30 162.622,31 4.693,32 2.718,33 3.492,34 1.542,35 -0.168,36 0.083,37 18.807,38 2.041,39 8.925,40 2.203,41 0.716,42 0.236,43 41.779,46 41.779,47 83.079,48 3.537,49 3.173,50 3.174,51 3.569,52 3.757,53 2.929,54 2.91,55 3.433,56 3.588,57 2.908,58 2.529,59 2.586,60 1.035,61 1.042,62 1.523,63 3.917,64 4.574,66 4}
{0 CHEMBL1631891,1 6.997,2 6.997,3 -0.171,4 2.17,5 5.357,6 3.479,7 3.676,8 5.599,9 -0.107,10 0.677,11 0.244,12 5.765,13 3.95,14 4.343,15 0.093,17 33.449,18 1.739,19 4.624,20 4.069,21 102.702,22 4.746,23 2.501,24 2.2,25 50.112,26 41.57,27 41.57,28 3.057,29 42.661,30 169.784,31 4.513,32 2.714,33 3.488,34 1.544,35 -0.108,36 0.052,37 36.902,38 2.214,39 8.698,40 2.01,41 0.333,42 0.236,43 35.624,46 35.624,47 78.702,48 3.498,49 3.125,50 3.05,51 3.46,52 3.662,53 2.889,54 2.822,55 3.38,56 3.554,57 2.86,58 2.512,59 2.574,60 1.037,61 1.002,62 1.484,63 4.045,64 4.975,66 4.682}
{0 CHEMBL1631892,1 6.997,2 6.997,3 -0.138,4 2.17,5 5.357,6 3.503,7 3.699,8 5.734,9 -0.107,10 0.677,11 0.244,12 6.147,13 3.796,14 4.349,15 0.093,17 33.449,18 1.739,19 4.316,20 4.069,21 98.702,22 4.669,23 2.51,24 2.2,25 50.112,26 41.57,27 41.57,28 3.263,29 42.661,30 169.784,31 4.475,32 2.911,33 3.486,34 1.535,35 -0.108,36 0.052,37 36.902,38 2.214,39 8.751,40 2.027,41 0.333,42 0.236,43 35.624,46 35.624,47 78.702,48 3.498,49 3.141,50 3.062,51 3.488,52 3.699,53 2.897,54 2.826,55 3.373,56 3.543,57 2.873,58 2.453,59 2.535,60 1.043,61 1.011,62 1.484,63 4.078,64 4.933,66 5.412}
{0 CHEMBL1631893,1 6.02,2 6.02,3 0.093,4 1.915,5 5.132,6 3.532,7 3.764,8 7.432,9 0.214,10 0.712,11 0.264,12 7.301,13 3.753,14 4.181,15 0.083,16 0.139,17 16.663,18 5.623,19 4.039,20 2.76,21 105.096,22 6.905,23 3.46,24 2.032,25 36.45,26 31.92,27 31.92,28 3.731,29 24.504,30 134.789,31 4.386,32 3.494,33 3.484,34 1.585,35 0.258,36 -0.054,37 24.037,38 3.275,39 10.745,40 2.32,41 0.262,42 0.226,43 38.726,44 0.034,45 1,46 38.726,47 92.606,48 3.56,49 3.173,50 3.029,51 3.524,52 3.75,53 2.832,54 2.724,55 3.466,56 3.695,57 2.742,58 2.451,59 2.538,60 1.113,61 1.092,62 1.503,63 7.114,64 6.337,66 4}
{0 CHEMBL1631894,1 6.997,2 6.997,3 -0.194,4 2.17,5 5.357,6 3.415,7 3.595,8 4.956,9 -0.143,10 0.677,11 0.244,12 5.843,13 3.762,14 4.329,15 0.093,17 33.449,18 1.739,19 4.518,20 4.069,21 97.805,22 4.611,23 2.304,24 2.2,25 50.112,26 41.57,27 41.57,28 3.048,29 33.184,30 169.784,31 4.524,32 2.39,33 3.49,34 1.553,35 -0.173,36 0.052,37 30.611,38 2.214,39 8.999,40 1.881,41 0.333,42 0.236,43 35.624,46 35.624,47 76.56,48 3.498,49 3.118,50 3.046,51 3.466,52 3.672,53 2.876,54 2.811,55 3.353,56 3.527,57 2.816,58 2.465,59 2.539,60 1.041,61 1.006,62 1.484,63 3.84,64 4.942,66 4.602}
{0 CHEMBL1631895,1 7.449,2 7.449,3 -0.087,4 2.077,5 5.508,6 3.588,7 3.774,8 6.453,9 -0.075,10 0.687,11 0.287,12 7.869,13 3.797,14 4.407,15 0.092,16 0.046,17 49.56,18 5.714,19 4.625,20 4.103,21 110.127,22 6.185,23 3.402,24 2.154,25 66.223,26 54.7,27 54.7,28 4.205,29 27.322,30 189.511,31 4.598,32 3.435,33 3.494,34 1.554,35 -0.108,36 0.18,37 18.807,38 2.677,39 10.673,40 2.571,41 0.524,42 0.236,43 39.469,46 39.469,47 86.127,48 3.608,49 3.291,50 3.197,51 3.675,52 3.897,53 3.046,54 2.955,55 3.521,56 3.711,57 2.983,58 2.547,59 2.62,60 1.087,61 1.054,62 1.509,63 5.731,64 6.07,66 4.9}
{0 CHEMBL1631896,1 7.027,2 7.027,3 0.036,4 2.182,5 5.368,6 3.813,7 4.055,8 9.99,9 -0.094,10 0.675,11 0.256,12 7.529,13 3.64,14 4.095,15 0.081,17 16.663,18 1.545,19 4.174,20 2.897,21 109.207,22 8.063,23 4.152,24 2.213,25 33.326,26 28.68,27 28.68,28 4.065,29 21.38,30 122.904,31 4.485,32 5.162,33 3.491,34 1.86,35 -0.124,36 0.075,37 28.945,38 3.848,39 16.022,40 2.871,41 0.307,42 0.177,43 38.601,46 38.601,47 94.677,48 3.624,49 3.216,50 3.084,51 3.572,52 3.78,53 2.963,54 2.862,55 3.633,56 3.843,57 3.006,58 2.544,59 2.629,60 1.04,61 1.004,62 1.476,63 6.815,64 9.424,66 4}
{0 CHEMBL1631897,1 7.405,2 7.405,3 -0.217,4 2.211,5 5.499,6 3.365,7 3.628,8 6.374,9 -0.158,10 0.67,11 0.294,12 6.028,13 3.752,14 3.994,15 0.08,17 16.663,18 1.545,19 4.085,20 2.81,21 90.039,22 6.124,23 3.089,24 2.246,25 33.326,26 28.68,27 28.68,28 3.082,29 21.38,30 117.835,31 4.241,32 3.522,33 3.474,34 1.513,35 -0.196,36 0.094,37 23.876,38 2.694,39 9.691,40 2.249,41 0.217,42 0.146,43 31.8,46 31.8,47 80.429,48 3.423,49 2.948,50 2.872,51 3.395,52 3.61,53 2.762,54 2.67,55 3.393,56 3.617,57 2.737,58 2.094,59 2.271,60 1.038,61 1.001,62 1.507,63 3.479,64 5.5,66 4}
{0 CHEMBL1631898,1 8.548,2 8.548,3 -0.172,4 2.077,5 6.021,6 3.658,7 3.847,8 6.953,9 -0.075,10 0.687,11 0.287,12 8.555,13 3.686,14 4.437,15 0.09,16 0.046,17 49.56,18 2.889,19 4.513,20 4.137,21 106.881,22 6.141,23 3.379,24 2.154,25 66.223,26 54.7,27 54.7,28 4.578,29 27.322,30 189.511,31 4.644,32 3.216,33 3.49,34 1.553,35 -0.108,36 0.18,37 18.807,38 2.677,39 10.695,40 2.546,41 0.444,42 0.292,43 39.469,46 39.469,47 86.127,48 3.608,49 3.312,50 3.218,51 3.719,52 3.955,53 3.06,54 2.962,55 3.529,56 3.714,57 2.991,58 2.626,59 2.712,60 1.095,61 1.057,62 1.518,63 5.461,64 6.118,66 4}
{0 CHEMBL1631899,1 11.446,2 11.446,3 -0.298,4 1.786,5 7.052,6 3.756,7 3.897,8 3.502,9 -0.077,10 0.73,11 0.272,12 5.197,13 3.736,14 7.999,15 0.094,16 0.156,17 106.424,18 13.779,19 4.271,20 4.177,21 123.304,22 10.821,23 2.902,24 1.973,25 33.326,26 28.68,27 28.68,28 3.443,29 120.698,30 166.271,31 6.722,32 2.918,33 3.507,34 1.552,35 0.122,36 0.063,37 34.326,38 2.22,39 5.526,40 5.034,41 1.551,42 1.333,43 55.468,46 55.468,47 105.652,48 3.751,49 3.49,50 3.575,51 4.093,52 4.223,53 3.27,54 3.43,55 4.191,56 4.345,57 3.146,58 2.809,59 2.862,60 1.088,61 1.108,62 1.556,63 4.956,64 5.303,66 4}
{0 CHEMBL1631900,1 7.027,2 7.027,3 -0.184,4 2.182,5 5.368,6 3.367,7 3.535,8 6.784,9 -0.149,10 0.675,11 0.246,12 4.865,13 3.935,14 4.268,15 0.081,17 16.663,18 1.739,19 4.502,20 3.773,21 94.429,22 4.695,23 2.251,24 2.213,25 33.326,26 28.68,27 56.92,28 2.604,29 24.566,30 140.726,31 4.388,32 2.759,33 3.476,34 1.475,35 -0.197,36 0.123,37 18.807,38 1.974,39 7.962,40 2.024,41 0.307,42 0.177,43 35.933,46 35.933,47 74.778,48 3.404,49 3.057,50 2.969,51 3.364,52 3.553,53 2.861,54 2.766,55 3.305,56 3.462,57 2.876,58 2.423,59 2.523,60 1.038,61 1.002,62 1.476,63 3.286,64 4.42,66 4}
{0 CHEMBL1631901,1 7.346,2 7.346,3 -0.224,4 2.073,5 5.485,6 3.556,7 3.738,8 5.581,9 -0.124,10 0.688,11 0.272,12 6.737,13 3.593,14 4.45,15 0.092,16 0.043,17 47.722,18 4.083,19 4.307,20 4.322,21 100.606,22 4.606,23 2.5,24 2.145,25 64.385,26 52.47,27 52.47,28 3.322,29 58.811,30 204.703,31 4.672,32 2.888,33 3.5,34 1.554,35 -0.139,36 0.09,37 49.867,38 2.196,39 8.928,40 2.093,41 0.564,42 0.354,43 37.322,46 37.322,47 82.606,48 3.548,49 3.296,50 3.221,51 3.608,52 3.818,53 3.025,54 2.959,55 3.44,56 3.599,57 2.981,58 2.793,59 2.846,60 1.109,61 1.107,62 1.5,63 4.313,64 5.406,66 4}
{0 CHEMBL1631902,1 6.997,2 6.997,3 -0.14,4 2.17,5 5.357,6 3.428,7 3.607,8 4.462,9 -0.084,10 0.677,11 0.247,12 5.233,13 3.863,14 4.37,15 0.093,17 50.234,18 1.739,19 4.214,20 4.069,21 96.587,22 3.629,23 1.914,24 2.2,25 66.897,26 54.46,27 54.46,28 2.688,29 52.321,30 176.236,31 4.439,32 2.155,33 3.439,34 1.448,35 -0.065,36 0.01,37 48.277,38 1.861,39 7.614,40 1.675,41 0.333,42 0.236,43 35.991,46 35.991,47 79.69,48 3.479,49 3.067,50 3.009,51 3.405,52 3.606,53 2.824,54 2.775,55 3.28,56 3.433,57 2.798,58 2.442,59 2.518,60 0.994,61 0.986,62 1.484,63 3.343,64 3.995,66 4.301}
{0 CHEMBL1631903,1 6.997,2 6.997,3 -0.228,4 2.17,5 5.357,6 3.46,7 3.66,8 5.177,9 -0.084,10 0.677,11 0.247,12 4.562,13 3.974,14 4.363,15 0.093,17 50.234,18 1.739,19 4.484,20 4.069,21 99.342,22 4.296,23 2.247,24 2.2,25 66.897,26 54.46,27 54.46,28 2.388,29 51.279,30 176.236,31 4.504,32 2.389,33 3.473,34 1.514,35 -0.065,36 0.01,37 43.805,38 1.861,39 7.442,40 1.882,41 0.333,42 0.236,43 35.991,46 35.991,47 79.69,48 3.479,49 3.042,50 2.993,51 3.377,52 3.559,53 2.829,54 2.783,55 3.353,56 3.527,57 2.816,58 2.509,59 2.573,60 0.985,61 0.977,62 1.484,63 3.206,64 4.152,66 4.301}
{0 CHEMBL1651521,1 7.109,2 7.109,3 0.199,4 1.765,5 5.433,6 5.085,7 5.298,8 38.692,9 0.008,10 0.736,11 0.348,12 36.719,13 4.859,14 6.448,15 0.086,16 0.203,17 157.656,18 21.252,19 5.217,20 1.777,21 238.101,22 35.534,23 16.604,24 1.928,25 157.656,26 93.06,27 93.06,28 15.366,29 33.614,30 94.225,31 6.19,32 17.345,33 3.727,34 1.885,35 -0.032,36 0.001,37 21.498,38 6.211,39 28.905,40 12.541,41 1.404,42 1.25,43 68.861,44 0.02,45 1,46 68.861,47 173.307,48 4.063,49 4.075,50 4.018,51 5.029,52 5.218,53 4.103,54 4.042,55 5.02,56 5.21,57 4.158,58 3.056,59 3.092,60 1.515,61 1.467,62 1.526,63 15.657,64 13.49,65 12.2,66 5}
{0 CHEMBL1738758,1 10.399,2 10.399,3 0.016,4 1.892,5 6.522,6 5.156,7 5.379,8 39.455,9 0.107,10 0.711,11 0.363,12 42.348,13 5.015,14 7.437,15 0.116,16 0.142,17 206.84,18 51.765,19 5.353,20 3.513,21 325.97,22 39.692,23 15.29,24 2.059,25 187.995,26 134.66,27 134.66,28 17.59,29 113.605,30 212.457,31 6.455,32 15.205,33 3.834,34 1.89,35 0.171,36 -0.08,37 87.866,38 6.553,39 32.603,40 11.675,41 2.988,42 1.618,43 119.523,44 0.101,45 7,46 119.523,47 266.869,48 4.439,49 4.387,50 4.351,51 5.247,52 5.48,53 4.347,54 4.328,55 5.191,56 5.409,57 4.265,58 3.335,59 3.406,60 1.535,61 1.529,62 1.575,63 18.01,64 15.673,65 4.6,66 5}
{0 CHEMBL178737,1 11.552,2 11.552,3 -0.054,4 2.114,5 6.891,6 5.214,7 5.43,8 40.419,9 0.088,10 0.678,11 0.412,12 36.963,13 4.922,14 5.059,15 0.119,16 0.058,17 103.22,18 28.026,19 5.439,20 4.497,21 300.265,22 37.757,23 18.919,24 2.228,25 130.665,26 104.94,27 104.94,28 17.3,29 27.548,30 183.56,31 6.336,32 17.845,33 3.874,34 1.926,35 0.145,36 -0.114,37 57.921,38 6.115,39 31.318,40 14.479,41 2.137,42 1.56,43 99.844,44 0.03,45 2,46 99.844,47 241.678,48 4.37,49 4.478,50 4.443,51 5.209,52 5.396,53 4.459,54 4.423,55 5.199,56 5.402,57 4.438,58 3.32,59 3.372,60 1.551,61 1.606,62 1.592,63 16.951,64 15.42,65 6.6,66 4.699}
{0 CHEMBL1834657,1 9.466,2 9.466,3 0.131,4 1.869,5 6.34,6 5.007,7 5.219,8 47.449,9 0.189,10 0.717,11 0.34,12 58.945,13 4.663,14 4.743,15 0.1,16 0.206,17 159.013,18 63.434,19 5.108,20 3.383,21 321.74,22 42.02,23 17.271,24 2.022,25 126.11,26 95.09,27 95.09,28 22.305,29 80.636,30 228.648,31 6.234,32 16.015,33 3.898,34 1.887,35 0.23,36 -0.164,37 70.242,38 7.538,39 38.147,40 12.197,41 2.262,42 1.528,43 119.29,44 0.111,45 8,46 119.29,47 253.855,48 4.459,49 4.472,50 4.366,51 5.284,52 5.532,53 4.393,54 4.293,55 5.126,56 5.363,57 4.275,58 3.307,59 3.355,60 1.597,61 1.623,62 1.568,63 20.563,64 15.787,65 4.3,66 5}
{0 CHEMBL1929238,1 10.374,2 10.374,3 0.04,4 1.735,5 6.599,6 5.258,7 5.476,8 57.972,9 0.22,10 0.739,11 0.321,12 51.753,13 4.619,14 5.042,15 0.089,16 0.277,17 153.732,18 44.007,19 5.061,20 2.069,21 318.72,22 44.427,23 17.56,24 1.925,25 120.829,26 84.99,27 113.23,28 19.716,29 16.997,30 168.547,31 6.411,32 20.308,33 3.89,34 1.926,35 0.25,36 -0.046,37 85.863,38 8.399,39 48.31,40 13.781,41 2.608,42 1.678,43 120.562,44 0.099,45 7,46 120.562,47 243.987,48 4.432,49 4.495,50 4.349,51 5.216,52 5.454,53 4.347,54 4.252,55 5.117,56 5.31,57 4.368,58 3.292,59 3.376,60 1.589,61 1.662,62 1.578,63 25.137,64 19.791,65 4.3,66 4.523}
{0 CHEMBL1933538,1 10.461,2 10.461,3 -0.056,4 2.126,5 6.611,6 5.029,7 5.279,8 35.242,9 0.018,10 0.677,11 0.326,12 39.909,13 4.57,14 4.758,15 0.117,16 0.042,17 40.105,18 35.257,19 5.548,20 3.081,21 265.034,22 39.161,23 19.368,24 2.229,25 66.19,26 51.37,27 51.37,28 20.427,29 37.546,30 162.229,31 6.065,32 17.957,33 3.908,34 1.999,35 0.014,36 0.004,37 59.177,38 7.296,39 36.965,40 13.781,41 1.874,42 1.335,43 87.285,44 0.032,45 2,46 87.285,47 203.912,48 4.304,49 4.384,50 4.277,51 5.152,52 5.407,53 4.328,54 4.215,55 5.124,56 5.373,57 4.285,58 3.087,59 3.174,60 1.635,61 1.655,62 1.591,63 21.068,64 19.313,65 1.7,66 4.523}
{0 CHEMBL1933550,1 10.461,2 10.461,3 -0.002,4 2.13,5 6.611,6 4.927,7 5.166,8 31.373,9 0.026,10 0.676,11 0.338,12 36.65,13 4.559,14 4.758,15 0.112,16 0.044,17 40.105,18 37.757,19 5.49,20 3.084,21 250.756,22 37.18,23 17.996,24 2.237,25 66.19,26 51.37,27 51.37,28 18.861,29 37.546,30 159.694,31 6.027,32 15.715,33 3.907,34 1.875,35 0.025,36 0.004,37 56.642,38 6.735,39 34.16,40 12.88,41 1.933,42 1.216,43 83.839,44 0.033,45 2,46 83.839,47 195.762,48 4.256,49 4.324,50 4.225,51 5.084,52 5.329,53 4.278,54 4.172,55 5.065,56 5.317,57 4.213,58 2.954,59 3.017,60 1.65,61 1.685,62 1.584,63 19.341,64 17.774,65 1.8,66 4.523}
{0 CHEMBL1933551,1 10.452,2 10.452,3 -0.058,4 2.126,5 6.61,6 5.059,7 5.304,8 35.957,9 0.026,10 0.677,11 0.321,12 42.675,13 4.541,14 4.449,15 0.116,16 0.056,17 25.145,18 39.595,19 5.427,20 3.059,21 276.981,22 40.332,23 20.195,24 2.229,25 66.19,26 51.37,27 51.37,28 22.66,29 28.425,30 169.304,31 6.054,32 19.007,33 3.925,34 2.009,35 0.02,36 0.004,37 65.897,38 8.132,39 39.127,40 13.996,41 1.874,42 1.341,43 84.357,44 0.03,45 2,46 84.357,47 207.251,48 4.344,49 4.448,50 4.316,51 5.219,52 5.491,53 4.374,54 4.238,55 5.153,56 5.409,57 4.319,58 3.19,59 3.27,60 1.649,61 1.678,62 1.595,63 23.496,64 21.017,65 1.6,66 4.523}
{0 CHEMBL1933552,1 10.461,2 10.461,3 0.002,4 2.076,5 6.611,6 5.067,7 5.308,8 36.307,9 0.034,10 0.683,11 0.348,12 43.484,13 4.713,14 4.758,15 0.116,16 0.074,17 40.105,18 40.257,19 5.525,20 3.078,21 287.51,22 40.765,23 19.934,24 2.202,25 66.19,26 51.37,27 51.37,28 22.328,29 37.546,30 168.948,31 6.09,32 18.853,33 3.925,34 1.999,35 0.018,36 0.004,37 65.897,38 7.851,39 39.323,40 14.014,41 2.066,42 1.446,43 90.682,44 0.03,45 2,46 90.682,47 216.309,48 4.349,49 4.447,50 4.326,51 5.227,52 5.495,53 4.373,54 4.251,55 5.159,56 5.412,57 4.318,58 3.196,59 3.274,60 1.647,61 1.678,62 1.609,63 23.195,64 20.402,65 1.6,66 4.523}
{0 CHEMBL1933576,1 10.284,2 10.284,3 0.023,4 1.846,5 6.52,6 4.909,7 5.133,8 30.276,9 0.154,10 0.719,11 0.339,12 37.786,13 4.791,14 7.437,15 0.101,16 0.169,17 147.493,18 46.182,19 5.233,20 3.354,21 277.889,22 32.932,23 12.285,24 2.018,25 128.772,26 101.54,27 101.54,28 16.016,29 107.785,30 219.195,31 6.259,32 11.51,33 3.837,34 1.861,35 0.238,36 -0.141,37 78.057,38 5.739,39 25.986,40 9.561,41 2.358,42 1.198,43 105.21,44 0.098,45 6,46 105.21,47 231.689,48 4.317,49 4.216,50 4.159,51 5.084,52 5.337,53 4.167,54 4.131,55 4.987,56 5.211,57 4.06,58 3.184,59 3.283,60 1.536,61 1.497,62 1.561,63 16.235,64 13.07,65 3.4,66 5}
{0 CHEMBL1933582,1 10.399,2 10.399,3 0.003,4 1.92,5 6.522,6 4.967,7 5.182,8 31.434,9 0.128,10 0.707,11 0.349,12 42.122,13 4.808,14 7.429,15 0.106,16 0.134,17 114.596,18 49.457,19 5.337,20 3.487,21 298.067,22 36.877,23 13.937,24 2.079,25 113.885,26 87.55,27 87.55,28 18.347,29 107.785,30 202.659,31 6.284,32 12.491,33 3.852,34 1.909,35 0.204,36 -0.147,37 67.811,38 6.416,39 30.527,40 10.603,41 2.561,42 1.261,43 110.503,44 0.076,45 5,46 110.503,47 242.618,48 4.386,49 4.337,50 4.275,51 5.186,52 5.44,53 4.27,54 4.219,55 5.075,56 5.309,57 4.15,58 3.184,59 3.283,60 1.536,61 1.497,62 1.567,63 18.08,64 15.072,65 3.2,66 5}
{0 CHEMBL1957085,1 7.55,2 7.55,3 0.011,4 2,5 5.689,6 4.067,7 4.233,8 11.757,9 0.062,10 0.699,11 0.28,12 18.247,13 4.399,14 4.832,15 0.091,16 0.078,17 79.223,18 14.3,19 4.649,20 3.069,21 167.157,22 15.265,23 6.273,24 2.093,25 97.234,26 77.25,27 77.25,28 7.948,29 52.973,30 175.358,31 5.496,32 4.925,33 3.754,34 1.596,35 0.104,36 -0.114,37 52.279,38 3.723,39 14.48,40 5.125,41 1.073,42 0.657,43 61.821,44 0.125,45 5,46 61.821,47 139.773,48 3.856,49 3.629,50 3.594,51 4.408,52 4.632,53 3.555,54 3.507,55 4.252,56 4.445,57 3.405,58 2.854,59 2.925,60 1.288,61 1.329,62 1.505,63 7.742,64 7.537,65 7.9,66 5}
{0 CHEMBL2012519,1 9.009,2 9.009,3 0.101,4 1.733,5 6.255,6 5.13,7 5.339,8 40.605,9 0.01,10 0.741,11 0.38,12 38.521,13 5.014,14 6.468,15 0.083,16 0.225,17 200.34,18 22.208,19 5.294,20 1.773,21 250.683,22 37.07,23 16.694,24 1.91,25 200.34,26 113.29,27 113.29,28 15.648,29 33.614,30 91.691,31 6.268,32 17.693,33 3.727,34 1.871,35 -0.032,36 0.03,37 18.963,38 6.117,39 29.905,40 12.739,41 1.564,42 1.25,43 71.792,44 0.02,45 1,46 71.792,47 183.951,48 4.088,49 4.101,50 4.06,51 5.075,52 5.261,53 4.129,54 4.077,55 5.064,56 5.246,57 4.18,58 3.056,59 3.092,60 1.495,61 1.466,62 1.562,63 15.6,64 13.532,65 14,66 5}
{0 CHEMBL208637,1 7.053,2 7.053,3 0.454,4 1.655,5 5.39,6 3.883,7 4.156,8 12.095,9 0.137,10 0.758,11 0.344,12 11.372,13 4.325,14 4.777,15 0.095,16 0.294,17 116.887,18 22.096,19 4.325,20 1.559,21 121.096,22 10.825,23 5.046,24 1.828,25 134.898,26 101.03,27 101.03,28 4.057,29 48.002,30 164.863,31 5.335,32 4.262,33 3.531,34 1.696,35 0.035,36 -0.078,37 71.313,38 2.705,39 12.188,40 3.323,41 0.964,42 0.66,43 48.367,44 0.107,45 3,46 48.367,47 105.851,48 3.553,49 3.165,50 3.167,51 3.983,52 4.181,53 3.12,54 3.096,55 3.923,56 4.141,57 3.024,58 2.516,59 2.626,60 0.992,61 0.977,62 1.536,63 4.938,64 4.185,65 7.1,66 5.42}
{0 CHEMBL210032,1 7.528,2 7.528,3 0.328,4 1.81,5 5.675,6 4.057,7 4.301,8 12.784,9 0.012,10 0.728,11 0.336,12 11.658,13 4.018,14 4.793,15 0.103,16 0.183,17 105.887,18 15.684,19 4.389,20 2.516,21 124.561,22 11.89,23 5.851,24 1.965,25 123.898,26 91.8,27 91.8,28 4.886,29 42.944,30 199.954,31 5.5,32 5.59,33 3.582,34 1.697,35 -0.037,36 0.082,37 60.652,38 2.862,39 12.29,40 4.387,41 1.116,42 0.736,43 49.258,44 0.063,45 2,46 49.258,47 113.051,48 3.651,49 3.496,50 3.459,51 4.134,52 4.327,53 3.452,54 3.423,55 4.115,56 4.321,57 3.376,58 2.835,59 2.919,60 1.181,61 1.107,62 1.533,63 6.582,64 5.455,65 3.2,66 5.42}
{0 CHEMBL210618,1 9.263,2 9.263,3 0.137,4 1.773,5 6.194,6 4.612,7 4.837,8 24.239,9 0.19,10 0.735,11 0.335,12 25.039,13 4.648,14 4.91,15 0.101,16 0.221,17 138.887,18 36.102,19 4.866,20 2.358,21 213.819,22 24.41,23 11.057,24 1.931,25 156.897,26 119.49,27 119.49,28 10.441,29 83.674,30 222.44,31 5.956,32 8.432,33 3.563,34 1.781,35 0.173,36 -0.105,37 65.022,38 4.8,39 19.529,40 7.606,41 1.658,42 1.125,43 76.587,44 0.149,45 7,46 76.587,47 176.468,48 4.033,49 3.849,50 3.828,51 4.72,52 4.923,53 3.836,54 3.786,55 4.671,56 4.897,57 3.746,58 3.122,59 3.19,60 1.51,61 1.463,62 1.54,63 10.062,64 8.287,65 8.7,66 5.42}
{0 CHEMBL210928,1 9.634,2 9.634,3 0.073,4 1.681,5 6.379,6 4.872,7 5.092,8 35.322,9 0.226,10 0.751,11 0.327,12 35.288,13 4.853,14 5.192,15 0.104,16 0.299,17 191.289,18 36.242,19 4.986,20 2.324,21 247.519,22 39.801,23 13.717,24 1.873,25 170.151,26 129.84,27 138.22,28 12.476,29 54.48,30 174.358,31 6.176,32 11.442,33 3.717,34 1.775,35 0.143,36 -0.078,37 33.963,38 5.435,39 26.386,40 11.49,41 2.409,42 1.528,43 95.863,44 0.154,45 8,46 95.863,47 200.274,48 4.123,49 4.048,50 4.013,51 4.912,52 5.078,53 4.053,54 3.995,55 4.897,56 5.087,57 3.996,58 3.134,59 3.221,60 1.572,61 1.563,62 1.585,63 11.66,64 9.271,65 11.8,66 5.42}
{0 CHEMBL210963,1 10.06,2 10.06,3 0.167,4 1.69,5 6.478,6 4.909,7 5.135,8 35.117,9 0.227,10 0.749,11 0.323,12 33.506,13 4.897,14 6.82,15 0.105,16 0.273,17 183.2,18 37.912,19 5.027,20 2.466,21 254.648,22 35.648,23 13.687,24 1.878,25 201.21,26 153.63,27 162.01,28 12.571,29 85.225,30 221.705,31 6.236,32 11.617,33 3.721,34 1.781,35 0.136,36 -0.082,37 65.022,38 5.434,39 24.393,40 11.067,41 2.449,42 1.646,43 94.095,44 0.151,45 8,46 94.095,47 207.403,48 4.141,49 4.065,50 4.052,51 4.945,52 5.118,53 4.077,54 4.03,55 4.922,56 5.119,57 4.012,58 3.167,59 3.241,60 1.573,61 1.565,62 1.579,63 11.558,64 9.279,65 11.5,66 5.42}
{0 CHEMBL2178352,1 9.076,2 9.076,3 0.087,4 2.165,5 6.148,6 5.04,7 5.279,8 34.613,9 -0.014,10 0.675,11 0.311,12 39.353,13 4.371,14 4.516,15 0.105,16 0.03,17 50.357,18 56.339,19 4.976,20 3.853,21 292.879,22 36.02,23 17.62,24 2.227,25 94.526,26 74.14,27 74.14,28 18.479,29 65.53,30 231.745,31 5.956,32 17.421,33 3.91,34 1.923,35 -0.014,36 -0.102,37 76.311,38 8.21,39 39.463,40 11.371,41 1.369,42 1.147,43 94.046,44 0.083,45 6,46 94.046,47 228.731,48 4.453,49 4.359,50 4.247,51 5.14,52 5.405,53 4.334,54 4.246,55 5.075,56 5.317,57 4.332,58 3.188,59 3.288,60 1.741,61 1.783,62 1.508,63 20.599,64 19.116,66 5}
{0 CHEMBL221959,1 9.527,2 9.527,3 0.006,4 1.89,5 6.327,6 4.681,7 4.945,8 25.547,9 0.086,10 0.713,11 0.354,12 31.822,13 4.926,14 4.498,15 0.099,16 0.161,17 89.775,18 21.804,19 5.019,20 2.176,21 211.82,22 29.314,23 13.766,24 2.041,25 112.809,26 88.91,27 88.91,28 15.511,29 62.161,30 169.231,31 5.78,32 11.408,33 3.642,34 1.709,35 0.099,36 -0.16,37 79.409,38 4.976,39 24.153,40 8.631,41 1.217,42 0.903,43 67.381,44 0.067,45 3,46 67.381,47 158.574,48 3.998,49 3.998,50 3.897,51 4.905,52 5.183,53 4.009,54 3.869,55 4.827,56 5.104,57 3.916,58 3.001,59 3.104,60 1.534,61 1.481,62 1.577,63 13.754,64 11.503,65 2.3,66 5}
{0 CHEMBL225519,1 8.611,2 8.611,3 -0.015,4 2.087,5 6.032,6 3.514,7 3.732,8 7.208,9 -0.047,10 0.685,11 0.332,12 11.374,13 4.208,14 4.078,15 0.103,16 0.044,17 41.93,18 6.909,19 4.31,20 2.161,21 113.627,22 7.694,23 4.059,24 2.174,25 76.727,26 57.78,27 57.78,28 5.508,29 41.252,30 119.335,31 4.67,32 3.302,33 3.468,34 1.509,35 -0.048,36 0.03,37 57.531,38 2.753,39 13.013,40 2.941,41 0.774,42 0.372,43 42.554,44 0.034,45 1,46 42.554,47 98.017,48 3.554,49 3.308,50 3.227,51 3.908,52 4.157,53 3.092,54 2.979,55 3.606,56 3.829,57 2.868,58 2.392,59 2.503,60 1.09,61 1.107,62 1.535,63 6.053,64 6.42,65 3.7,66 5}
{0 CHEMBL2312290,1 9.124,2 9.124,3 0.035,4 1.965,5 6.165,6 5.225,7 5.49,8 44.601,9 -0.002,10 0.704,11 0.284,12 42.877,13 4.735,14 4.922,15 0.084,16 0.097,17 105.861,18 61.306,19 5.435,20 2.196,21 355.122,22 42.852,23 19.426,24 2.071,25 163.017,26 117.71,27 117.71,28 19.279,29 47.905,30 209.163,31 6.176,32 18.702,33 3.924,34 1.883,35 0.007,36 -0.108,37 60.781,38 9.527,39 44.156,40 12.08,41 1.507,42 1.101,43 115.848,44 0.167,45 13,46 115.848,47 255.807,48 4.532,49 4.307,50 4.216,51 5.201,52 5.443,53 4.309,54 4.214,55 5.201,56 5.445,57 4.304,58 3.254,59 3.314,60 1.767,61 1.769,62 1.491,63 19.797,64 20.513,65 5.3,66 4.523}
{0 CHEMBL2312301,1 8.987,2 8.987,3 0.055,4 2,5 6.131,6 5.074,7 5.321,8 37.808,9 -0.043,10 0.699,11 0.277,12 36.532,13 4.793,14 4.849,15 0.081,16 0.073,17 94.861,18 57.842,19 5.429,20 2.226,21 325.908,22 39.159,23 17.042,24 2.095,25 152.017,26 108.48,27 108.48,28 17.046,29 31.662,30 199.979,31 6.117,32 15.812,33 3.924,34 1.881,35 -0.036,36 -0.081,37 58.246,38 8.592,39 40.458,40 10.336,41 1.276,42 0.983,43 104.613,44 0.155,45 11,46 104.613,47 238.352,48 4.439,49 4.19,50 4.102,51 5.056,52 5.299,53 4.197,54 4.106,55 5.105,56 5.36,57 4.198,58 3.249,59 3.315,60 1.749,61 1.755,62 1.486,63 17.42,64 18.934,65 4.4,66 4.523}
{0 CHEMBL2312303,1 8.747,2 8.747,3 0.026,4 1.962,5 6.066,6 5.01,7 5.244,8 36.477,9 -0.052,10 0.703,11 0.297,12 40.687,13 4.718,14 4.958,15 0.083,16 0.127,17 162.158,18 55.541,19 5.375,20 2.201,21 301.961,22 35.533,23 14.471,24 2.077,25 141.017,26 99.25,27 99.25,28 14.99,29 22.42,30 181.377,31 6.065,32 14.456,33 3.924,34 1.879,35 -0.029,36 -0.036,37 58.246,38 7.66,39 44.636,40 9.726,41 1.507,42 0.92,43 107.244,44 0.149,45 10,46 107.244,47 229.429,48 4.379,49 4.173,50 4.069,51 4.95,52 5.178,53 4.145,54 4.058,55 4.981,56 5.211,57 4.149,58 3.16,59 3.237,60 1.745,61 1.753,62 1.496,63 16.763,64 18.883,65 3.1,66 4.523}
{0 CHEMBL2312304,1 8.747,2 8.747,3 -0.029,4 1.962,5 6.066,6 4.975,7 5.198,8 34.086,9 -0.033,10 0.703,11 0.3,12 38.906,13 4.821,14 4.958,15 0.083,16 0.128,17 173.158,18 53.426,19 5.406,20 2.201,21 298.921,22 33.625,23 13.287,24 2.077,25 152.017,26 108.48,27 108.48,28 13.767,29 33.42,30 182.958,31 6.07,32 13.478,33 3.876,34 1.878,35 0.022,36 -0.068,37 57.769,38 7.005,39 41.658,40 9.143,41 1.507,42 0.92,43 108.248,44 0.154,45 10,46 108.248,47 230.292,48 4.354,49 4.137,50 4.048,51 4.918,52 5.134,53 4.108,54 4.037,55 4.95,56 5.17,57 4.115,58 3.148,59 3.219,60 1.689,61 1.673,62 1.496,63 15.599,64 17.563,65 4.8,66 4.523}
{0 CHEMBL233149,1 9.31,2 9.31,3 -0.163,4 1.828,5 6.204,6 3.858,7 3.991,8 9.199,9 -0.072,10 0.722,11 0.313,12 14.63,13 4.337,14 5.819,15 0.078,16 0.161,17 141.929,18 5.372,19 4.676,20 2.962,21 147.464,22 11.805,23 5.304,24 2.006,25 159.939,26 130.01,27 166.63,28 6.091,29 45.916,30 169.89,31 5.227,32 4.008,33 3.727,34 1.499,35 -0.084,36 0.034,37 49.683,38 2.462,39 17.108,40 5.112,41 0.832,42 0.824,43 66.862,44 0.083,45 3,46 66.862,47 129.058,48 3.746,49 3.583,50 3.538,51 4.226,52 4.397,53 3.491,54 3.414,55 3.983,56 4.155,57 3.319,58 2.803,59 2.838,60 1.181,61 1.225,62 1.565,63 5.54,64 5.748,65 11.8,66 4.174}
{0 CHEMBL2333365,1 10.465,2 10.465,3 -0.066,4 1.837,5 6.646,6 4.915,7 5.144,8 33.206,9 0.125,10 0.72,11 0.356,12 36.728,13 4.942,14 6.999,15 0.095,16 0.177,17 145.101,18 22.377,19 5.306,20 3.345,21 266.848,22 30.372,23 15.037,24 2.019,25 133.265,26 102.59,27 110.97,28 15.662,29 51.89,30 191.883,31 5.977,32 14.293,33 3.848,34 1.838,35 0.059,36 -0.016,37 29.801,38 5.828,39 27.651,40 11.9,41 2.17,42 1.337,43 95.86,44 0.053,45 3,46 95.86,47 213.338,48 4.194,49 4.265,50 4.212,51 5.016,52 5.222,53 4.206,54 4.124,55 4.905,56 5.114,57 4.118,58 3.131,59 3.212,60 1.51,61 1.443,62 1.588,63 14.525,64 12.539,65 7.4,66 5.456}
{0 CHEMBL2347053,1 10.845,2 10.845,3 -0.132,4 2,5 6.701,6 4.195,7 4.387,8 12.571,9 -0.099,10 0.696,11 0.379,12 15.557,13 4.182,14 5.026,15 0.109,16 0.086,17 92.555,18 15.835,19 4.723,20 4.378,21 154.75,22 15.073,23 5.861,24 2.13,25 132.899,26 107.36,27 107.36,28 6.327,29 43.966,30 177.058,31 5.89,32 5.384,33 3.823,34 1.71,35 -0.073,36 0.155,37 43.721,38 2.981,39 12.476,40 5.64,41 1.114,42 0.892,43 61.917,44 0.075,45 3,46 61.917,47 124.776,48 3.864,49 3.794,50 3.792,51 4.484,52 4.648,53 3.719,54 3.736,55 4.416,56 4.587,57 3.61,58 2.822,59 2.885,60 1.277,61 1.42,62 1.577,63 6.787,64 7.126,65 8.1,66 8.081}
{0 CHEMBL248757,1 9.185,2 9.185,3 0.028,4 2,5 6.175,6 4.99,7 5.186,8 35.231,9 -0.018,10 0.698,11 0.293,12 30.436,13 5.084,14 4.959,15 0.094,16 0.094,17 167.709,18 46.934,19 5.244,20 3.127,21 254.193,22 30.656,23 11.827,24 2.101,25 182.593,26 134.08,27 162.32,28 11.384,29 88.168,30 242.468,31 6.167,32 13.197,33 3.822,34 1.79,35 -0.001,36 -0.03,37 111.512,38 4.173,39 27.778,40 10.859,41 1.783,42 1.156,43 96.289,44 0.057,45 3,46 96.289,47 213.854,48 4.153,49 4.079,50 4.048,51 4.91,52 5.085,53 4.16,54 4.118,55 4.938,56 5.11,57 4.253,58 3.18,59 3.246,60 1.37,61 1.438,62 1.478,63 11.075,64 10.232,65 6,66 5.458}
{0 CHEMBL255592,1 12.333,2 12.333,3 -0.161,4 1.952,5 7.228,6 4.79,7 5,8 24.002,9 0.178,10 0.702,11 0.324,12 26.976,13 4.626,14 4.921,15 0.103,16 0.137,17 89.775,18 30.157,19 5.195,20 5.303,21 254.426,22 23.715,23 12.797,24 2.102,25 96.024,26 76.5,27 76.5,28 13.992,29 80.746,30 286.837,31 5.932,32 12.806,33 3.905,34 1.936,35 0.193,36 -0.062,37 84.245,38 5.479,39 21.632,40 9.984,41 2.321,42 1.497,43 79.521,44 0.034,45 2,46 79.521,47 200.387,48 4.216,49 4.318,50 4.249,51 4.9,52 5.102,53 4.255,54 4.188,55 4.811,56 5.004,57 4.197,58 3.061,59 3.142,60 1.499,61 1.502,62 1.577,63 14.053,64 12.356,65 1.8,66 4.602}
{0 CHEMBL270638,1 9.361,2 9.361,3 -0.09,4 2.043,5 6.272,6 4.673,7 4.89,8 21.222,9 0.056,10 0.69,11 0.348,12 21.654,13 4.676,14 4.758,15 0.107,16 0.09,17 81.416,18 12.075,19 5.29,20 6.188,21 238.5,22 23.16,23 12.704,24 2.154,25 83.315,26 67.39,27 67.39,28 12.512,29 79.275,30 287.704,31 5.794,32 11.937,33 3.91,34 1.937,35 0.028,36 -0.046,37 84.367,38 4.962,39 20.169,40 9.54,41 2.001,42 1.126,43 68.591,44 0.036,45 2,46 68.591,47 182.584,48 4.141,49 4.221,50 4.145,51 4.756,52 4.952,53 4.197,54 4.113,55 4.764,56 4.981,57 4.147,58 3.093,59 3.146,60 1.588,61 1.575,62 1.553,63 11.683,64 10.505,66 6.611}
{0 CHEMBL270639,1 9.351,2 9.351,3 -0.016,4 2.09,5 6.269,6 4.641,7 4.858,8 20.185,9 0.011,10 0.684,11 0.327,12 18.2,13 4.584,14 4.758,15 0.112,16 0.06,17 81.416,18 11.186,19 5.236,20 6.188,21 220.039,22 20.091,23 10.88,24 2.18,25 83.315,26 67.39,27 67.39,28 10.435,29 79.275,30 281.413,31 5.755,32 11.779,33 3.905,34 1.937,35 -0.015,36 -0.05,37 78.077,38 4.363,39 17.56,40 8.467,41 1.961,42 1.063,43 64.77,44 0.038,45 2,46 64.77,47 169.41,48 4.085,49 4.149,50 4.079,51 4.655,52 4.838,53 4.131,54 4.06,55 4.691,56 4.894,57 4.108,58 3.093,59 3.146,60 1.511,61 1.495,62 1.532,63 10.729,64 8.849,66 6.959}
{0 CHEMBL270640,1 9.452,2 9.452,3 -0.134,4 2.087,5 6.292,6 4.84,7 5.073,8 26.112,9 0.005,10 0.685,11 0.316,12 20.189,13 4.691,14 4.755,15 0.116,16 0.058,17 81.416,18 11.186,19 5.305,20 6.153,21 239.255,22 21.975,23 12.375,24 2.174,25 83.315,26 67.39,27 67.39,28 11.748,29 79.275,30 283.947,31 5.853,32 15.009,33 3.905,34 1.937,35 -0.022,36 -0.046,37 80.611,38 4.962,39 20.683,40 9.465,41 2.086,42 1.063,43 68.591,44 0.055,45 3,46 68.591,47 182.584,48 4.141,49 4.2,50 4.135,51 4.735,52 4.914,53 4.221,54 4.148,55 4.794,56 4.985,57 4.234,58 3.186,59 3.237,60 1.535,61 1.539,62 1.534,63 11.053,64 10.765,66 6.485}
{0 CHEMBL272265,1 8.96,2 8.96,3 -0.016,4 2.143,5 6.131,6 4.465,7 4.66,8 15.13,9 -0.045,10 0.678,11 0.303,12 16.547,13 4.53,14 4.761,15 0.108,16 0.028,17 81.416,18 10.998,19 5.225,20 6.225,21 203.849,22 13.849,23 7.48,24 2.207,25 83.315,26 67.39,27 67.39,28 9.057,29 79.275,30 278.878,31 5.594,32 8.759,33 3.905,34 1.937,35 -0.031,36 -0.055,37 75.542,38 3.761,39 15.343,40 6.144,41 1.641,42 0.875,43 60.824,44 0.041,45 2,46 60.824,47 152.989,48 4.026,49 4.051,50 3.985,51 4.536,52 4.732,53 3.991,54 3.927,55 4.455,56 4.631,57 3.945,58 3.031,59 3.082,60 1.363,61 1.405,62 1.52,63 9.46,64 8.487,66 7.469}
{0 CHEMBL319467,1 10.368,2 10.368,3 0.016,4 1.988,5 6.544,6 4.575,7 4.773,8 21.103,9 -0.072,10 0.699,11 0.264,12 26.304,13 4.484,14 4.833,15 0.087,16 0.081,17 136.961,18 26.375,19 4.814,20 3.222,21 224.219,22 20.573,23 8.444,24 2.106,25 171.757,26 135.88,27 144.26,28 10.168,29 51.819,30 195.114,31 5.589,32 8.795,33 3.928,34 1.79,35 -0.069,36 -0.067,37 62.579,38 5.519,39 31.304,40 5.937,41 1.138,42 0.82,43 88.762,44 0.113,45 6,46 88.762,47 188.113,48 4.153,49 3.905,50 3.832,51 4.674,52 4.921,53 3.752,54 3.699,55 4.52,56 4.735,57 3.763,58 3.111,59 3.206,60 1.488,61 1.549,62 1.499,63 12.995,64 13.93,65 6,66 6.097}
{0 CHEMBL362558,1 11.588,2 11.588,3 -0.044,4 2.073,5 6.898,6 5.253,7 5.462,8 41.841,9 0.06,10 0.683,11 0.43,12 37.857,13 4.975,14 7.408,15 0.12,16 0.073,17 107.18,18 28.135,19 5.501,20 4.488,21 313.449,22 39.598,23 18.469,24 2.205,25 119.665,26 95.71,27 95.71,28 17.043,29 36.669,30 181.624,31 6.447,32 18.093,33 3.922,34 1.991,35 0.08,36 -0.08,37 56.34,38 6.502,39 34.536,40 14.806,41 2.408,42 1.751,43 105.602,44 0.029,45 2,46 105.602,47 251.449,48 4.399,49 4.501,50 4.47,51 5.232,52 5.416,53 4.471,54 4.452,55 5.237,56 5.437,57 4.457,58 3.32,59 3.372,60 1.547,61 1.609,62 1.596,63 18.108,64 17.249,65 4.8,66 5.208}
{0 CHEMBL362588,1 11.552,2 11.552,3 -0.041,4 2.114,5 6.891,6 5.224,7 5.445,8 40.8,9 0.051,10 0.678,11 0.408,12 38.148,13 4.882,14 5.059,15 0.119,16 0.057,17 92.22,18 26.485,19 5.469,20 4.497,21 307.549,22 39.672,23 19.386,24 2.228,25 119.665,26 95.71,27 95.71,28 17.874,29 27.548,30 181.979,31 6.357,32 19.187,33 3.922,34 1.995,35 0.082,36 -0.08,37 56.34,38 6.79,39 34.931,40 14.698,41 2.137,42 1.56,43 99.487,44 0.029,45 2,46 99.487,47 243.02,48 4.395,49 4.503,50 4.457,51 5.215,52 5.405,53 4.474,54 4.434,55 5.221,56 5.427,57 4.46,58 3.32,59 3.372,60 1.555,61 1.61,62 1.592,63 18.672,64 17.984,65 4.8,66 5.367}
{0 CHEMBL362814,1 11.551,2 11.551,3 -0.097,4 2,5 6.891,6 5.036,7 5.243,8 32.593,9 0.195,10 0.693,11 0.447,12 31.138,13 4.896,14 5.058,15 0.116,16 0.126,17 92.22,18 22.95,19 5.316,20 4.502,21 274.192,22 37.474,23 18.129,24 2.16,25 119.665,26 95.71,27 95.71,28 15.803,29 27.548,30 186.957,31 6.297,32 14.234,33 3.818,34 1.87,35 0.247,36 -0.111,37 44.525,38 5.554,39 25.154,40 13.58,41 2.106,42 1.602,43 90.743,44 0.033,45 2,46 90.743,47 221.398,48 4.279,49 4.405,50 4.37,51 5.093,52 5.271,53 4.39,54 4.347,55 5.137,56 5.36,57 4.335,58 3.318,59 3.371,60 1.547,61 1.596,62 1.623,63 15.45,64 13.382,65 5.4,66 4.699}
{0 CHEMBL363058,1 11.55,2 11.55,3 -0.029,4 2,5 6.89,6 5.133,7 5.352,8 37.758,9 0.114,10 0.693,11 0.441,12 33.212,13 4.978,14 5.059,15 0.117,16 0.122,17 103.22,18 24.225,19 5.384,20 4.501,21 288.743,22 32.39,23 16.085,24 2.155,25 127.541,26 101.7,27 101.7,28 14.477,29 38.548,30 187.177,31 6.297,32 17.161,33 3.809,34 1.895,35 0.132,36 -0.094,37 59.051,38 5.898,39 28.649,40 12.846,41 2.186,42 1.602,43 93.9,44 0.063,45 4,46 93.9,47 232.863,48 4.303,49 4.403,50 4.375,51 5.116,52 5.285,53 4.372,54 4.353,55 5.084,56 5.266,57 4.347,58 3.32,59 3.372,60 1.552,61 1.607,62 1.614,63 15.817,64 14.024,65 6.9,66 5.187}
{0 CHEMBL378627,1 10.099,2 10.099,3 0.201,4 1.668,5 6.486,6 5,7 5.227,8 37.697,9 0.224,10 0.753,11 0.346,12 35.262,13 4.826,14 6.82,15 0.103,16 0.298,17 183.2,18 40.237,19 4.949,20 2.465,21 265.445,22 37.157,23 14.975,24 1.864,25 201.21,26 153.63,27 162.01,28 13.274,29 85.225,30 225.937,31 6.295,32 12.513,33 3.723,34 1.844,35 0.118,36 -0.078,37 69.255,38 5.985,39 27.319,40 11.87,41 2.529,42 1.84,43 97.987,44 0.143,45 8,46 97.987,47 215.897,48 4.194,49 4.122,50 4.098,51 4.989,52 5.163,53 4.138,54 4.092,55 4.984,56 5.176,57 4.102,58 3.167,59 3.241,60 1.573,61 1.565,62 1.59,63 13.369,64 10.399,65 10.9,66 5.42}
{0 CHEMBL391738,1 9.396,2 9.396,3 0.117,4 1.895,5 6.254,6 4.942,7 5.126,8 36.539,9 0.229,10 0.713,11 0.33,12 43.666,13 4.747,14 4.717,15 0.107,16 0.189,17 148.142,18 39.418,19 5.116,20 4.233,21 299.085,22 30.527,23 15.096,24 2.04,25 94.104,26 73.65,27 73.65,28 19.908,29 120.456,30 247.035,31 6.062,32 14.455,33 3.908,34 1.891,35 0.281,36 -0.1,37 79.573,38 6.848,39 33.016,40 11.699,41 2.596,42 1.278,43 104.195,44 0.091,45 6,46 104.195,47 237.111,48 4.348,49 4.409,50 4.293,51 5.09,52 5.338,53 4.342,54 4.234,55 4.921,56 5.105,57 4.3,58 3.238,59 3.304,60 1.561,61 1.527,62 1.548,63 19.646,64 15.155,65 3.2,66 5.301}
{0 CHEMBL404024,1 8.996,2 8.996,3 -0.095,4 2.09,5 6.145,6 4.503,7 4.699,8 16.307,9 0.013,10 0.684,11 0.327,12 19.908,13 4.626,14 4.761,15 0.103,16 0.06,17 81.416,18 11.886,19 5.278,20 6.223,21 222.039,22 17.118,23 9.408,24 2.18,25 83.315,26 67.39,27 67.39,28 11.102,29 79.275,30 285.169,31 5.639,32 8.973,33 3.909,34 1.937,35 0.02,36 -0.05,37 81.833,38 4.363,39 18.014,40 7.289,41 1.681,42 0.938,43 64.77,44 0.038,45 2,46 64.77,47 167.933,48 4.085,49 4.13,50 4.057,51 4.649,52 4.858,53 4.066,54 3.987,55 4.546,56 4.742,57 3.991,58 3.033,59 3.083,60 1.416,61 1.469,62 1.541,63 10.348,64 10.152,66 6.824}
{0 CHEMBL404630,1 9.028,2 9.028,3 0.057,4 2,5 6.167,6 4.464,7 4.647,8 19.528,9 0.05,10 0.696,11 0.345,12 30.073,13 4.457,14 4.797,15 0.101,16 0.108,17 164.846,18 25.377,19 5.001,20 3.18,21 209.456,22 25.153,23 10.137,24 2.12,25 146.832,26 90.99,27 90.99,28 12.389,29 27.631,30 125.329,31 5.655,32 9.037,33 3.851,34 1.883,35 0.046,36 0.023,37 23.489,38 5,39 27.495,40 7.785,41 1.409,42 0.858,43 81.162,44 0.1,45 5,46 81.162,47 178.827,48 4.086,49 3.974,50 3.884,51 4.747,52 4.99,53 3.846,54 3.772,55 4.587,56 4.799,57 3.778,58 2.999,59 3.023,60 1.297,61 1.395,62 1.532,63 13.369,64 11.617,65 8.5,66 4.699}
{0 CHEMBL410659,1 9.763,2 9.763,3 -0.067,4 2.211,5 6.351,6 5.05,7 5.297,8 34.498,9 -0.033,10 0.667,11 0.373,12 33.135,13 4.648,14 4.703,15 0.107,16 0.024,17 83.254,18 16.994,19 5.318,20 5.153,21 292.82,22 35.078,23 19.142,24 2.279,25 87.665,26 72.34,27 72.34,28 18.359,29 30.06,30 237.844,31 5.946,32 18.518,33 3.972,34 1.994,35 -0.04,36 -0.001,37 37.364,38 7.534,39 33.053,40 13.361,41 2.176,42 1.24,43 85.571,44 0.072,45 5,46 85.571,47 226.762,48 4.386,49 4.381,50 4.294,51 5.046,52 5.269,53 4.394,54 4.286,55 5.074,56 5.316,57 4.371,58 3.219,59 3.297,60 1.595,61 1.592,62 1.533,63 17.917,64 17.733,66 4.523}
{0 CHEMBL445813,1 9.962,2 9.962,3 0.308,4 1.899,5 6.457,6 4.413,7 4.599,8 19.94,9 -0.062,10 0.712,11 0.331,12 25.159,13 4.612,14 4.965,15 0.084,16 0.173,17 145.25,18 37.709,19 4.726,20 2.165,21 193.722,22 15.19,23 6.381,24 2.038,25 137.648,26 98.91,27 98.91,28 7.553,29 32.363,30 159.224,31 5.752,32 6.851,33 3.878,34 1.652,35 -0.046,36 0.053,37 82.732,38 4.067,39 27.014,40 5.304,41 1.169,42 0.802,43 77.381,44 0.091,45 4,46 77.381,47 165.193,48 3.982,49 3.795,50 3.747,51 4.505,52 4.704,53 3.629,54 3.6,55 4.35,56 4.516,57 3.634,58 2.909,59 2.981,60 1.327,61 1.414,62 1.539,63 10.181,64 11.089,65 4.8,66 5}
{0 CHEMBL461139,1 8.784,2 8.784,3 0.11,4 2.138,5 6.068,6 4.686,7 4.922,8 24.207,9 0.016,10 0.679,11 0.3,12 27.499,13 4.872,14 4.738,15 0.101,16 0.023,17 104.04,18 15.932,19 5.199,20 4.978,21 263.112,22 21.417,23 11.94,24 2.2,25 123.95,26 87.16,27 87.16,28 14.879,29 48.316,30 208.079,31 5.655,32 12.293,33 3.876,34 1.9,35 0.067,36 -0.042,37 58.591,38 5.891,39 26.485,40 8.674,41 1.619,42 0.566,43 83.073,44 0.086,45 5,46 83.073,47 205.085,48 4.223,49 4.123,50 4.008,51 4.795,52 5.052,53 4.039,54 3.924,55 4.646,56 4.854,57 3.978,58 3.111,59 3.206,60 1.513,61 1.429,62 1.5,63 15.666,64 13.427,65 3.7,66 5.679}
{0 CHEMBL461140,1 8.784,2 8.784,3 0.097,4 2,5 6.068,6 4.579,7 4.781,8 20.279,9 0.112,10 0.697,11 0.311,12 25.692,13 4.838,14 4.82,15 0.093,16 0.094,17 104.04,18 11.521,19 5.171,20 4.921,21 256.419,22 19.725,23 10.279,24 2.107,25 123.95,26 87.16,27 87.16,28 13.041,29 61.373,30 218.126,31 5.586,32 10.669,33 3.853,34 1.882,35 0.145,36 -0.067,37 49.787,38 5.788,39 23.828,40 7.365,41 1.468,42 0.754,43 81.886,44 0.125,45 7,46 81.886,47 199.9,48 4.193,49 4.025,50 3.924,51 4.716,52 4.965,53 3.927,54 3.825,55 4.545,56 4.756,57 3.877,58 3.16,59 3.237,60 1.508,61 1.474,62 1.511,63 14.379,64 11.963,65 3.8,66 5.475}
{0 CHEMBL489058,1 9.17,2 9.17,3 0.105,4 2,5 6.186,6 5.047,7 5.283,8 42.305,9 0.1,10 0.697,11 0.295,12 47.93,13 4.994,14 4.868,15 0.098,16 0.109,17 103.779,18 37.247,19 5.481,20 4.729,21 354.593,22 38.78,23 19.929,24 2.11,25 90.789,26 73.01,27 98.31,28 22.982,29 97.659,30 265.079,31 6.082,32 19.196,33 3.943,34 1.925,35 0.123,36 -0.045,37 102.144,38 8.366,39 45.222,40 14.517,41 2.328,42 1.083,43 109.774,44 0.12,45 9,46 109.774,47 273.12,48 4.473,49 4.518,50 4.362,51 5.21,52 5.48,53 4.453,54 4.321,55 5.083,56 5.314,57 4.433,58 3.352,59 3.429,60 1.729,61 1.684,62 1.52,63 23.472,64 19.943,66 5.509}
{0 CHEMBL492251,1 9.263,2 9.263,3 -0.017,4 2,5 6.195,6 4.669,7 4.885,8 22.466,9 0.145,10 0.697,11 0.339,12 24.081,13 4.542,14 4.806,15 0.105,16 0.106,17 69.845,18 25.135,19 5.056,20 4.401,21 208.923,22 21.505,23 11.734,24 2.115,25 104.641,26 82.96,27 82.96,28 11.945,29 134.08,30 244.759,31 5.805,32 11.441,33 3.803,34 1.8,35 0.179,36 -0.036,37 83.95,38 4.498,39 17.131,40 8.854,41 1.715,42 0.948,43 70.918,44 0.102,45 5,46 70.918,47 171.703,48 4.048,49 4.044,50 3.985,51 4.743,52 4.953,53 4.045,54 3.971,55 4.683,56 4.884,57 4.027,58 3.112,59 3.18,60 1.556,61 1.511,62 1.546,63 10.837,64 9.202,65 4.3,66 5}
{0 CHEMBL495727,1 9.186,2 9.186,3 0.078,4 2.154,5 6.171,6 4.676,7 4.912,8 24.028,9 -0.062,10 0.676,11 0.339,12 27.374,13 4.952,14 4.627,15 0.092,16 0.026,17 69.593,18 33.1,19 5.045,20 3.111,21 252.539,22 22.823,23 11.534,24 2.223,25 142.188,26 110.96,27 110.96,28 11.367,29 47.416,30 183.681,31 5.673,32 10.526,33 3.911,34 1.7,35 -0.062,36 -0.048,37 100.394,38 5.677,39 27.534,40 7.749,41 1.184,42 0.754,43 82.89,44 0.091,45 5,46 82.89,47 203.935,48 4.208,49 3.955,50 3.886,51 4.767,52 5.011,53 3.895,54 3.84,55 4.655,56 4.878,57 3.893,58 3.111,59 3.206,60 1.513,61 1.429,62 1.511,63 13.108,64 12.272,65 3.9,66 8}
{0 CHEMBL504547,1 9.989,2 9.989,3 0.078,4 1.953,5 6.462,6 4.224,7 4.413,8 27.824,9 -0.002,10 0.703,11 0.35,12 17.421,13 4.783,14 5.094,15 0.102,16 0.185,17 102.481,18 19.89,19 5.333,20 3.663,21 205.678,22 38.794,23 9.097,24 2.094,25 138.502,26 95.33,27 95.33,28 9.34,29 30.28,30 167.17,31 5.679,32 7.769,33 3.77,34 1.673,35 0.042,36 0.037,37 38.127,38 3.527,39 25.743,40 10.624,41 1.782,42 1.032,43 72.487,44 0.087,45 4,46 72.487,47 162.459,48 3.974,49 4.028,50 3.937,51 4.649,52 4.831,53 3.951,54 3.823,55 4.503,56 4.714,57 3.772,58 2.929,59 2.969,60 1.341,61 1.419,62 1.544,63 10.019,64 9.66,65 9.3,66 4.77}
{0 CHEMBL507249,1 8.173,2 8.173,3 -0.02,4 2.118,5 5.831,6 4.587,7 4.837,8 22.645,9 -0.105,10 0.681,11 0.309,12 26.791,13 4.105,14 4.304,15 0.094,16 0.029,17 92.917,18 21.604,19 4.798,20 2.233,21 201.121,22 24.546,23 11.383,24 2.187,25 127.591,26 86.72,27 86.72,28 12.021,29 40.7,30 143.353,31 5.595,32 11.348,33 3.84,34 1.86,35 -0.127,36 0.043,37 59.69,38 6.518,39 31.784,40 7.061,41 0.939,42 0.521,43 72.356,44 0.077,45 4,46 72.356,47 159.655,48 4.133,49 3.95,50 3.833,51 4.741,52 5.007,53 3.885,54 3.798,55 4.655,56 4.906,57 3.835,58 3.068,59 3.153,60 1.513,61 1.466,62 1.499,63 14.415,64 15.777,65 2,66 4.523}
{0 CHEMBL524266,1 8.905,2 8.905,3 -0.112,4 1.935,5 6.098,6 3.99,7 4.208,8 12.124,9 -0.007,10 0.706,11 0.384,12 19.391,13 4.793,14 4.799,15 0.113,16 0.112,17 106.573,18 11.562,19 4.852,20 2.135,21 162.974,22 15.809,23 6.07,24 2.077,25 126.409,26 96.69,27 96.69,28 8.332,29 31.775,30 160.434,31 5.527,32 4.639,33 3.599,34 1.622,35 0.015,36 0.044,37 61.61,38 3.338,39 17.495,40 4.515,41 1.402,42 0.709,43 59.955,44 0.056,45 2,46 59.955,47 136.567,48 3.8,49 3.619,50 3.578,51 4.424,52 4.675,53 3.508,54 3.436,55 4.224,56 4.464,57 3.269,58 2.656,59 2.733,60 1.245,61 1.286,62 1.571,63 7.858,64 7.909,65 2.9,66 5.398}
{0 CHEMBL551140,1 10.325,2 10.325,3 -0.006,4 1.948,5 6.532,6 4.457,7 4.623,8 17.695,9 0.173,10 0.702,11 0.429,12 20.994,13 4.713,14 4.907,15 0.122,16 0.127,17 124.3,18 28.095,19 5.003,20 3.322,21 188.513,22 22.245,23 9.307,24 2.105,25 111.239,26 73.05,27 73.05,28 8.511,29 42.15,30 122.133,31 5.826,32 7.2,33 3.596,34 1.654,35 0.203,36 -0.01,37 24.073,38 3.881,39 14.91,40 7.831,41 1.605,42 1.014,43 69.215,44 0.07,45 3,46 69.215,47 156.374,48 3.926,49 3.893,50 3.875,51 4.637,52 4.814,53 3.788,54 3.781,55 4.602,56 4.802,57 3.726,58 2.956,59 3.01,60 1.284,61 1.27,62 1.603,63 10.421,64 8.39,65 10,66 4.523}
{0 CHEMBL565061,1 11.454,2 11.454,3 -0.119,4 1.877,5 6.868,6 4.668,7 4.875,8 20.929,9 -0.011,10 0.715,11 0.328,12 19.648,13 4.723,14 7.434,15 0.099,16 0.135,17 139.619,18 18.107,19 5.334,20 4.469,21 236.154,22 22.136,23 9.032,24 2.036,25 113.913,26 85.59,27 85.59,28 8.877,29 90.638,30 209.049,31 6.36,32 9.304,33 3.872,34 1.83,35 0.031,36 -0.045,37 60.162,38 4.351,39 18.506,40 8.161,41 1.761,42 1.316,43 91.154,44 0.113,45 6,46 91.154,47 190.49,48 4.144,49 4.014,50 4.052,51 4.751,52 4.914,53 3.996,54 4.013,55 4.77,56 4.956,57 3.955,58 3.2,59 3.251,60 1.344,61 1.451,62 1.564,63 8.631,64 9.228,65 6,66 5}
{0 CHEMBL565612,1 10.735,2 10.735,3 0.122,4 2.084,5 6.661,6 5.013,7 5.188,8 29.331,9 0.101,10 0.683,11 0.405,12 30.38,13 4.495,14 4.96,15 0.121,16 0.075,17 83.861,18 23.387,19 5.077,20 4.638,21 247.22,22 24.911,23 11.85,24 2.203,25 124.906,26 97.98,27 97.98,28 13.6,29 42.638,30 209.349,31 6.223,32 13.597,33 3.882,34 1.969,35 0.137,36 -0.043,37 53.143,38 5.62,39 26.568,40 9.731,41 2.036,42 1.601,43 86.261,44 0.05,45 3,46 86.261,47 207.392,48 4.259,49 4.28,50 4.235,51 4.98,52 5.19,53 4.26,54 4.244,55 4.917,56 5.065,57 4.284,58 3.131,59 3.221,60 1.513,61 1.527,62 1.592,63 15.029,64 13.676,65 3.6,66 5.174}
{0 CHEMBL583042,1 9.284,2 9.284,3 -0.13,4 1.889,5 6.212,6 4.763,7 4.959,8 27.21,9 -0.01,10 0.713,11 0.366,12 29.27,13 5.148,14 5.038,15 0.099,16 0.176,17 194.657,18 31.202,19 5.63,20 4.06,21 278.009,22 31.192,23 11.572,24 2.042,25 154.206,26 102.93,27 102.93,28 11.937,29 75.036,30 229.661,31 6.138,32 11.626,33 3.934,34 1.901,35 0.006,36 0.049,37 75.335,38 4.792,39 26.233,40 9.932,41 2.304,42 1.091,43 98.677,44 0.123,45 7,46 98.677,47 225.28,48 4.214,49 4.143,50 4.104,51 4.867,52 5.052,53 4.116,54 4.071,55 4.871,56 5.078,57 4.093,58 3.132,59 3.161,60 1.556,61 1.524,62 1.562,63 11.484,64 11.534,65 3.7,66 5}
{0 CHEMBL593490,1 10.3,2 10.3,3 -0.067,4 2.121,5 6.533,6 4.993,7 5.22,8 33.147,9 0.034,10 0.679,11 0.36,12 30.655,13 5.185,14 4.942,15 0.102,16 0.054,17 86.853,18 9.41,19 5.694,20 4.924,21 311.129,22 33.197,23 16.464,24 2.209,25 120.301,26 105.75,27 105.75,28 16.703,29 91.036,30 275.54,31 6.031,32 15.927,33 3.974,34 1.895,35 0.027,36 0.05,37 96.246,38 6.452,39 27.887,40 12.49,41 1.559,42 1.139,43 90.101,44 0.108,45 7,46 90.101,47 237.024,48 4.332,49 4.32,50 4.234,51 4.991,52 5.203,53 4.295,54 4.209,55 5.032,56 5.247,57 4.259,58 3.357,59 3.426,60 1.593,61 1.621,62 1.537,63 16.683,64 14.685,65 3.3,66 7.301}
{0 CHEMBL597754,1 11.659,2 11.659,3 -0.192,4 1.889,5 7.034,6 5.229,7 5.515,8 46.683,9 0.084,10 0.711,11 0.357,12 51.673,13 4.878,14 6.999,15 0.101,16 0.163,17 144.837,18 57.891,19 5.245,20 2.442,21 346.367,22 47.811,23 21.413,24 2.061,25 187.278,26 142.42,27 150.8,28 20.97,29 24.227,30 175.285,31 6.208,32 21.234,33 3.922,34 1.982,35 0.052,36 -0.127,37 64.52,38 8.714,39 48.943,40 14.026,41 2.432,42 1.41,43 121.619,44 0.067,45 5,46 121.619,47 249.052,48 4.498,49 4.486,50 4.407,51 5.349,52 5.599,53 4.414,54 4.318,55 5.271,56 5.531,57 4.358,58 3.356,59 3.439,60 1.602,61 1.687,62 1.597,63 21.697,64 20.875,65 5.6,66 5}
{0 CHEMBL599224,1 9.298,2 9.298,3 -0.065,4 1.906,5 6.261,6 4.6,7 4.879,8 23.536,9 0.114,10 0.708,11 0.425,12 32.361,13 4.814,14 4.899,15 0.108,16 0.166,17 133.421,18 40.222,19 4.854,20 2.392,21 240.683,22 28.132,23 11.856,24 2.075,25 156.333,26 119.03,27 119.03,28 13.309,29 22.709,30 172.611,31 5.863,32 10.677,33 3.763,34 1.697,35 0.08,36 -0.061,37 77.433,38 5.73,39 28.668,40 7.451,41 1.93,42 0.906,43 81.441,44 0.057,45 3,46 81.441,47 182.727,48 4.17,49 4.086,50 4.017,51 4.919,52 5.181,53 3.972,54 3.89,55 4.775,56 5.038,57 3.82,58 3.111,59 3.206,60 1.513,61 1.508,62 1.596,63 14.074,64 13.036,65 4,66 5}
{0 CHEMBL599428,1 9.668,2 9.668,3 -0.099,4 2,5 6.391,6 4.904,7 5.187,8 31.971,9 0.049,10 0.695,11 0.388,12 33.586,13 4.831,14 4.899,15 0.11,16 0.105,17 133.421,18 41.133,19 5.034,20 3.152,21 275.355,22 32.845,23 15.178,24 2.135,25 156.333,26 119.03,27 119.03,28 13.967,29 25.894,30 214.353,31 6.038,32 15.976,33 3.87,34 1.979,35 0.038,36 -0.02,37 68.608,38 6.392,39 31.442,40 10.506,41 2.121,42 0.92,43 90.685,44 0.066,45 4,46 90.685,47 220.6,48 4.292,49 4.226,50 4.171,51 5.009,52 5.238,53 4.162,54 4.099,55 4.978,56 5.218,57 4.118,58 3.234,59 3.283,60 1.513,61 1.527,62 1.57,63 15.382,64 15.376,65 3.5,66 5}
{0 CHEMBL604712,1 11.543,2 11.543,3 -0.04,4 1.688,5 7.104,6 4.891,7 5.214,8 35.227,9 0.258,10 0.746,11 0.357,12 29.567,13 4.021,14 7.425,15 0.096,16 0.303,17 96.873,18 36.35,19 4.374,20 2.098,21 197.008,22 30.995,23 15.056,24 1.913,25 104.751,26 78.09,27 78.09,28 12.855,29 46.361,30 168.229,31 5.945,32 14.841,33 3.808,34 1.874,35 0.156,36 -0.018,37 89.114,38 5.678,39 25.535,40 10.225,41 2.508,42 1.115,43 84.303,44 0.059,45 3,46 84.303,47 176.514,48 4.119,49 4.049,50 4.002,51 4.857,52 5.069,53 3.992,54 3.938,55 4.9,56 5.151,57 3.995,58 2.937,59 3.009,60 1.417,61 1.308,62 1.676,63 14.809,64 12.06,65 4.1,66 5}
{0 CHEMBL608532,1 13.973,2 13.973,3 0.007,4 2.051,5 7.534,6 5.599,7 5.806,8 61.622,9 0.095,10 0.685,11 0.387,12 53.514,13 4.787,14 5.084,15 0.134,16 0.106,17 114.973,18 37.074,19 5.481,20 5.387,21 339.903,22 55.929,23 27.151,24 2.21,25 136.782,26 94.72,27 94.72,28 25.893,29 31.461,30 171.776,31 6.682,32 28.316,33 3.882,34 2.02,35 0.062,36 0.007,37 58.83,38 8.431,39 44.254,40 21.674,41 4.096,42 3.067,43 106.687,44 0.09,45 7,46 106.687,47 262.784,48 4.498,49 4.779,50 4.759,51 5.533,52 5.702,53 4.842,54 4.811,55 5.578,56 5.75,57 4.844,58 3.405,59 3.462,60 1.74,61 1.704,62 1.686,63 23.095,64 21.199,65 7,66 6.523}
