{
  "data_features": {
    "feature": [
      {
        "data_type": "nominal",
        "index": "0",
        "is_ignore": "false",
        "is_row_identifier": "true",
        "is_target": "false",
        "name": "molecule_id",
        "nominal_value": [
          "CHEMBL106202",
          "CHEMBL1083499",
          "CHEMBL1084908",
          "CHEMBL1088332",
          "CHEMBL109044",
          "CHEMBL110631",
          "CHEMBL111363",
          "CHEMBL1160757",
          "CHEMBL121981",
          "CHEMBL122148",
          "CHEMBL122151",
          "CHEMBL122222",
          "CHEMBL122309",
          "CHEMBL122548",
          "CHEMBL122599",
          "CHEMBL122600",
          "CHEMBL122765",
          "CHEMBL122854",
          "CHEMBL122863",
          "CHEMBL122916",
          "CHEMBL123336",
          "CHEMBL125153",
          "CHEMBL125585",
          "CHEMBL125781",
          "CHEMBL126012",
          "CHEMBL126707",
          "CHEMBL127278",
          "CHEMBL127407",
          "CHEMBL127909",
          "CHEMBL128019",
          "CHEMBL130252",
          "CHEMBL130344",
          "CHEMBL130464",
          "CHEMBL130592",
          "CHEMBL130773",
          "CHEMBL131192",
          "CHEMBL131401",
          "CHEMBL131452",
          "CHEMBL132057",
          "CHEMBL132395",
          "CHEMBL134792",
          "CHEMBL136098",
          "CHEMBL136290",
          "CHEMBL136788",
          "CHEMBL137337",
          "CHEMBL137444",
          "CHEMBL137483",
          "CHEMBL137487",
          "CHEMBL138119",
          "CHEMBL140009",
          "CHEMBL142205",
          "CHEMBL151939",
          "CHEMBL162920",
          "CHEMBL163731",
          "CHEMBL164018",
          "CHEMBL164224",
          "CHEMBL164225",
          "CHEMBL164928",
          "CHEMBL164941",
          "CHEMBL165099",
          "CHEMBL165305",
          "CHEMBL165446",
          "CHEMBL165678",
          "CHEMBL165966",
          "CHEMBL168471",
          "CHEMBL176140",
          "CHEMBL177450",
          "CHEMBL178134",
          "CHEMBL178616",
          "CHEMBL1790570",
          "CHEMBL179270",
          "CHEMBL1797524",
          "CHEMBL1797526",
          "CHEMBL1797527",
          "CHEMBL179938",
          "CHEMBL179983",
          "CHEMBL180104",
          "CHEMBL180105",
          "CHEMBL180857",
          "CHEMBL181265",
          "CHEMBL18767",
          "CHEMBL189165",
          "CHEMBL189166",
          "CHEMBL189597",
          "CHEMBL1923468",
          "CHEMBL192738",
          "CHEMBL193745",
          "CHEMBL194689",
          "CHEMBL195032",
          "CHEMBL195238",
          "CHEMBL195314",
          "CHEMBL196182",
          "CHEMBL197032",
          "CHEMBL197563",
          "CHEMBL198629",
          "CHEMBL202010",
          "CHEMBL202433",
          "CHEMBL202784",
          "CHEMBL202799",
          "CHEMBL202807",
          "CHEMBL202850",
          "CHEMBL203008",
          "CHEMBL203046",
          "CHEMBL203055",
          "CHEMBL203728",
          "CHEMBL203825",
          "CHEMBL203834",
          "CHEMBL204126",
          "CHEMBL204159",
          "CHEMBL204228",
          "CHEMBL204283",
          "CHEMBL204561",
          "CHEMBL204582",
          "CHEMBL204723",
          "CHEMBL205128",
          "CHEMBL205208",
          "CHEMBL205243",
          "CHEMBL205636",
          "CHEMBL205771",
          "CHEMBL205880",
          "CHEMBL206069",
          "CHEMBL206232",
          "CHEMBL206234",
          "CHEMBL206330",
          "CHEMBL206335",
          "CHEMBL206337",
          "CHEMBL206387",
          "CHEMBL206429",
          "CHEMBL206507",
          "CHEMBL206514",
          "CHEMBL206539",
          "CHEMBL206726",
          "CHEMBL207720",
          "CHEMBL209791",
          "CHEMBL211227",
          "CHEMBL211482",
          "CHEMBL213352",
          "CHEMBL214351",
          "CHEMBL214352",
          "CHEMBL222079",
          "CHEMBL230031",
          "CHEMBL230032",
          "CHEMBL230661",
          "CHEMBL230764",
          "CHEMBL2338554",
          "CHEMBL233992",
          "CHEMBL237065",
          "CHEMBL237705",
          "CHEMBL243107",
          "CHEMBL243108",
          "CHEMBL243109",
          "CHEMBL243317",
          "CHEMBL243318",
          "CHEMBL243319",
          "CHEMBL243537",
          "CHEMBL243538",
          "CHEMBL243539",
          "CHEMBL243759",
          "CHEMBL253991",
          "CHEMBL257867",
          "CHEMBL262061",
          "CHEMBL263478",
          "CHEMBL264258",
          "CHEMBL264389",
          "CHEMBL265315",
          "CHEMBL269354",
          "CHEMBL275859",
          "CHEMBL27852",
          "CHEMBL282830",
          "CHEMBL284094",
          "CHEMBL284436",
          "CHEMBL285689",
          "CHEMBL287473",
          "CHEMBL290334",
          "CHEMBL308948",
          "CHEMBL309394",
          "CHEMBL311553",
          "CHEMBL320488",
          "CHEMBL321444",
          "CHEMBL322034",
          "CHEMBL32375",
          "CHEMBL326462",
          "CHEMBL32851",
          "CHEMBL330943",
          "CHEMBL330964",
          "CHEMBL332753",
          "CHEMBL332983",
          "CHEMBL333980",
          "CHEMBL334121",
          "CHEMBL335129",
          "CHEMBL336302",
          "CHEMBL336553",
          "CHEMBL337014",
          "CHEMBL33705",
          "CHEMBL337238",
          "CHEMBL337654",
          "CHEMBL337930",
          "CHEMBL338641",
          "CHEMBL339200",
          "CHEMBL339241",
          "CHEMBL339341",
          "CHEMBL339880",
          "CHEMBL339902",
          "CHEMBL339956",
          "CHEMBL34067",
          "CHEMBL341553",
          "CHEMBL342392",
          "CHEMBL343173",
          "CHEMBL344619",
          "CHEMBL34721",
          "CHEMBL34887",
          "CHEMBL350849",
          "CHEMBL351415",
          "CHEMBL351457",
          "CHEMBL351945",
          "CHEMBL352506",
          "CHEMBL352720",
          "CHEMBL353776",
          "CHEMBL355164",
          "CHEMBL355595",
          "CHEMBL35586",
          "CHEMBL35666",
          "CHEMBL35754",
          "CHEMBL35800",
          "CHEMBL35813",
          "CHEMBL35978",
          "CHEMBL36001",
          "CHEMBL36002",
          "CHEMBL360313",
          "CHEMBL36114",
          "CHEMBL363141",
          "CHEMBL36341",
          "CHEMBL366921",
          "CHEMBL371051",
          "CHEMBL371558",
          "CHEMBL371815",
          "CHEMBL372240",
          "CHEMBL372847",
          "CHEMBL377080",
          "CHEMBL377082",
          "CHEMBL377953",
          "CHEMBL377956",
          "CHEMBL377990",
          "CHEMBL378093",
          "CHEMBL378366",
          "CHEMBL378607",
          "CHEMBL378916",
          "CHEMBL378947",
          "CHEMBL379018",
          "CHEMBL379036",
          "CHEMBL379671",
          "CHEMBL379906",
          "CHEMBL380098",
          "CHEMBL380335",
          "CHEMBL380813",
          "CHEMBL381120",
          "CHEMBL381148",
          "CHEMBL381702",
          "CHEMBL381949",
          "CHEMBL382064",
          "CHEMBL382157",
          "CHEMBL382387",
          "CHEMBL382418",
          "CHEMBL382776",
          "CHEMBL383059",
          "CHEMBL383217",
          "CHEMBL383269",
          "CHEMBL383431",
          "CHEMBL383639",
          "CHEMBL384526",
          "CHEMBL385140",
          "CHEMBL388438",
          "CHEMBL388439",
          "CHEMBL389527",
          "CHEMBL390662",
          "CHEMBL390663",
          "CHEMBL390878",
          "CHEMBL392297",
          "CHEMBL394129",
          "CHEMBL398380",
          "CHEMBL398423",
          "CHEMBL399593",
          "CHEMBL401235",
          "CHEMBL402935",
          "CHEMBL407142",
          "CHEMBL409780",
          "CHEMBL409918",
          "CHEMBL410279",
          "CHEMBL410836",
          "CHEMBL413155",
          "CHEMBL414777",
          "CHEMBL415402",
          "CHEMBL415837",
          "CHEMBL421098",
          "CHEMBL421426",
          "CHEMBL422973",
          "CHEMBL422974",
          "CHEMBL423540",
          "CHEMBL426307",
          "CHEMBL426675",
          "CHEMBL426676",
          "CHEMBL427751",
          "CHEMBL427820",
          "CHEMBL429011",
          "CHEMBL429152",
          "CHEMBL429170",
          "CHEMBL434859",
          "CHEMBL435972",
          "CHEMBL436766",
          "CHEMBL437555",
          "CHEMBL437872",
          "CHEMBL438424",
          "CHEMBL438599",
          "CHEMBL438973",
          "CHEMBL439285",
          "CHEMBL439444",
          "CHEMBL441030",
          "CHEMBL441926",
          "CHEMBL444622",
          "CHEMBL450578",
          "CHEMBL455257",
          "CHEMBL457702",
          "CHEMBL46148",
          "CHEMBL479863",
          "CHEMBL497307",
          "CHEMBL497867",
          "CHEMBL498339",
          "CHEMBL498640",
          "CHEMBL498660",
          "CHEMBL498675",
          "CHEMBL498676",
          "CHEMBL502639",
          "CHEMBL505986",
          "CHEMBL506240",
          "CHEMBL506501",
          "CHEMBL506502",
          "CHEMBL506769",
          "CHEMBL508298",
          "CHEMBL515520",
          "CHEMBL518066",
          "CHEMBL523575",
          "CHEMBL524462",
          "CHEMBL525742",
          "CHEMBL526453",
          "CHEMBL527117",
          "CHEMBL538226",
          "CHEMBL542434",
          "CHEMBL542435",
          "CHEMBL544558",
          "CHEMBL544560",
          "CHEMBL553531",
          "CHEMBL554926",
          "CHEMBL558198",
          "CHEMBL559015",
          "CHEMBL606850",
          "CHEMBL73178",
          "CHEMBL73299",
          "CHEMBL76325",
          "CHEMBL76834",
          "CHEMBL77142",
          "CHEMBL77428",
          "CHEMBL77742",
          "CHEMBL78053",
          "CHEMBL78055",
          "CHEMBL78057",
          "CHEMBL96433"
        ],
        "number_of_missing_values": "0"
      },
      {
        "data_type": "numeric",
        "index": "1",
        "is_ignore": "false",
        "is_row_identifier": "false",
        "is_target": "false",
        "name": "AMW",
        "number_of_missing_values": "0"
      },
      {
        "data_type": "numeric",
        "index": "2",
        "is_ignore": "false",
        "is_row_identifier": "false",
        "is_target": "false",
        "name": "C.",
        "number_of_missing_values": "0"
      },
      {
        "data_type": "numeric",
        "index": "3",
        "is_ignore": "false",
        "is_row_identifier": "false",
        "is_target": "false",
        "name": "H.",
        "number_of_missing_values": "0"
      },
      {
        "data_type": "numeric",
        "index": "4",
        "is_ignore": "false",
        "is_row_identifier": "false",
        "is_target": "false",
        "name": "Me",
        "number_of_missing_values": "0"
      },
      {
        "data_type": "numeric",
        "index": "5",
        "is_ignore": "false",
        "is_row_identifier": "false",
        "is_target": "false",
        "name": "Mi",
        "number_of_missing_values": "0"
      },
      {
        "data_type": "numeric",
        "index": "6",
        "is_ignore": "false",
        "is_row_identifier": "false",
        "is_target": "false",
        "name": "Mp",
        "number_of_missing_values": "0"
      },
      {
        "data_type": "numeric",
        "index": "7",
        "is_ignore": "false",
        "is_row_identifier": "false",
        "is_target": "false",
        "name": "Mv",
        "number_of_missing_values": "0"
      },
      {
        "data_type": "numeric",
        "index": "8",
        "is_ignore": "false",
        "is_row_identifier": "false",
        "is_target": "false",
        "name": "MW",
        "number_of_missing_values": "0"
      },
      {
        "data_type": "numeric",
        "index": "9",
        "is_ignore": "false",
        "is_row_identifier": "false",
        "is_target": "false",
        "name": "N.",
        "number_of_missing_values": "0"
      },
      {
        "data_type": "numeric",
        "index": "10",
        "is_ignore": "false",
        "is_row_identifier": "false",
        "is_target": "false",
        "name": "nAB",
        "number_of_missing_values": "0"
      },
      {
        "data_type": "numeric",
        "index": "11",
        "is_ignore": "false",
        "is_row_identifier": "false",
        "is_target": "false",
        "name": "nAT",
        "number_of_missing_values": "0"
      },
      {
        "data_type": "numeric",
        "index": "12",
        "is_ignore": "false",
        "is_row_identifier": "false",
        "is_target": "false",
        "name": "nB",
        "number_of_missing_values": "0"
      },
      {
        "data_type": "numeric",
        "index": "13",
        "is_ignore": "false",
        "is_row_identifier": "false",
        "is_target": "false",
        "name": "nBM",
        "number_of_missing_values": "0"
      },
      {
        "data_type": "numeric",
        "index": "14",
        "is_ignore": "false",
        "is_row_identifier": "false",
        "is_target": "false",
        "name": "nBO",
        "number_of_missing_values": "0"
      },
      {
        "data_type": "numeric",
        "index": "15",
        "is_ignore": "false",
        "is_row_identifier": "false",
        "is_target": "false",
        "name": "nBR",
        "number_of_missing_values": "0"
      },
      {
        "data_type": "numeric",
        "index": "16",
        "is_ignore": "false",
        "is_row_identifier": "false",
        "is_target": "false",
        "name": "nBT",
        "number_of_missing_values": "0"
      },
      {
        "data_type": "numeric",
        "index": "17",
        "is_ignore": "false",
        "is_row_identifier": "false",
        "is_target": "false",
        "name": "nC",
        "number_of_missing_values": "0"
      },
      {
        "data_type": "numeric",
        "index": "18",
        "is_ignore": "false",
        "is_row_identifier": "false",
        "is_target": "false",
        "name": "nCL",
        "number_of_missing_values": "0"
      },
      {
        "data_type": "numeric",
        "index": "19",
        "is_ignore": "false",
        "is_row_identifier": "false",
        "is_target": "false",
        "name": "nCsp",
        "number_of_missing_values": "0"
      },
      {
        "data_type": "numeric",
        "index": "20",
        "is_ignore": "false",
        "is_row_identifier": "false",
        "is_target": "false",
        "name": "nCsp2",
        "number_of_missing_values": "0"
      },
      {
        "data_type": "numeric",
        "index": "21",
        "is_ignore": "false",
        "is_row_identifier": "false",
        "is_target": "false",
        "name": "nCsp3",
        "number_of_missing_values": "0"
      },
      {
        "data_type": "numeric",
        "index": "22",
        "is_ignore": "false",
        "is_row_identifier": "false",
        "is_target": "false",
        "name": "nDB",
        "number_of_missing_values": "0"
      },
      {
        "data_type": "numeric",
        "index": "23",
        "is_ignore": "false",
        "is_row_identifier": "false",
        "is_target": "false",
        "name": "nF",
        "number_of_missing_values": "0"
      },
      {
        "data_type": "numeric",
        "index": "24",
        "is_ignore": "false",
        "is_row_identifier": "false",
        "is_target": "false",
        "name": "nH",
        "number_of_missing_values": "0"
      },
      {
        "data_type": "numeric",
        "index": "25",
        "is_ignore": "false",
        "is_row_identifier": "false",
        "is_target": "false",
        "name": "nHet",
        "number_of_missing_values": "0"
      },
      {
        "data_type": "numeric",
        "index": "26",
        "is_ignore": "false",
        "is_row_identifier": "false",
        "is_target": "false",
        "name": "nHM",
        "number_of_missing_values": "0"
      },
      {
        "data_type": "numeric",
        "index": "27",
        "is_ignore": "false",
        "is_row_identifier": "false",
        "is_target": "false",
        "name": "nI",
        "number_of_missing_values": "0"
      },
      {
        "data_type": "numeric",
        "index": "28",
        "is_ignore": "false",
        "is_row_identifier": "false",
        "is_target": "false",
        "name": "nN",
        "number_of_missing_values": "0"
      },
      {
        "data_type": "numeric",
        "index": "29",
        "is_ignore": "false",
        "is_row_identifier": "false",
        "is_target": "false",
        "name": "nO",
        "number_of_missing_values": "0"
      },
      {
        "data_type": "numeric",
        "index": "30",
        "is_ignore": "false",
        "is_row_identifier": "false",
        "is_target": "false",
        "name": "nP",
        "number_of_missing_values": "0"
      },
      {
        "data_type": "numeric",
        "index": "31",
        "is_ignore": "false",
        "is_row_identifier": "false",
        "is_target": "false",
        "name": "nS",
        "number_of_missing_values": "0"
      },
      {
        "data_type": "numeric",
        "index": "32",
        "is_ignore": "false",
        "is_row_identifier": "false",
        "is_target": "false",
        "name": "nSK",
        "number_of_missing_values": "0"
      },
      {
        "data_type": "numeric",
        "index": "33",
        "is_ignore": "false",
        "is_row_identifier": "false",
        "is_target": "false",
        "name": "nTB",
        "number_of_missing_values": "0"
      },
      {
        "data_type": "numeric",
        "index": "34",
        "is_ignore": "false",
        "is_row_identifier": "false",
        "is_target": "false",
        "name": "nX",
        "number_of_missing_values": "0"
      },
      {
        "data_type": "numeric",
        "index": "35",
        "is_ignore": "false",
        "is_row_identifier": "false",
        "is_target": "false",
        "name": "O.",
        "number_of_missing_values": "0"
      },
      {
        "data_type": "numeric",
        "index": "36",
        "is_ignore": "false",
        "is_row_identifier": "false",
        "is_target": "false",
        "name": "RBF",
        "number_of_missing_values": "0"
      },
      {
        "data_type": "numeric",
        "index": "37",
        "is_ignore": "false",
        "is_row_identifier": "false",
        "is_target": "false",
        "name": "RBN",
        "number_of_missing_values": "0"
      },
      {
        "data_type": "numeric",
        "index": "38",
        "is_ignore": "false",
        "is_row_identifier": "false",
        "is_target": "false",
        "name": "SCBO",
        "number_of_missing_values": "0"
      },
      {
        "data_type": "numeric",
        "index": "39",
        "is_ignore": "false",
        "is_row_identifier": "false",
        "is_target": "false",
        "name": "Se",
        "number_of_missing_values": "0"
      },
      {
        "data_type": "numeric",
        "index": "40",
        "is_ignore": "false",
        "is_row_identifier": "false",
        "is_target": "false",
        "name": "Si",
        "number_of_missing_values": "0"
      },
      {
        "data_type": "numeric",
        "index": "41",
        "is_ignore": "false",
        "is_row_identifier": "false",
        "is_target": "false",
        "name": "Sp",
        "number_of_missing_values": "0"
      },
      {
        "data_type": "numeric",
        "index": "42",
        "is_ignore": "false",
        "is_row_identifier": "false",
        "is_target": "false",
        "name": "Sv",
        "number_of_missing_values": "0"
      },
      {
        "data_type": "numeric",
        "index": "43",
        "is_ignore": "false",
        "is_row_identifier": "false",
        "is_target": "false",
        "name": "X.",
        "number_of_missing_values": "0"
      },
      {
        "data_type": "numeric",
        "index": "44",
        "is_ignore": "false",
        "is_row_identifier": "false",
        "is_target": "true",
        "name": "pXC50",
        "number_of_missing_values": "0"
      }
    ]
  }
}