{
  "data_set_description": {
    "collection_date": "November 2013",
    "creator": "Dr Jeremy Besnard, Dr Ivan Olier, Dr Noureddin Sadawi, Dr Larisa Soldatova, Dr Crina Grosan, Prof Ross King, Dr Richard Bickerton, Prof Andrew Hopkins and Dr Willem van Hoorn",
    "default_target_attribute": "pXC50",
    "description": "This dataset contains QSAR data (from ChEMBL version 17) showing activity values (unit is pseudo-pCI50) of several compounds on drug target ChEMBL_ID: CHEMBL1795181 (TID: 104261), and it has 30 rows and 43 features (not including molecule IDs and class feature: molecule_id and pXC50). The features represent Basic Molecular Descriptors which were generated from SMILES strings.  Missing value imputation was applied to this dataset (By choosing the Median).",
    "description_version": "1",
    "file_id": "3657618",
    "format": "ARFF",
    "id": "38939",
    "licence": "Public",
    "md5_checksum": "edce3cdc016bba7679e919ae85a2e10e",
    "minio_url": "https://data.openml.org/datasets/0003/38939/dataset_38939.pq",
    "name": "QSAR-DATASET-FOR-DRUG-TARGET-CHEMBL1795181",
    "original_data_url": "https://www.ebi.ac.uk/chembl/target/inspect/CHEMBL1795181",
    "parquet_url": "https://data.openml.org/datasets/0003/38939/dataset_38939.pq",
    "processing_date": "2018-10-04 06:11:06",
    "row_id_attribute": "molecule_id",
    "status": "deactivated",
    "tag": [
      "MetaQSAR",
      "study_13"
    ],
    "upload_date": "2016-07-16T06:04:16",
    "url": "https://api.openml.org/data/v1/download/3657618/QSAR-DATASET-FOR-DRUG-TARGET-CHEMBL1795181.arff",
    "version": "12",
    "visibility": "public"
  }
}