"molecule_id","AMW","C.","H.","Me","Mi","Mp","Mv","MW","N.","nAB","nAT","nB","nBM","nBO","nBR","nBT","nC","nCL","nCsp","nCsp2","nCsp3","nDB","nF","nH","nHet","nHM","nI","nN","nO","nP","nS","nSK","nTB","nX","O.","RBF","RBN","SCBO","Se","Si","Sp","Sv","X.","pXC50"
{1 8.395,2 45.2,3 38.7,4 1.03,5 1.114,6 0.672,7 0.669,8 260.26,10 10,11 31,13 12,14 21,16 33,17 14,20 11,21 3,22 2,24 12,25 5,29 5,32 19,35 16.1,36 0.091,37 3,38 28,39 31.938,40 34.538,41 20.841,42 20.735,44 4.553}
{0 CHEMBL141680,1 8.142,2 46.7,3 40,4 1.02,5 1.111,6 0.68,7 0.667,8 244.26,10 10,11 30,13 12,14 20,16 32,17 14,20 11,21 3,22 2,24 12,25 4,29 4,32 18,35 13.3,36 0.063,37 2,38 27,39 30.611,40 33.329,41 20.386,42 20.02,44 4.046}
{0 CHEMBL190756,1 6.776,2 38.3,3 50,4 0.992,5 1.136,6 0.644,7 0.603,8 406.59,9 10,10 16,11 60,13 18,14 32,16 62,17 23,20 16,21 7,22 2,24 30,25 7,28 6,29 1,32 30,35 1.7,36 0.161,37 10,38 42,39 59.541,40 68.182,41 38.625,42 36.165,44 4.125}
{0 CHEMBL201466,1 7.225,2 43.1,3 47.1,4 1.005,5 1.118,6 0.655,7 0.625,8 368.46,10 16,11 51,13 17,14 29,16 53,17 22,20 15,21 7,22 1,24 24,25 5,29 5,32 27,35 9.8,36 0.113,37 6,38 38,39 51.24,40 57.029,41 33.409,42 31.896,44 5.237}
{0 CHEMBL201671,1 7.284,2 40,3 47.5,4 1.013,5 1.125,6 0.638,7 0.614,8 582.7,10 20,11 80,13 22,14 45,16 83,17 32,20 18,21 14,22 2,24 38,25 10,29 10,32 42,35 12.5,36 0.205,37 17,38 57,39 81.061,40 89.983,41 51.012,42 49.157,44 6.097}
{0 CHEMBL201808,1 8.166,2 49,3 39.2,4 1.016,5 1.106,6 0.693,7 0.678,8 416.45,10 22,11 51,13 24,14 34,16 54,17 25,20 22,21 3,22 2,24 20,25 6,29 6,32 31,35 11.8,36 0.13,37 7,38 47,39 51.8,40 56.408,41 35.341,42 34.557,44 6.301}
{0 CHEMBL201915,1 7.927,2 49,3 40.8,4 1.01,5 1.106,6 0.692,7 0.67,8 388.44,10 22,11 49,13 23,14 32,16 52,17 24,20 21,21 3,22 1,24 20,25 5,29 5,32 29,35 10.2,36 0.115,37 6,38 44,39 49.473,40 54.199,41 33.887,42 32.842,44 5.921}
{0 CHEMBL202082,1 7.551,2 40,3 45.7,4 1.02,5 1.125,6 0.639,7 0.623,8 264.3,10 10,11 35,13 11,14 20,16 36,17 14,20 9,21 5,22 1,24 16,25 5,29 5,32 19,35 14.3,36 0.139,37 5,38 26,39 35.705,40 39.369,41 22.364,42 21.788,44 5.097}
{0 CHEMBL202113,1 8.892,2 46.2,3 38.5,4 1.026,5 1.111,6 0.698,7 0.682,8 346.78,10 16,11 39,13 17,14 26,16 41,17 18,18 1,20 15,21 3,22 1,24 15,25 6,26 1,29 5,32 24,34 1,35 12.8,36 0.122,37 5,38 35,39 40.029,40 43.313,41 27.222,42 26.616,43 2.6,44 5.854}
{0 CHEMBL202344,1 8.47,2 46.2,3 38.5,4 1.031,5 1.121,6 0.674,7 0.671,8 330.33,10 16,11 39,13 17,14 26,16 41,17 18,20 15,21 3,22 1,23 1,24 15,25 6,29 5,32 24,34 1,35 12.8,36 0.122,37 5,38 35,39 40.218,40 43.708,41 26.301,42 26.172,43 2.6,44 6.155}
{0 CHEMBL202422,1 7.821,2 40.6,3 43.8,4 1.026,5 1.124,6 0.644,7 0.633,8 250.27,10 10,11 32,13 11,14 19,16 33,17 13,20 9,21 4,22 1,24 14,25 5,29 5,32 18,35 15.6,36 0.121,37 4,38 25,39 32.822,40 35.953,41 20.602,42 20.262,44 5}
{0 CHEMBL202475,1 8.892,2 46.2,3 38.5,4 1.026,5 1.111,6 0.698,7 0.682,8 346.78,10 16,11 39,13 17,14 26,16 41,17 18,18 1,20 15,21 3,22 1,24 15,25 6,26 1,29 5,32 24,34 1,35 12.8,36 0.122,37 5,38 35,39 40.029,40 43.313,41 27.222,42 26.616,43 2.6,44 6.377}
{0 CHEMBL202480,1 8.485,2 45.2,3 38.1,4 1.032,5 1.114,6 0.673,7 0.672,8 356.35,10 16,11 42,13 18,14 28,16 44,17 19,20 16,21 3,22 2,24 16,25 7,29 7,32 26,35 16.7,36 0.136,37 6,38 38,39 43.36,40 46.787,41 28.273,42 28.218,44 5}
{0 CHEMBL202532,1 8.716,2 43.9,3 36.6,4 1.038,5 1.119,6 0.671,7 0.676,8 357.34,9 2.4,10 16,11 41,13 19,14 28,16 43,17 18,20 15,21 3,22 3,24 15,25 8,28 1,29 7,32 26,35 17.1,36 0.14,37 6,38 39,39 42.578,40 45.871,41 27.517,42 27.713,44 5.854}
{0 CHEMBL202572,1 9.217,2 44.2,3 34.9,4 1.057,5 1.14,6 0.66,7 0.679,8 396.34,10 16,11 43,13 17,14 30,16 45,17 19,20 15,21 4,22 1,23 3,24 15,25 9,29 6,32 28,34 3,35 14,36 0.133,37 6,38 39,39 45.454,40 49.012,41 28.392,42 29.18,43 7,44 6.347}
{0 CHEMBL202574,1 7.771,2 45.2,3 42.9,4 1.014,5 1.114,6 0.67,7 0.65,8 326.37,10 16,11 42,13 17,14 26,16 44,17 19,20 15,21 4,22 1,24 18,25 5,29 5,32 24,35 11.9,36 0.114,37 5,38 35,39 42.589,40 46.784,41 28.125,42 27.315,44 6}
{0 CHEMBL202692,1 8.053,2 48.9,3 40,4 1.013,5 1.106,6 0.692,7 0.674,8 362.4,10 21,11 45,13 22,14 30,16 48,17 22,20 19,21 3,22 1,24 18,25 5,29 5,32 27,35 11.1,36 0.104,37 5,38 41.5,39 45.589,40 49.784,41 31.125,42 30.315,44 5.097}
{0 CHEMBL202906,1 8.166,2 49,3 39.2,4 1.016,5 1.106,6 0.693,7 0.678,8 416.45,10 22,11 51,13 24,14 34,16 54,17 25,20 22,21 3,22 2,24 20,25 6,29 6,32 31,35 11.8,36 0.13,37 7,38 47,39 51.8,40 56.408,41 35.341,42 34.557,44 6.301}
{0 CHEMBL203541,1 9.217,2 44.2,3 34.9,4 1.057,5 1.14,6 0.66,7 0.679,8 396.34,10 16,11 43,13 17,14 30,16 45,17 19,20 15,21 4,22 1,23 3,24 15,25 9,29 6,32 28,34 3,35 14,36 0.133,37 6,38 39,39 45.454,40 49.012,41 28.392,42 29.18,43 7,44 6.222}
{0 CHEMBL203647,1 8.716,2 43.9,3 36.6,4 1.038,5 1.119,6 0.671,7 0.676,8 357.34,9 2.4,10 16,11 41,13 19,14 28,16 43,17 18,20 15,21 3,22 3,24 15,25 8,28 1,29 7,32 26,35 17.1,36 0.14,37 6,38 39,39 42.578,40 45.871,41 27.517,42 27.713,44 6.222}
{0 CHEMBL203798,1 8.009,2 46.2,3 41,4 1.018,5 1.112,6 0.676,7 0.661,8 312.34,10 16,11 39,13 17,14 25,16 41,17 18,20 15,21 3,22 1,24 16,25 5,29 5,32 23,35 12.8,36 0.122,37 5,38 34,39 39.705,40 43.369,41 26.364,42 25.788,44 5.602}
{0 CHEMBL203852,1 8.892,2 46.2,3 38.5,4 1.026,5 1.111,6 0.698,7 0.682,8 346.78,10 16,11 39,13 17,14 26,16 41,17 18,18 1,20 15,21 3,22 1,24 15,25 6,26 1,29 5,32 24,34 1,35 12.8,36 0.122,37 5,38 35,39 40.029,40 43.313,41 27.222,42 26.616,43 2.6,44 6.222}
{0 CHEMBL203909,1 7.927,2 49,3 40.8,4 1.01,5 1.106,6 0.692,7 0.67,8 388.44,10 22,11 49,13 23,14 32,16 52,17 24,20 21,21 3,22 1,24 20,25 5,29 5,32 29,35 10.2,36 0.135,37 7,38 44,39 49.473,40 54.199,41 33.887,42 32.842,44 5.921}
{0 CHEMBL203927,1 8.286,2 47.2,3 38.9,4 1.023,5 1.11,6 0.683,7 0.674,8 298.31,10 16,11 36,13 17,14 24,16 38,17 17,20 15,21 2,22 1,24 14,25 5,29 5,32 22,35 13.9,36 0.105,37 4,38 33,39 36.822,40 39.953,41 24.602,42 24.262,44 5.398}
{0 CHEMBL204088,1 8.47,2 46.2,3 38.5,4 1.031,5 1.121,6 0.674,7 0.671,8 330.33,10 16,11 39,13 17,14 26,16 41,17 18,20 15,21 3,22 1,23 1,24 15,25 6,29 5,32 24,34 1,35 12.8,36 0.122,37 5,38 35,39 40.218,40 43.708,41 26.301,42 26.172,43 2.6,44 6.125}
{0 CHEMBL204111,1 7.962,2 44.2,3 41.9,4 1.021,5 1.116,6 0.665,7 0.652,8 342.37,10 16,11 43,13 17,14 27,16 45,17 19,20 15,21 4,22 1,24 18,25 6,29 6,32 25,35 14,36 0.133,37 6,38 36,39 43.916,40 47.993,41 28.58,42 28.03,44 6.167}
{0 CHEMBL204255,1 8.053,2 48.9,3 40,4 1.013,5 1.106,6 0.692,7 0.674,8 362.4,10 21,11 45,13 22,14 30,16 48,17 22,20 19,21 3,22 1,24 18,25 5,29 5,32 27,35 11.1,36 0.104,37 5,38 41.5,39 45.589,40 49.784,41 31.125,42 30.315,44 5.301}
{0 CHEMBL204256,1 8.47,2 46.2,3 38.5,4 1.031,5 1.121,6 0.674,7 0.671,8 330.33,10 16,11 39,13 17,14 26,16 41,17 18,20 15,21 3,22 1,23 1,24 15,25 6,29 5,32 24,34 1,35 12.8,36 0.122,37 5,38 35,39 40.218,40 43.708,41 26.301,42 26.172,43 2.6,44 5.77}
{0 CHEMBL204437,1 8.054,2 45.5,3 40.9,4 1.021,5 1.113,6 0.672,7 0.66,8 354.38,10 16,11 44,13 18,14 28,16 46,17 20,20 17,21 3,22 2,24 18,25 6,29 6,32 26,35 13.6,36 0.13,37 6,38 38,39 44.916,40 48.993,41 29.58,42 29.03,44 5.602}
{0 CHEMBL204485,1 7.771,2 45.2,3 42.9,4 1.014,5 1.114,6 0.67,7 0.65,8 326.37,10 16,11 42,13 17,14 26,16 44,17 19,20 15,21 4,22 1,24 18,25 5,29 5,32 24,35 11.9,36 0.114,37 5,38 35,39 42.589,40 46.784,41 28.125,42 27.315,44 5.721}
{0 CHEMBL204492,1 7.927,2 49,3 40.8,4 1.01,5 1.106,6 0.692,7 0.67,8 388.44,10 22,11 49,13 23,14 32,16 52,17 24,20 21,21 3,22 1,24 20,25 5,29 5,32 29,35 10.2,36 0.115,37 6,38 44,39 49.473,40 54.199,41 33.887,42 32.842,44 6.046}
{0 CHEMBL204545,1 7.896,2 47.2,3 41.5,4 1.013,5 1.11,6 0.681,7 0.662,8 418.47,10 22,11 53,13 23,14 34,16 56,17 25,20 21,21 4,22 1,24 22,25 6,29 6,32 31,35 11.3,36 0.143,37 8,38 46,39 53.683,40 58.824,41 36.102,42 35.084,44 5.201}
{0 CHEMBL204695,1 7.384,2 43.8,3 45.8,4 1.007,5 1.117,6 0.659,7 0.633,8 354.43,10 16,11 48,13 17,14 28,16 50,17 21,20 15,21 6,22 1,24 22,25 5,29 5,32 26,35 10.4,36 0.12,37 6,38 37,39 48.356,40 53.614,41 31.648,42 30.369,44 6.155}
{0 CHEMBL204803,1 7.771,2 45.2,3 42.9,4 1.014,5 1.114,6 0.67,7 0.65,8 326.37,10 16,11 42,13 17,14 26,16 44,17 19,20 15,21 4,22 1,24 18,25 5,29 5,32 24,35 11.9,36 0.114,37 5,38 35,39 42.589,40 46.784,41 28.125,42 27.315,44 5.699}
{0 CHEMBL205020,1 10.032,2 46.2,3 38.5,4 1.024,5 1.108,6 0.711,7 0.688,8 391.23,10 16,11 39,13 17,14 26,15 1,16 41,17 18,20 15,21 3,22 1,24 15,25 6,26 1,29 5,32 24,34 1,35 12.8,36 0.122,37 5,38 35,39 39.934,40 43.21,41 27.716,42 26.814,43 2.6,44 6.301}
{0 CHEMBL205069,1 7.551,2 40,3 45.7,4 1.02,5 1.125,6 0.639,7 0.623,8 264.3,10 10,11 35,13 11,14 20,16 36,17 14,20 9,21 5,22 1,24 16,25 5,29 5,32 19,35 14.3,36 0.139,37 5,38 26,39 35.705,40 39.369,41 22.364,42 21.788,44 5.222}
{0 CHEMBL23022,1 7.009,2 41,3 48.7,4 1.001,5 1.125,6 0.647,7 0.613,8 273.36,9 2.6,10 6,11 39,13 8,14 22,16 41,17 16,20 9,21 7,22 2,24 19,25 4,28 1,29 3,32 20,35 7.7,36 0.024,37 1,38 27,39 39.036,40 43.863,41 25.222,42 23.907,44 4.745}
{0 CHEMBL277417,1 7.334,2 43.2,3 45.9,4 1.004,5 1.12,6 0.661,7 0.632,8 271.34,9 2.7,10 11,11 37,13 12,14 22,16 39,17 16,20 11,21 5,22 1,24 17,25 4,28 1,29 3,32 20,35 8.1,36 0.051,37 2,38 28.5,39 37.153,40 41.448,41 24.46,42 23.38,44 5.301}
{0 CHEMBL278779,1 8.103,2 43.8,3 40.6,4 1.022,5 1.12,6 0.669,7 0.658,8 259.28,9 3.1,10 15,11 32,13 15,14 21,16 34,17 14,20 11,21 3,24 13,25 5,28 1,29 4,32 19,35 12.5,36 0.088,37 3,38 28.5,39 32.713,40 35.827,41 21.392,42 21.041,44 4.31}
{0 CHEMBL281622,1 6.478,2 44.7,3 51.1,4 0.977,5 1.118,6 0.668,7 0.614,8 304.47,9 4.3,10 12,11 47,13 14,14 25,16 49,17 21,20 15,21 6,22 2,24 24,25 2,28 2,32 23,36 0.122,37 6,38 33,39 45.923,40 52.564,41 31.387,42 28.838,44 6.638}
{0 CHEMBL282441,1 7.334,2 43.2,3 45.9,4 1.004,5 1.12,6 0.661,7 0.632,8 271.34,9 2.7,10 6,11 37,13 9,14 22,16 39,17 16,20 11,21 5,22 3,24 17,25 4,28 1,29 3,32 20,35 8.1,36 0.026,37 1,38 28,39 37.153,40 41.448,41 24.46,42 23.38,44 5}
{0 CHEMBL342911,1 8.067,2 44.1,3 41.2,4 1.024,5 1.116,6 0.665,7 0.655,8 274.29,10 10,11 34,13 12,14 22,16 36,17 15,20 11,21 4,22 2,24 14,25 5,29 5,32 20,35 14.7,36 0.111,37 4,38 29,39 34.822,40 37.953,41 22.602,42 22.262,44 4.553}
{0 CHEMBL373068,1 9.056,2 45.2,3 35.7,4 1.051,5 1.138,6 0.665,7 0.678,8 380.34,10 16,11 42,13 17,14 29,16 44,17 19,20 15,21 4,22 1,23 3,24 15,25 8,29 5,32 27,34 3,35 11.9,36 0.114,37 5,38 38,39 44.127,40 47.803,41 27.938,42 28.465,43 7.1,44 6.377}
{0 CHEMBL379468,1 8.892,2 46.2,3 38.5,4 1.026,5 1.111,6 0.698,7 0.682,8 346.78,10 16,11 39,13 17,14 26,16 41,17 18,18 1,20 15,21 3,22 1,24 15,25 6,26 1,29 5,32 24,34 1,35 12.8,36 0.122,37 5,38 35,39 40.029,40 43.313,41 27.222,42 26.616,43 2.6,44 5.921}
{0 CHEMBL380723,1 7.927,2 49,3 40.8,4 1.01,5 1.106,6 0.692,7 0.67,8 388.44,10 22,11 49,13 23,14 32,16 52,17 24,20 21,21 3,22 1,24 20,25 5,29 5,32 29,35 10.2,36 0.115,37 6,38 44,39 49.473,40 54.199,41 33.887,42 32.842,44 5.699}
{0 CHEMBL380826,1 7.927,2 49,3 40.8,4 1.01,5 1.106,6 0.692,7 0.67,8 388.44,10 22,11 49,13 23,14 32,16 52,17 24,20 21,21 3,22 1,24 20,25 5,29 5,32 29,35 10.2,36 0.115,37 6,38 44,39 49.473,40 54.199,41 33.887,42 32.842,44 5.959}
{0 CHEMBL381150,1 8.47,2 46.2,3 38.5,4 1.031,5 1.121,6 0.674,7 0.671,8 330.33,10 16,11 39,13 17,14 26,16 41,17 18,20 15,21 3,22 1,23 1,24 15,25 6,29 5,32 24,34 1,35 12.8,36 0.122,37 5,38 35,39 40.218,40 43.708,41 26.301,42 26.172,43 2.6,44 5.602}
{0 CHEMBL381476,1 7.225,2 43.1,3 47.1,4 1.005,5 1.118,6 0.655,7 0.625,8 368.46,10 16,11 51,13 17,14 29,16 53,17 22,20 15,21 7,22 1,24 24,25 5,29 5,32 27,35 9.8,36 0.113,37 6,38 38,39 51.24,40 57.029,41 33.409,42 31.896,44 5.824}
{0 CHEMBL381818,1 7.821,2 40.6,3 43.8,4 1.026,5 1.124,6 0.644,7 0.633,8 250.27,10 10,11 32,13 11,14 19,16 33,17 13,20 9,21 4,22 1,24 14,25 5,29 5,32 18,35 15.6,36 0.121,37 4,38 25,39 32.822,40 35.953,41 20.602,42 20.262,44 5.155}
{0 CHEMBL381841,1 9.056,2 45.2,3 35.7,4 1.051,5 1.138,6 0.665,7 0.678,8 380.34,10 16,11 42,13 17,14 29,16 44,17 19,20 15,21 4,22 1,23 3,24 15,25 8,29 5,32 27,34 3,35 11.9,36 0.114,37 5,38 38,39 44.127,40 47.803,41 27.938,42 28.465,43 7.1,44 6.292}
{0 CHEMBL381920,1 8.009,2 46.2,3 41,4 1.018,5 1.112,6 0.676,7 0.661,8 312.34,10 16,11 39,13 17,14 25,16 41,17 18,20 15,21 3,22 1,24 16,25 5,29 5,32 23,35 12.8,36 0.122,37 5,38 34,39 39.705,40 43.369,41 26.364,42 25.788,44 5.921}
{0 CHEMBL382099,1 7.896,2 47.2,3 41.5,4 1.013,5 1.11,6 0.681,7 0.662,8 418.47,10 22,11 53,13 23,14 34,16 56,17 25,20 21,21 4,22 1,24 22,25 6,29 6,32 31,35 11.3,36 0.143,37 8,38 46,39 53.683,40 58.824,41 36.102,42 35.084,44 5.056}
{0 CHEMBL382154,1 8.892,2 46.2,3 38.5,4 1.026,5 1.111,6 0.698,7 0.682,8 346.78,10 16,11 39,13 17,14 26,16 41,17 18,18 1,20 15,21 3,22 1,24 15,25 6,26 1,29 5,32 24,34 1,35 12.8,36 0.122,37 5,38 35,39 40.029,40 43.313,41 27.222,42 26.616,43 2.6,44 6.319}
{0 CHEMBL382455,1 9.217,2 44.2,3 34.9,4 1.057,5 1.14,6 0.66,7 0.679,8 396.34,10 16,11 43,13 17,14 30,16 45,17 19,20 15,21 4,22 1,23 3,24 15,25 9,29 6,32 28,34 3,35 14,36 0.133,37 6,38 39,39 45.454,40 49.012,41 28.392,42 29.18,43 7,44 5.745}
{0 CHEMBL382657,1 8.053,2 48.9,3 40,4 1.013,5 1.106,6 0.692,7 0.674,8 362.4,10 21,11 45,13 22,14 30,16 48,17 22,20 19,21 3,22 1,24 18,25 5,29 5,32 27,35 11.1,36 0.104,37 5,38 41.5,39 45.589,40 49.784,41 31.125,42 30.315,44 5.301}
{0 CHEMBL382901,1 8.286,2 47.2,3 38.9,4 1.023,5 1.11,6 0.683,7 0.674,8 298.31,10 16,11 36,13 17,14 24,16 38,17 17,20 15,21 2,22 1,24 14,25 5,29 5,32 22,35 13.9,36 0.105,37 4,38 33,39 36.822,40 39.953,41 24.602,42 24.262,44 5.523}
{0 CHEMBL383465,1 7.771,2 45.2,3 42.9,4 1.014,5 1.114,6 0.67,7 0.65,8 326.37,10 16,11 42,13 17,14 26,16 44,17 19,20 15,21 4,22 1,24 18,25 5,29 5,32 24,35 11.9,36 0.114,37 5,38 35,39 42.589,40 46.784,41 28.125,42 27.315,44 5.921}
{0 CHEMBL424852,1 8.47,2 46.2,3 38.5,4 1.031,5 1.121,6 0.674,7 0.671,8 330.33,10 16,11 39,13 17,14 26,16 41,17 18,20 15,21 3,22 1,23 1,24 15,25 6,29 5,32 24,34 1,35 12.8,36 0.122,37 5,38 35,39 40.218,40 43.708,41 26.301,42 26.172,43 2.6,44 5.921}
{0 CHEMBL425400,1 7.962,2 44.2,3 41.9,4 1.021,5 1.116,6 0.665,7 0.652,8 342.37,10 16,11 43,13 17,14 27,16 45,17 19,20 15,21 4,22 1,24 18,25 6,29 6,32 25,35 14,36 0.133,37 6,38 36,39 43.916,40 47.993,41 28.58,42 28.03,44 5.824}
{0 CHEMBL425404,1 7.551,2 40,3 45.7,4 1.02,5 1.125,6 0.639,7 0.623,8 264.3,10 10,11 35,13 11,14 20,16 36,17 14,20 9,21 5,22 1,24 16,25 5,29 5,32 19,35 14.3,36 0.139,37 5,38 26,39 35.705,40 39.369,41 22.364,42 21.788,44 5.301}
{0 CHEMBL426482,1 10.032,2 46.2,3 38.5,4 1.024,5 1.108,6 0.711,7 0.688,8 391.23,10 16,11 39,13 17,14 26,15 1,16 41,17 18,20 15,21 3,22 1,24 15,25 6,26 1,29 5,32 24,34 1,35 12.8,36 0.122,37 5,38 35,39 39.934,40 43.21,41 27.716,42 26.814,43 2.6,44 6.398}
{0 CHEMBL426668,1 8.892,2 46.2,3 38.5,4 1.026,5 1.111,6 0.698,7 0.682,8 346.78,10 16,11 39,13 17,14 26,16 41,17 18,18 1,20 15,21 3,22 1,24 15,25 6,26 1,29 5,32 24,34 1,35 12.8,36 0.122,37 5,38 35,39 40.029,40 43.313,41 27.222,42 26.616,43 2.6,44 6.155}
{0 CHEMBL426839,1 7.384,2 43.8,3 45.8,4 1.007,5 1.117,6 0.659,7 0.633,8 354.43,10 16,11 48,13 17,14 28,16 50,17 21,20 15,21 6,22 1,24 22,25 5,29 5,32 26,35 10.4,36 0.12,37 6,38 37,39 48.356,40 53.614,41 31.648,42 30.369,44 6}
{0 CHEMBL438254,1 8.47,2 46.2,3 38.5,4 1.031,5 1.121,6 0.674,7 0.671,8 330.33,10 16,11 39,13 17,14 26,16 41,17 18,20 15,21 3,22 1,23 1,24 15,25 6,29 5,32 24,34 1,35 12.8,36 0.122,37 5,38 35,39 40.218,40 43.708,41 26.301,42 26.172,43 2.6,44 6}
{0 CHEMBL440219,1 9.217,2 44.2,3 34.9,4 1.057,5 1.14,6 0.66,7 0.679,8 396.34,10 16,11 43,13 17,14 30,16 45,17 19,20 15,21 4,22 1,23 3,24 15,25 9,29 6,32 28,34 3,35 14,36 0.133,37 6,38 39,39 45.454,40 49.012,41 28.392,42 29.18,43 7,44 6.26}
{0 CHEMBL78293,1 8.146,2 41.4,3 41.4,4 1.032,5 1.122,6 0.65,7 0.646,8 236.24,10 10,11 29,13 11,14 18,16 30,17 12,20 9,21 3,22 1,24 12,25 5,29 5,32 17,35 17.2,36 0.1,37 3,38 24,39 29.938,40 32.538,41 18.841,42 18.735,44 4.347}
{0 CHEMBL9653,1 6.413,2 43.3,3 52.2,4 0.982,5 1.119,6 0.655,7 0.603,8 429.65,9 1.5,10 18,11 67,13 18,14 35,16 70,17 29,20 18,21 11,24 35,25 3,28 1,29 2,32 32,35 3,36 0.143,37 10,38 44,39 65.778,40 74.976,41 43.858,42 40.407,44 6.553}
